   3   1
   4   1
   5   1
   6   1
   7   1
   8   1
   9   1
  10   1
  11   1
  12   1
  13   1
  16   1
  17   1
  18   1
  19   1
  21   1
  22   1
  23   1
  26   1
  27   1
  28   1
  29   1
  30   1
  31   1
  32   1
  33   1
  34   1
  35   1
  36   1
  37   1
  38   1
  39   1
  40   1
  41   1
  42   1
  43   1
  44   1
  46   1
  47   1
  48   1
  49   1
  50   1
  51   1
  52   1
  53   1
  54   1
  55   1
  56   1
  57   1
  58   1
  59   1
  60   1
  61   1
  62   1
  63   1
  64   1
  65   1
  67   1
  68   1
  69   1
  70   1
  71   1
  72   1
  73   1
  74   1
  76   1
  77   1
  78   1
  79   1
  80   1
  81   1
  82   1
  83   1
  84   1
  85   1
  86   1
  87   1
  88   1
  89   1
  90   1
  91   1
  92   1
  93   1
  94   1
  95   1
  96   1
  97   1
  98   1
  99   1
 100   1
 101   1
 102   1
 103   1
 104   1
 105   1
 106   1
 107   1
 108   1
 109   1
 110   1
 111   1
 112   1
 113   1
 114   1
 115   1
 116   1
 118   1
 119   1
 120   1
 121   1
 122   1
 123   1
 124   1
 125   1
 126   1
 129   1
 130   1
 132   1
 133   1
 134   1
 135   1
 136   1
 137   1
 138   1
 139   1
 140   1
 141   1
 142   1
 143   1
 144   1
 145   1
 146   1
 147   1
 148   1
 149   1
 150   1
 151   1
 152   1
 153   1
 154   1
 155   1
 156   1
 157   1
 158   1
 159   1
 160   1
 161   1
 162   1
 163   1
 164   1
 165   1
 166   1
 167   1
 168   1
 169   1
 170   1
 171   1
 172   1
 173   1
 174   1
 175   1
 176   1
 177   1
 178   1
 179   1
 180   1
 181   1
 182   1
 183   1
 184   1
 185   1
 186   1
 187   1
 188   1
 189   1
 190   1
 191   1
 192   1
 193   1
 194   1
 195   1
 196   1
 197   1
 198   1
 199   1
 200   1
 201   1
 202   1
 203   1
 204   1
 205   1
 206   1
 207   1
 208   1
 209   1
 210   1
 211   1
 212   1
 213   1
 214   1
 215   1
 216   1
 217   1
 218   1
 219   1
 220   1
 221   1
 222   1
 223   1
 224   1
 225   1
 226   1
 227   1
 228   1
 229   1
 230   1
 231   1
 232   1
 233   1
 234   1
 235   1
 236   1
 237   1
 238   1
 239   1
 240   1
 241   1
 242   1
 243   1
 244   1
 245   1
 246   1
 247   1
 248   1
 249   1
 250   1
 251   1
 252   1
 253   1
 254   1
 255   1
 256   1
 257   1
 258   1
 259   1
 260   1
 262   1
 263   1
 265   1
 266   1
 267   1
 269   1
 271   1
 272   1
 273   1
 274   1
 276   1
 277   1
 278   1
 279   1
 280   1
 281   1
 282   1
 283   1
 284   1
 285   1
 286   1
 287   1
 288   1
 289   1
 290   1
 291   1
 292   1
 293   1
 294   1
 295   1
 296   1
 297   1
 298   1
 299   1
 300   1
 301   1
 302   1
 303   1
 304   1
 305   1
 306   1
 307   1
 308   1
 309   1
 310   1
 311   1
 312   1
 313   1
 314   1
 315   1
 316   1
 317   1
 318   1
 319   1
 320   1
 321   1
 322   1
 323   1
 324   1
 325   1
 326   1
 327   1
 328   1
 329   1
 330   1
 331   1
 332   1
 333   1
 334   1
 335   1
 336   1
 337   1
 338   1
 339   1
 340   1
 341   1
 342   1
 343   1
 344   1
 345   1
 346   1
 347   1
 348   1
 349   1
 350   1
 351   1
 352   1
 353   1
 354   1
 355   1
 356   1
 357   1
 358   1
 359   1
 360   1
 361   1
 362   1
 363   1
 364   1
 365   1
 366   1
 367   1
 368   1
 369   1
 370   1
 371   1
 372   1
 374   1
 375   1
 376   1
 377   1
 378   1
 379   1
 380   1
 381   1
 382   1
 383   1
 384   1
 385   1
 386   1
 387   1
 388   1
 389   1
 390   1
 391   1
 392   1
 393   1
 394   1
 395   1
 396   1
 397   1
 398   1
 399   1
 400   1
 401   1
 402   1
 403   1
 404   1
 405   1
 406   1
 407   1
 408   1
 409   1
 410   1
 411   1
 412   1
 413   1
 414   1
 415   1
 416   1
 417   1
 418   1
 419   1
 420   1
 421   1
 422   1
 423   1
 424   1
 425   1
 426   1
 427   1
 428   1
 429   1
 430   1
 431   1
 432   1
 433   1
 434   1
 435   1
 436   1
 437   1
 438   1
 439   1
 440   1
 441   1
 442   1
 443   1
 444   1
 445   1
 446   1
 447   1
 448   1
 449   1
 450   1
 451   1
 452   1
 453   1
 454   1
 455   1
 456   1
 457   1
 458   1
 459   1
 460   1
 461   1
 462   1
 463   1
 464   1
 465   1
 466   1
 467   1
 468   1
 469   1
 470   1
 471   1
 472   1
 473   1
 474   1
 475   1
 476   1
 477   1
 478   1
 479   1
 480   1
 481   1
 482   1
 483   1
 484   1
 485   1
 486   1
 487   1
 488   1
 489   1
 490   1
 491   1
 492   1
 493   1
 494   1
 495   1
 496   1
 497   1
 498   1
 499   1
 500   1
   1   2
   3   2
   4   2
   5   2
   6   2
   7   2
   8   2
   9   2
  10   2
  11   2
  12   2
  13   2
  22   2
  23   2
  28   2
  29   2
  30   2
  33   2
  34   2
  35   2
  36   2
  37   2
  39   2
  40   2
  41   2
  42   2
  43   2
  44   2
  46   2
  47   2
  48   2
  49   2
  50   2
  51   2
  52   2
  53   2
  54   2
  55   2
  56   2
  57   2
  58   2
  59   2
  60   2
  61   2
  62   2
  63   2
  64   2
  65   2
  67   2
  68   2
  69   2
  70   2
  71   2
  72   2
  73   2
  74   2
  76   2
  77   2
  78   2
  79   2
  80   2
  81   2
  82   2
  83   2
  84   2
  85   2
  86   2
  87   2
  88   2
  89   2
  90   2
  91   2
  92   2
  93   2
  94   2
  95   2
  96   2
  97   2
  98   2
  99   2
 100   2
 101   2
 102   2
 103   2
 104   2
 105   2
 106   2
 107   2
 108   2
 109   2
 110   2
 111   2
 112   2
 113   2
 114   2
 116   2
 119   2
 120   2
 121   2
 122   2
 123   2
 124   2
 125   2
 126   2
 132   2
 133   2
 134   2
 135   2
 136   2
 137   2
 138   2
 139   2
 140   2
 141   2
 142   2
 143   2
 144   2
 145   2
 146   2
 147   2
 148   2
 149   2
 150   2
 151   2
 152   2
 153   2
 154   2
 155   2
 156   2
 157   2
 158   2
 159   2
 160   2
 161   2
 162   2
 163   2
 164   2
 165   2
 166   2
 167   2
 168   2
 169   2
 170   2
 171   2
 172   2
 173   2
 174   2
 175   2
 176   2
 177   2
 178   2
 179   2
 180   2
 181   2
 182   2
 183   2
 184   2
 185   2
 186   2
 187   2
 188   2
 189   2
 190   2
 191   2
 192   2
 193   2
 194   2
 195   2
 196   2
 197   2
 198   2
 199   2
 200   2
 201   2
 202   2
 203   2
 204   2
 205   2
 206   2
 207   2
 208   2
 209   2
 210   2
 211   2
 212   2
 213   2
 214   2
 215   2
 216   2
 217   2
 218   2
 219   2
 220   2
 221   2
 222   2
 223   2
 224   2
 225   2
 226   2
 227   2
 228   2
 229   2
 230   2
 231   2
 232   2
 233   2
 234   2
 235   2
 236   2
 237   2
 238   2
 239   2
 240   2
 241   2
 242   2
 243   2
 244   2
 245   2
 246   2
 247   2
 248   2
 249   2
 250   2
 251   2
 252   2
 253   2
 254   2
 255   2
 256   2
 257   2
 258   2
 259   2
 260   2
 262   2
 263   2
 265   2
 266   2
 267   2
 269   2
 271   2
 272   2
 273   2
 274   2
 276   2
 277   2
 278   2
 279   2
 280   2
 281   2
 282   2
 283   2
 284   2
 285   2
 286   2
 287   2
 288   2
 289   2
 290   2
 291   2
 292   2
 293   2
 294   2
 295   2
 296   2
 297   2
 298   2
 299   2
 300   2
 301   2
 302   2
 303   2
 304   2
 305   2
 306   2
 307   2
 308   2
 309   2
 310   2
 311   2
 312   2
 313   2
 314   2
 315   2
 316   2
 317   2
 318   2
 319   2
 320   2
 321   2
 322   2
 323   2
 324   2
 325   2
 326   2
 327   2
 328   2
 329   2
 330   2
 331   2
 332   2
 333   2
 334   2
 335   2
 336   2
 337   2
 338   2
 339   2
 340   2
 341   2
 342   2
 343   2
 344   2
 345   2
 346   2
 347   2
 348   2
 349   2
 350   2
 351   2
 352   2
 353   2
 354   2
 355   2
 356   2
 357   2
 358   2
 359   2
 360   2
 361   2
 362   2
 363   2
 364   2
 365   2
 366   2
 367   2
 368   2
 369   2
 370   2
 371   2
 372   2
 374   2
 375   2
 376   2
 377   2
 378   2
 379   2
 380   2
 381   2
 382   2
 383   2
 384   2
 385   2
 386   2
 387   2
 388   2
 389   2
 390   2
 391   2
 392   2
 393   2
 394   2
 395   2
 396   2
 397   2
 398   2
 399   2
 400   2
 401   2
 402   2
 403   2
 404   2
 405   2
 406   2
 407   2
 408   2
 409   2
 410   2
 411   2
 412   2
 413   2
 414   2
 415   2
 416   2
 417   2
 418   2
 419   2
 420   2
 421   2
 422   2
 423   2
 424   2
 425   2
 426   2
 427   2
 428   2
 429   2
 430   2
 431   2
 432   2
 433   2
 434   2
 435   2
 436   2
 437   2
 438   2
 439   2
 440   2
 441   2
 442   2
 443   2
 444   2
 445   2
 446   2
 447   2
 448   2
 449   2
 450   2
 451   2
 452   2
 453   2
 454   2
 455   2
 456   2
 457   2
 458   2
 459   2
 460   2
 461   2
 462   2
 463   2
 464   2
 465   2
 466   2
 467   2
 468   2
 469   2
 470   2
 471   2
 472   2
 473   2
 474   2
 475   2
 476   2
 477   2
 478   2
 479   2
 480   2
 481   2
 482   2
 483   2
 484   2
 485   2
 486   2
 487   2
 488   2
 489   2
 490   2
 491   2
 492   2
 493   2
 494   2
 495   2
 496   2
 497   2
 498   2
 499   2
 500   2
   1   3
   4   3
   5   3
   6   3
   7   3
   8   3
   9   3
  10   3
  11   3
  12   3
  13   3
  22   3
  23   3
  28   3
  29   3
  30   3
  33   3
  34   3
  35   3
  36   3
  37   3
  39   3
  40   3
  41   3
  42   3
  43   3
  44   3
  46   3
  47   3
  48   3
  49   3
  50   3
  51   3
  52   3
  53   3
  54   3
  55   3
  56   3
  57   3
  58   3
  59   3
  60   3
  61   3
  62   3
  63   3
  64   3
  65   3
  67   3
  68   3
  69   3
  70   3
  71   3
  72   3
  73   3
  74   3
  76   3
  77   3
  78   3
  79   3
  80   3
  81   3
  82   3
  83   3
  84   3
  85   3
  86   3
  87   3
  88   3
  89   3
  90   3
  91   3
  92   3
  93   3
  94   3
  95   3
  96   3
  97   3
  98   3
  99   3
 100   3
 101   3
 102   3
 103   3
 104   3
 105   3
 106   3
 107   3
 108   3
 109   3
 110   3
 111   3
 112   3
 113   3
 114   3
 116   3
 119   3
 120   3
 121   3
 122   3
 123   3
 124   3
 125   3
 126   3
 132   3
 133   3
 134   3
 135   3
 136   3
 137   3
 138   3
 139   3
 140   3
 141   3
 142   3
 143   3
 144   3
 145   3
 146   3
 147   3
 148   3
 149   3
 150   3
 151   3
 152   3
 153   3
 154   3
 155   3
 156   3
 157   3
 158   3
 159   3
 160   3
 161   3
 162   3
 163   3
 164   3
 165   3
 166   3
 167   3
 168   3
 169   3
 170   3
 171   3
 172   3
 173   3
 174   3
 175   3
 176   3
 177   3
 178   3
 179   3
 180   3
 181   3
 182   3
 183   3
 184   3
 185   3
 186   3
 187   3
 188   3
 189   3
 190   3
 191   3
 192   3
 193   3
 194   3
 195   3
 196   3
 197   3
 198   3
 199   3
 200   3
 201   3
 202   3
 203   3
 204   3
 205   3
 206   3
 207   3
 208   3
 209   3
 210   3
 211   3
 212   3
 213   3
 214   3
 215   3
 216   3
 217   3
 218   3
 219   3
 220   3
 221   3
 222   3
 223   3
 224   3
 225   3
 226   3
 227   3
 228   3
 229   3
 230   3
 231   3
 232   3
 233   3
 234   3
 235   3
 236   3
 237   3
 238   3
 239   3
 240   3
 241   3
 242   3
 243   3
 244   3
 245   3
 246   3
 247   3
 248   3
 249   3
 250   3
 251   3
 252   3
 253   3
 254   3
 255   3
 256   3
 257   3
 258   3
 259   3
 260   3
 262   3
 263   3
 265   3
 266   3
 267   3
 269   3
 271   3
 272   3
 273   3
 274   3
 276   3
 277   3
 278   3
 279   3
 280   3
 281   3
 282   3
 283   3
 284   3
 285   3
 286   3
 287   3
 288   3
 289   3
 290   3
 291   3
 292   3
 293   3
 294   3
 295   3
 296   3
 297   3
 298   3
 299   3
 300   3
 301   3
 302   3
 303   3
 304   3
 305   3
 306   3
 307   3
 308   3
 309   3
 310   3
 311   3
 312   3
 313   3
 314   3
 315   3
 316   3
 317   3
 318   3
 319   3
 320   3
 321   3
 322   3
 323   3
 324   3
 325   3
 326   3
 327   3
 328   3
 329   3
 330   3
 331   3
 332   3
 333   3
 334   3
 335   3
 336   3
 337   3
 338   3
 339   3
 340   3
 341   3
 342   3
 343   3
 344   3
 345   3
 346   3
 347   3
 348   3
 349   3
 350   3
 351   3
 352   3
 353   3
 354   3
 355   3
 356   3
 357   3
 358   3
 359   3
 360   3
 361   3
 362   3
 363   3
 364   3
 365   3
 366   3
 367   3
 368   3
 369   3
 370   3
 371   3
 372   3
 374   3
 375   3
 376   3
 377   3
 378   3
 379   3
 380   3
 381   3
 382   3
 383   3
 384   3
 385   3
 386   3
 387   3
 388   3
 389   3
 390   3
 391   3
 392   3
 393   3
 394   3
 395   3
 396   3
 397   3
 398   3
 399   3
 400   3
 401   3
 402   3
 403   3
 404   3
 405   3
 406   3
 407   3
 408   3
 409   3
 410   3
 411   3
 412   3
 413   3
 414   3
 415   3
 416   3
 417   3
 418   3
 419   3
 420   3
 421   3
 422   3
 423   3
 424   3
 425   3
 426   3
 427   3
 428   3
 429   3
 430   3
 431   3
 432   3
 433   3
 434   3
 435   3
 436   3
 437   3
 438   3
 439   3
 440   3
 441   3
 442   3
 443   3
 444   3
 445   3
 446   3
 447   3
 448   3
 449   3
 450   3
 451   3
 452   3
 453   3
 454   3
 455   3
 456   3
 457   3
 458   3
 459   3
 460   3
 461   3
 462   3
 463   3
 464   3
 465   3
 466   3
 467   3
 468   3
 469   3
 470   3
 471   3
 472   3
 473   3
 474   3
 475   3
 476   3
 477   3
 478   3
 479   3
 480   3
 481   3
 482   3
 483   3
 484   3
 485   3
 486   3
 487   3
 488   3
 489   3
 490   3
 491   3
 492   3
 493   3
 494   3
 495   3
 496   3
 497   3
 498   3
 499   3
 500   3
   1   4
   3   4
   5   4
   6   4
   7   4
   8   4
   9   4
  10   4
  11   4
  12   4
  13   4
  22   4
  23   4
  28   4
  29   4
  30   4
  33   4
  34   4
  35   4
  36   4
  37   4
  39   4
  40   4
  41   4
  42   4
  43   4
  44   4
  46   4
  47   4
  48   4
  49   4
  50   4
  51   4
  52   4
  53   4
  54   4
  55   4
  56   4
  57   4
  58   4
  59   4
  60   4
  61   4
  62   4
  63   4
  64   4
  65   4
  67   4
  68   4
  69   4
  70   4
  71   4
  72   4
  73   4
  74   4
  77   4
  78   4
  79   4
  80   4
  81   4
  82   4
  83   4
  84   4
  85   4
  86   4
  87   4
  88   4
  89   4
  90   4
  91   4
  92   4
  93   4
  94   4
  95   4
  96   4
  97   4
  98   4
  99   4
 100   4
 101   4
 102   4
 103   4
 104   4
 105   4
 106   4
 107   4
 108   4
 109   4
 110   4
 111   4
 112   4
 113   4
 114   4
 116   4
 119   4
 120   4
 121   4
 122   4
 123   4
 124   4
 125   4
 126   4
 132   4
 133   4
 134   4
 135   4
 136   4
 137   4
 138   4
 139   4
 140   4
 141   4
 142   4
 143   4
 144   4
 145   4
 146   4
 147   4
 148   4
 149   4
 150   4
 151   4
 152   4
 154   4
 155   4
 156   4
 157   4
 162   4
 163   4
 164   4
 165   4
 166   4
 167   4
 168   4
 169   4
 170   4
 171   4
 172   4
 173   4
 174   4
 175   4
 179   4
 180   4
 181   4
 182   4
 183   4
 184   4
 185   4
 186   4
 187   4
 188   4
 189   4
 190   4
 191   4
 192   4
 193   4
 194   4
 195   4
 196   4
 197   4
 198   4
 199   4
 200   4
 201   4
 202   4
 203   4
 204   4
 205   4
 206   4
 207   4
 208   4
 209   4
 210   4
 211   4
 212   4
 213   4
 214   4
 215   4
 216   4
 217   4
 218   4
 219   4
 220   4
 221   4
 222   4
 223   4
 225   4
 226   4
 227   4
 228   4
 229   4
 230   4
 231   4
 232   4
 233   4
 234   4
 235   4
 236   4
 237   4
 238   4
 239   4
 240   4
 241   4
 242   4
 243   4
 244   4
 245   4
 246   4
 247   4
 248   4
 249   4
 250   4
 251   4
 252   4
 253   4
 254   4
 255   4
 256   4
 257   4
 258   4
 259   4
 260   4
 262   4
 263   4
 265   4
 266   4
 267   4
 269   4
 271   4
 272   4
 273   4
 274   4
 276   4
 277   4
 278   4
 279   4
 281   4
 282   4
 283   4
 284   4
 285   4
 286   4
 287   4
 288   4
 289   4
 290   4
 291   4
 292   4
 293   4
 294   4
 295   4
 296   4
 297   4
 298   4
 299   4
 300   4
 301   4
 302   4
 303   4
 304   4
 305   4
 306   4
 307   4
 308   4
 309   4
 310   4
 311   4
 312   4
 313   4
 314   4
 315   4
 316   4
 317   4
 318   4
 319   4
 320   4
 321   4
 322   4
 323   4
 324   4
 325   4
 326   4
 327   4
 328   4
 329   4
 330   4
 331   4
 332   4
 333   4
 334   4
 335   4
 336   4
 337   4
 338   4
 339   4
 340   4
 341   4
 342   4
 343   4
 344   4
 345   4
 346   4
 347   4
 348   4
 349   4
 350   4
 351   4
 352   4
 353   4
 354   4
 355   4
 356   4
 357   4
 358   4
 359   4
 360   4
 361   4
 362   4
 363   4
 364   4
 365   4
 366   4
 367   4
 368   4
 369   4
 370   4
 371   4
 372   4
 374   4
 375   4
 376   4
 377   4
 378   4
 379   4
 380   4
 381   4
 382   4
 383   4
 384   4
 385   4
 386   4
 387   4
 388   4
 389   4
 390   4
 391   4
 392   4
 393   4
 394   4
 395   4
 396   4
 397   4
 398   4
 399   4
 400   4
 401   4
 402   4
 403   4
 404   4
 405   4
 406   4
 407   4
 408   4
 409   4
 410   4
 411   4
 412   4
 413   4
 414   4
 415   4
 416   4
 417   4
 418   4
 419   4
 420   4
 421   4
 422   4
 423   4
 424   4
 425   4
 426   4
 427   4
 428   4
 429   4
 430   4
 431   4
 432   4
 433   4
 434   4
 435   4
 436   4
 437   4
 438   4
 439   4
 440   4
 441   4
 442   4
 443   4
 444   4
 445   4
 446   4
 447   4
 448   4
 449   4
 450   4
 451   4
 452   4
 453   4
 454   4
 455   4
 456   4
 457   4
 458   4
 459   4
 460   4
 461   4
 462   4
 463   4
 464   4
 465   4
 466   4
 467   4
 468   4
 469   4
 470   4
 471   4
 472   4
 473   4
 474   4
 475   4
 476   4
 477   4
 478   4
 479   4
 480   4
 481   4
 482   4
 483   4
 484   4
 485   4
 486   4
 487   4
 488   4
 489   4
 490   4
 491   4
 492   4
 493   4
 494   4
 495   4
 496   4
 497   4
 498   4
 499   4
 500   4
   1   5
   3   5
   4   5
   6   5
   7   5
   8   5
   9   5
  10   5
  11   5
  12   5
  13   5
  22   5
  23   5
  28   5
  29   5
  30   5
  33   5
  34   5
  35   5
  36   5
  37   5
  39   5
  40   5
  41   5
  42   5
  43   5
  44   5
  46   5
  47   5
  48   5
  49   5
  50   5
  51   5
  52   5
  53   5
  54   5
  55   5
  56   5
  57   5
  58   5
  59   5
  60   5
  61   5
  62   5
  63   5
  64   5
  65   5
  67   5
  68   5
  69   5
  70   5
  71   5
  72   5
  73   5
  74   5
  76   5
  77   5
  78   5
  79   5
  80   5
  81   5
  82   5
  83   5
  84   5
  85   5
  86   5
  87   5
  88   5
  89   5
  90   5
  91   5
  92   5
  93   5
  94   5
  95   5
  96   5
  97   5
  98   5
  99   5
 100   5
 101   5
 102   5
 103   5
 104   5
 105   5
 106   5
 107   5
 108   5
 109   5
 110   5
 111   5
 112   5
 113   5
 114   5
 116   5
 119   5
 120   5
 121   5
 122   5
 123   5
 124   5
 125   5
 126   5
 132   5
 133   5
 134   5
 135   5
 136   5
 137   5
 138   5
 139   5
 140   5
 141   5
 142   5
 143   5
 144   5
 145   5
 146   5
 147   5
 148   5
 149   5
 150   5
 151   5
 152   5
 153   5
 154   5
 155   5
 156   5
 157   5
 158   5
 159   5
 160   5
 161   5
 162   5
 163   5
 164   5
 165   5
 166   5
 167   5
 168   5
 169   5
 170   5
 171   5
 172   5
 173   5
 174   5
 175   5
 176   5
 177   5
 178   5
 179   5
 180   5
 181   5
 182   5
 183   5
 184   5
 185   5
 186   5
 187   5
 188   5
 189   5
 190   5
 191   5
 192   5
 193   5
 194   5
 195   5
 196   5
 197   5
 198   5
 199   5
 200   5
 201   5
 202   5
 203   5
 204   5
 205   5
 206   5
 207   5
 208   5
 209   5
 210   5
 211   5
 212   5
 213   5
 214   5
 215   5
 216   5
 217   5
 218   5
 219   5
 220   5
 221   5
 222   5
 223   5
 224   5
 225   5
 226   5
 227   5
 228   5
 229   5
 230   5
 231   5
 232   5
 233   5
 234   5
 235   5
 236   5
 237   5
 238   5
 239   5
 240   5
 241   5
 242   5
 243   5
 244   5
 245   5
 246   5
 247   5
 248   5
 249   5
 250   5
 251   5
 252   5
 253   5
 254   5
 255   5
 256   5
 257   5
 258   5
 259   5
 260   5
 262   5
 263   5
 265   5
 266   5
 267   5
 269   5
 271   5
 272   5
 273   5
 274   5
 276   5
 277   5
 278   5
 279   5
 280   5
 281   5
 282   5
 283   5
 284   5
 285   5
 286   5
 287   5
 288   5
 289   5
 290   5
 291   5
 292   5
 293   5
 294   5
 295   5
 296   5
 297   5
 298   5
 299   5
 300   5
 301   5
 302   5
 303   5
 304   5
 305   5
 306   5
 307   5
 308   5
 309   5
 310   5
 311   5
 312   5
 313   5
 314   5
 315   5
 316   5
 317   5
 318   5
 319   5
 320   5
 321   5
 322   5
 323   5
 324   5
 325   5
 326   5
 327   5
 328   5
 329   5
 330   5
 331   5
 332   5
 333   5
 334   5
 335   5
 336   5
 337   5
 338   5
 339   5
 340   5
 341   5
 342   5
 343   5
 344   5
 345   5
 346   5
 347   5
 348   5
 349   5
 350   5
 351   5
 352   5
 353   5
 354   5
 355   5
 356   5
 357   5
 358   5
 359   5
 360   5
 361   5
 362   5
 363   5
 364   5
 365   5
 366   5
 367   5
 368   5
 369   5
 370   5
 371   5
 372   5
 374   5
 375   5
 376   5
 377   5
 378   5
 379   5
 380   5
 381   5
 382   5
 383   5
 384   5
 385   5
 386   5
 387   5
 388   5
 389   5
 390   5
 391   5
 392   5
 393   5
 394   5
 395   5
 396   5
 397   5
 398   5
 399   5
 400   5
 401   5
 402   5
 403   5
 404   5
 405   5
 406   5
 407   5
 408   5
 409   5
 410   5
 411   5
 412   5
 413   5
 414   5
 415   5
 416   5
 417   5
 418   5
 419   5
 420   5
 421   5
 422   5
 423   5
 424   5
 425   5
 426   5
 427   5
 428   5
 429   5
 430   5
 431   5
 432   5
 433   5
 434   5
 435   5
 436   5
 437   5
 438   5
 439   5
 440   5
 441   5
 442   5
 443   5
 444   5
 445   5
 446   5
 447   5
 448   5
 449   5
 450   5
 451   5
 452   5
 453   5
 454   5
 455   5
 456   5
 457   5
 458   5
 459   5
 460   5
 461   5
 462   5
 463   5
 464   5
 465   5
 466   5
 467   5
 468   5
 469   5
 470   5
 471   5
 472   5
 473   5
 474   5
 475   5
 476   5
 477   5
 478   5
 479   5
 480   5
 481   5
 482   5
 483   5
 484   5
 485   5
 486   5
 487   5
 488   5
 489   5
 490   5
 491   5
 492   5
 493   5
 494   5
 495   5
 496   5
 497   5
 498   5
 499   5
 500   5
   1   6
   3   6
   4   6
   5   6
   7   6
   8   6
   9   6
  10   6
  11   6
  12   6
  13   6
  22   6
  23   6
  28   6
  29   6
  30   6
  33   6
  34   6
  35   6
  36   6
  37   6
  39   6
  40   6
  41   6
  42   6
  43   6
  46   6
  47   6
  48   6
  49   6
  50   6
  51   6
  52   6
  53   6
  54   6
  55   6
  56   6
  57   6
  58   6
  59   6
  60   6
  61   6
  62   6
  63   6
  64   6
  65   6
  67   6
  68   6
  69   6
  70   6
  71   6
  72   6
  73   6
  74   6
  77   6
  78   6
  79   6
  80   6
  81   6
  82   6
  83   6
  84   6
  85   6
  86   6
  87   6
  88   6
  89   6
  90   6
  91   6
  92   6
  93   6
  94   6
  95   6
  96   6
  97   6
  98   6
  99   6
 100   6
 101   6
 102   6
 103   6
 104   6
 105   6
 106   6
 107   6
 108   6
 109   6
 110   6
 111   6
 112   6
 113   6
 114   6
 116   6
 119   6
 120   6
 121   6
 122   6
 123   6
 124   6
 125   6
 126   6
 132   6
 133   6
 134   6
 135   6
 136   6
 137   6
 138   6
 139   6
 140   6
 141   6
 142   6
 143   6
 144   6
 145   6
 146   6
 147   6
 148   6
 149   6
 150   6
 151   6
 152   6
 154   6
 155   6
 156   6
 157   6
 162   6
 163   6
 164   6
 165   6
 166   6
 167   6
 168   6
 169   6
 170   6
 171   6
 172   6
 173   6
 174   6
 175   6
 179   6
 180   6
 181   6
 182   6
 183   6
 184   6
 185   6
 186   6
 187   6
 188   6
 189   6
 190   6
 191   6
 192   6
 193   6
 194   6
 195   6
 196   6
 197   6
 198   6
 199   6
 200   6
 201   6
 202   6
 203   6
 204   6
 205   6
 206   6
 207   6
 208   6
 209   6
 210   6
 211   6
 212   6
 213   6
 214   6
 215   6
 216   6
 217   6
 218   6
 219   6
 220   6
 221   6
 222   6
 223   6
 225   6
 226   6
 227   6
 228   6
 229   6
 230   6
 231   6
 232   6
 233   6
 234   6
 235   6
 236   6
 237   6
 238   6
 239   6
 240   6
 241   6
 242   6
 243   6
 244   6
 245   6
 246   6
 247   6
 248   6
 249   6
 250   6
 251   6
 252   6
 253   6
 254   6
 255   6
 256   6
 257   6
 258   6
 259   6
 260   6
 262   6
 263   6
 265   6
 266   6
 267   6
 269   6
 271   6
 272   6
 273   6
 274   6
 276   6
 277   6
 278   6
 279   6
 281   6
 282   6
 283   6
 284   6
 285   6
 286   6
 287   6
 288   6
 289   6
 290   6
 291   6
 292   6
 293   6
 294   6
 295   6
 296   6
 297   6
 298   6
 299   6
 300   6
 301   6
 302   6
 303   6
 304   6
 305   6
 306   6
 307   6
 308   6
 309   6
 310   6
 311   6
 312   6
 313   6
 314   6
 315   6
 316   6
 317   6
 318   6
 319   6
 320   6
 321   6
 322   6
 323   6
 324   6
 325   6
 326   6
 327   6
 328   6
 329   6
 330   6
 331   6
 332   6
 333   6
 334   6
 335   6
 336   6
 337   6
 338   6
 339   6
 340   6
 341   6
 342   6
 343   6
 344   6
 345   6
 346   6
 347   6
 348   6
 349   6
 350   6
 351   6
 352   6
 353   6
 354   6
 355   6
 356   6
 357   6
 358   6
 359   6
 360   6
 361   6
 362   6
 363   6
 364   6
 365   6
 366   6
 367   6
 368   6
 369   6
 370   6
 371   6
 372   6
 374   6
 375   6
 376   6
 377   6
 378   6
 379   6
 380   6
 381   6
 382   6
 383   6
 384   6
 385   6
 386   6
 387   6
 388   6
 389   6
 390   6
 391   6
 392   6
 393   6
 394   6
 395   6
 396   6
 397   6
 398   6
 399   6
 400   6
 401   6
 402   6
 403   6
 404   6
 405   6
 406   6
 407   6
 408   6
 409   6
 410   6
 411   6
 412   6
 413   6
 414   6
 415   6
 416   6
 417   6
 418   6
 419   6
 420   6
 421   6
 422   6
 423   6
 424   6
 425   6
 426   6
 427   6
 428   6
 429   6
 430   6
 431   6
 432   6
 433   6
 434   6
 435   6
 436   6
 437   6
 438   6
 439   6
 440   6
 441   6
 442   6
 443   6
 444   6
 445   6
 446   6
 447   6
 448   6
 449   6
 450   6
 451   6
 452   6
 453   6
 454   6
 455   6
 456   6
 457   6
 458   6
 459   6
 460   6
 461   6
 462   6
 463   6
 464   6
 465   6
 466   6
 467   6
 468   6
 469   6
 470   6
 471   6
 472   6
 473   6
 474   6
 475   6
 476   6
 477   6
 478   6
 479   6
 480   6
 481   6
 482   6
 483   6
 484   6
 485   6
 486   6
 487   6
 488   6
 489   6
 490   6
 491   6
 492   6
 493   6
 494   6
 495   6
 496   6
 497   6
 498   6
 499   6
 500   6
   1   7
   3   7
   4   7
   5   7
   6   7
   8   7
   9   7
  10   7
  11   7
  12   7
  13   7
  22   7
  23   7
  28   7
  29   7
  30   7
  33   7
  34   7
  35   7
  36   7
  37   7
  39   7
  40   7
  41   7
  42   7
  43   7
  46   7
  47   7
  48   7
  49   7
  50   7
  51   7
  52   7
  53   7
  54   7
  56   7
  57   7
  58   7
  59   7
  60   7
  61   7
  62   7
  63   7
  64   7
  65   7
  67   7
  68   7
  69   7
  70   7
  71   7
  72   7
  73   7
  74   7
  77   7
  78   7
  79   7
  80   7
  81   7
  82   7
  83   7
  84   7
  85   7
  86   7
  87   7
  88   7
  89   7
  90   7
  91   7
  92   7
  93   7
  94   7
  95   7
  96   7
  97   7
  98   7
  99   7
 100   7
 101   7
 102   7
 103   7
 104   7
 105   7
 106   7
 107   7
 108   7
 109   7
 110   7
 111   7
 112   7
 113   7
 114   7
 116   7
 119   7
 120   7
 121   7
 122   7
 123   7
 124   7
 125   7
 126   7
 132   7
 133   7
 134   7
 135   7
 136   7
 137   7
 138   7
 139   7
 140   7
 141   7
 142   7
 143   7
 144   7
 145   7
 146   7
 147   7
 148   7
 149   7
 150   7
 151   7
 152   7
 154   7
 155   7
 156   7
 157   7
 162   7
 163   7
 164   7
 165   7
 166   7
 167   7
 168   7
 169   7
 170   7
 171   7
 172   7
 173   7
 174   7
 175   7
 179   7
 180   7
 181   7
 182   7
 183   7
 184   7
 185   7
 186   7
 187   7
 188   7
 189   7
 190   7
 191   7
 192   7
 193   7
 194   7
 195   7
 196   7
 197   7
 198   7
 199   7
 200   7
 201   7
 202   7
 203   7
 204   7
 205   7
 206   7
 207   7
 208   7
 209   7
 210   7
 211   7
 212   7
 213   7
 214   7
 215   7
 216   7
 217   7
 218   7
 219   7
 220   7
 221   7
 222   7
 223   7
 225   7
 226   7
 227   7
 228   7
 229   7
 230   7
 231   7
 232   7
 233   7
 234   7
 235   7
 236   7
 237   7
 238   7
 239   7
 240   7
 241   7
 242   7
 243   7
 244   7
 245   7
 246   7
 247   7
 248   7
 249   7
 250   7
 251   7
 252   7
 253   7
 254   7
 255   7
 256   7
 257   7
 258   7
 259   7
 260   7
 262   7
 263   7
 265   7
 266   7
 267   7
 269   7
 271   7
 272   7
 273   7
 274   7
 276   7
 277   7
 278   7
 279   7
 281   7
 282   7
 283   7
 284   7
 285   7
 286   7
 287   7
 288   7
 289   7
 290   7
 291   7
 292   7
 293   7
 294   7
 295   7
 296   7
 297   7
 298   7
 299   7
 300   7
 301   7
 302   7
 303   7
 304   7
 305   7
 306   7
 307   7
 308   7
 309   7
 310   7
 311   7
 312   7
 313   7
 314   7
 315   7
 316   7
 317   7
 318   7
 319   7
 320   7
 321   7
 322   7
 323   7
 324   7
 325   7
 326   7
 327   7
 328   7
 329   7
 330   7
 331   7
 332   7
 333   7
 334   7
 335   7
 336   7
 337   7
 338   7
 339   7
 340   7
 341   7
 342   7
 343   7
 344   7
 345   7
 346   7
 347   7
 348   7
 349   7
 350   7
 351   7
 352   7
 353   7
 354   7
 355   7
 356   7
 357   7
 358   7
 359   7
 360   7
 361   7
 362   7
 363   7
 364   7
 365   7
 366   7
 367   7
 368   7
 369   7
 370   7
 371   7
 372   7
 374   7
 375   7
 376   7
 377   7
 378   7
 379   7
 380   7
 381   7
 382   7
 383   7
 384   7
 385   7
 386   7
 387   7
 388   7
 389   7
 390   7
 391   7
 392   7
 393   7
 394   7
 395   7
 396   7
 397   7
 398   7
 399   7
 400   7
 401   7
 402   7
 403   7
 404   7
 405   7
 406   7
 407   7
 408   7
 409   7
 410   7
 411   7
 412   7
 413   7
 414   7
 415   7
 416   7
 417   7
 418   7
 419   7
 420   7
 421   7
 422   7
 423   7
 424   7
 425   7
 426   7
 427   7
 428   7
 429   7
 430   7
 431   7
 432   7
 433   7
 434   7
 435   7
 436   7
 437   7
 438   7
 439   7
 440   7
 441   7
 442   7
 443   7
 444   7
 445   7
 446   7
 447   7
 448   7
 449   7
 450   7
 451   7
 452   7
 453   7
 454   7
 455   7
 456   7
 457   7
 458   7
 459   7
 460   7
 461   7
 462   7
 463   7
 464   7
 465   7
 466   7
 467   7
 468   7
 469   7
 470   7
 471   7
 472   7
 473   7
 474   7
 475   7
 476   7
 477   7
 478   7
 479   7
 480   7
 481   7
 482   7
 483   7
 484   7
 485   7
 486   7
 487   7
 488   7
 489   7
 490   7
 491   7
 492   7
 493   7
 494   7
 495   7
 496   7
 497   7
 498   7
 499   7
 500   7
   1   8
   3   8
   4   8
   5   8
   6   8
   7   8
   9   8
  10   8
  11   8
  12   8
  13   8
  22   8
  23   8
  28   8
  29   8
  30   8
  33   8
  34   8
  35   8
  36   8
  37   8
  39   8
  40   8
  41   8
  42   8
  43   8
  44   8
  46   8
  47   8
  48   8
  49   8
  50   8
  51   8
  52   8
  53   8
  54   8
  55   8
  56   8
  57   8
  58   8
  59   8
  60   8
  61   8
  62   8
  63   8
  64   8
  65   8
  67   8
  68   8
  69   8
  70   8
  71   8
  72   8
  73   8
  74   8
  76   8
  77   8
  78   8
  79   8
  80   8
  81   8
  82   8
  83   8
  84   8
  85   8
  86   8
  87   8
  88   8
  89   8
  90   8
  91   8
  92   8
  93   8
  94   8
  95   8
  96   8
  97   8
  98   8
  99   8
 100   8
 101   8
 102   8
 103   8
 104   8
 105   8
 106   8
 107   8
 108   8
 109   8
 110   8
 111   8
 112   8
 113   8
 114   8
 116   8
 119   8
 120   8
 121   8
 122   8
 123   8
 124   8
 125   8
 126   8
 132   8
 133   8
 134   8
 135   8
 136   8
 137   8
 138   8
 139   8
 140   8
 141   8
 142   8
 143   8
 144   8
 145   8
 146   8
 147   8
 148   8
 149   8
 150   8
 151   8
 152   8
 153   8
 154   8
 155   8
 156   8
 157   8
 158   8
 159   8
 160   8
 161   8
 162   8
 163   8
 164   8
 165   8
 166   8
 167   8
 168   8
 169   8
 170   8
 171   8
 172   8
 173   8
 174   8
 175   8
 176   8
 177   8
 178   8
 179   8
 180   8
 181   8
 182   8
 183   8
 184   8
 185   8
 186   8
 187   8
 188   8
 189   8
 190   8
 191   8
 192   8
 193   8
 194   8
 195   8
 196   8
 197   8
 198   8
 199   8
 200   8
 201   8
 202   8
 203   8
 204   8
 205   8
 206   8
 207   8
 208   8
 209   8
 210   8
 211   8
 212   8
 213   8
 214   8
 215   8
 216   8
 217   8
 218   8
 219   8
 220   8
 221   8
 222   8
 223   8
 224   8
 225   8
 226   8
 227   8
 228   8
 229   8
 230   8
 231   8
 232   8
 233   8
 234   8
 235   8
 236   8
 237   8
 238   8
 239   8
 240   8
 241   8
 242   8
 243   8
 244   8
 245   8
 246   8
 247   8
 248   8
 249   8
 250   8
 251   8
 252   8
 253   8
 254   8
 255   8
 256   8
 257   8
 258   8
 259   8
 260   8
 262   8
 263   8
 265   8
 266   8
 267   8
 269   8
 271   8
 272   8
 273   8
 274   8
 276   8
 277   8
 278   8
 279   8
 280   8
 281   8
 282   8
 283   8
 284   8
 285   8
 286   8
 287   8
 288   8
 289   8
 290   8
 291   8
 292   8
 293   8
 294   8
 295   8
 296   8
 297   8
 298   8
 299   8
 300   8
 301   8
 302   8
 303   8
 304   8
 305   8
 306   8
 307   8
 308   8
 309   8
 310   8
 311   8
 312   8
 313   8
 314   8
 315   8
 316   8
 317   8
 318   8
 319   8
 320   8
 321   8
 322   8
 323   8
 324   8
 325   8
 326   8
 327   8
 328   8
 329   8
 330   8
 331   8
 332   8
 333   8
 334   8
 335   8
 336   8
 337   8
 338   8
 339   8
 340   8
 341   8
 342   8
 343   8
 344   8
 345   8
 346   8
 347   8
 348   8
 349   8
 350   8
 351   8
 352   8
 353   8
 354   8
 355   8
 356   8
 357   8
 358   8
 359   8
 360   8
 361   8
 362   8
 363   8
 364   8
 365   8
 366   8
 367   8
 368   8
 369   8
 370   8
 371   8
 372   8
 374   8
 375   8
 376   8
 377   8
 378   8
 379   8
 380   8
 381   8
 382   8
 383   8
 384   8
 385   8
 386   8
 387   8
 388   8
 389   8
 390   8
 391   8
 392   8
 393   8
 394   8
 395   8
 396   8
 397   8
 398   8
 399   8
 400   8
 401   8
 402   8
 403   8
 404   8
 405   8
 406   8
 407   8
 408   8
 409   8
 410   8
 411   8
 412   8
 413   8
 414   8
 415   8
 416   8
 417   8
 418   8
 419   8
 420   8
 421   8
 422   8
 423   8
 424   8
 425   8
 426   8
 427   8
 428   8
 429   8
 430   8
 431   8
 432   8
 433   8
 434   8
 435   8
 436   8
 437   8
 438   8
 439   8
 440   8
 441   8
 442   8
 443   8
 444   8
 445   8
 446   8
 447   8
 448   8
 449   8
 450   8
 451   8
 452   8
 453   8
 454   8
 455   8
 456   8
 457   8
 458   8
 459   8
 460   8
 461   8
 462   8
 463   8
 464   8
 465   8
 466   8
 467   8
 468   8
 469   8
 470   8
 471   8
 472   8
 473   8
 474   8
 475   8
 476   8
 477   8
 478   8
 479   8
 480   8
 481   8
 482   8
 483   8
 484   8
 485   8
 486   8
 487   8
 488   8
 489   8
 490   8
 491   8
 492   8
 493   8
 494   8
 495   8
 496   8
 497   8
 498   8
 499   8
 500   8
   1   9
   3   9
   4   9
   5   9
   6   9
   7   9
   8   9
  10   9
  11   9
  12   9
  13   9
  22   9
  23   9
  28   9
  29   9
  30   9
  33   9
  34   9
  35   9
  36   9
  37   9
  39   9
  40   9
  41   9
  42   9
  43   9
  44   9
  46   9
  47   9
  48   9
  49   9
  50   9
  51   9
  52   9
  53   9
  54   9
  55   9
  56   9
  57   9
  58   9
  59   9
  60   9
  61   9
  62   9
  63   9
  64   9
  65   9
  67   9
  68   9
  69   9
  70   9
  71   9
  72   9
  73   9
  74   9
  76   9
  77   9
  78   9
  79   9
  80   9
  81   9
  82   9
  83   9
  84   9
  85   9
  86   9
  87   9
  88   9
  89   9
  90   9
  91   9
  92   9
  93   9
  94   9
  95   9
  96   9
  97   9
  98   9
  99   9
 100   9
 101   9
 102   9
 103   9
 104   9
 105   9
 106   9
 107   9
 108   9
 109   9
 110   9
 111   9
 112   9
 113   9
 114   9
 116   9
 119   9
 120   9
 121   9
 122   9
 123   9
 124   9
 125   9
 126   9
 132   9
 133   9
 134   9
 135   9
 136   9
 137   9
 138   9
 139   9
 140   9
 141   9
 142   9
 143   9
 144   9
 145   9
 146   9
 147   9
 148   9
 149   9
 150   9
 151   9
 152   9
 153   9
 154   9
 155   9
 156   9
 157   9
 158   9
 159   9
 160   9
 161   9
 162   9
 163   9
 164   9
 165   9
 166   9
 167   9
 168   9
 169   9
 170   9
 171   9
 172   9
 173   9
 174   9
 175   9
 176   9
 177   9
 178   9
 179   9
 180   9
 181   9
 182   9
 183   9
 184   9
 185   9
 186   9
 187   9
 188   9
 189   9
 190   9
 191   9
 192   9
 193   9
 194   9
 195   9
 196   9
 197   9
 198   9
 199   9
 200   9
 201   9
 202   9
 203   9
 204   9
 205   9
 206   9
 207   9
 208   9
 209   9
 210   9
 211   9
 212   9
 213   9
 214   9
 215   9
 216   9
 217   9
 218   9
 219   9
 220   9
 221   9
 222   9
 223   9
 224   9
 225   9
 226   9
 227   9
 228   9
 229   9
 230   9
 231   9
 232   9
 233   9
 234   9
 235   9
 236   9
 237   9
 238   9
 239   9
 240   9
 241   9
 242   9
 243   9
 244   9
 245   9
 246   9
 247   9
 248   9
 249   9
 250   9
 251   9
 252   9
 253   9
 254   9
 255   9
 256   9
 257   9
 258   9
 259   9
 260   9
 262   9
 263   9
 265   9
 266   9
 267   9
 269   9
 271   9
 272   9
 273   9
 274   9
 276   9
 277   9
 278   9
 279   9
 280   9
 281   9
 282   9
 283   9
 284   9
 285   9
 286   9
 287   9
 288   9
 289   9
 290   9
 291   9
 292   9
 293   9
 294   9
 295   9
 296   9
 297   9
 298   9
 299   9
 300   9
 301   9
 302   9
 303   9
 304   9
 305   9
 306   9
 307   9
 308   9
 309   9
 310   9
 311   9
 312   9
 313   9
 314   9
 315   9
 316   9
 317   9
 318   9
 319   9
 320   9
 321   9
 322   9
 323   9
 324   9
 325   9
 326   9
 327   9
 328   9
 329   9
 330   9
 331   9
 332   9
 333   9
 334   9
 335   9
 336   9
 337   9
 338   9
 339   9
 340   9
 341   9
 342   9
 343   9
 344   9
 345   9
 346   9
 347   9
 348   9
 349   9
 350   9
 351   9
 352   9
 353   9
 354   9
 355   9
 356   9
 357   9
 358   9
 359   9
 360   9
 361   9
 362   9
 363   9
 364   9
 365   9
 366   9
 367   9
 368   9
 369   9
 370   9
 371   9
 372   9
 374   9
 375   9
 376   9
 377   9
 378   9
 379   9
 380   9
 381   9
 382   9
 383   9
 384   9
 385   9
 386   9
 387   9
 388   9
 389   9
 390   9
 391   9
 392   9
 393   9
 394   9
 395   9
 396   9
 397   9
 398   9
 399   9
 400   9
 401   9
 402   9
 403   9
 404   9
 405   9
 406   9
 407   9
 408   9
 409   9
 410   9
 411   9
 412   9
 413   9
 414   9
 415   9
 416   9
 417   9
 418   9
 419   9
 420   9
 421   9
 422   9
 423   9
 424   9
 425   9
 426   9
 427   9
 428   9
 429   9
 430   9
 431   9
 432   9
 433   9
 434   9
 435   9
 436   9
 437   9
 438   9
 439   9
 440   9
 441   9
 442   9
 443   9
 444   9
 445   9
 446   9
 447   9
 448   9
 449   9
 450   9
 451   9
 452   9
 453   9
 454   9
 455   9
 456   9
 457   9
 458   9
 459   9
 460   9
 461   9
 462   9
 463   9
 464   9
 465   9
 466   9
 467   9
 468   9
 469   9
 470   9
 471   9
 472   9
 473   9
 474   9
 475   9
 476   9
 477   9
 478   9
 479   9
 480   9
 481   9
 482   9
 483   9
 484   9
 485   9
 486   9
 487   9
 488   9
 489   9
 490   9
 491   9
 492   9
 493   9
 494   9
 495   9
 496   9
 497   9
 498   9
 499   9
 500   9
   1  10
   3  10
   4  10
   5  10
   6  10
   7  10
   8  10
   9  10
  11  10
  12  10
  13  10
  22  10
  23  10
  28  10
  29  10
  30  10
  33  10
  34  10
  35  10
  36  10
  37  10
  39  10
  40  10
  41  10
  42  10
  43  10
  46  10
  47  10
  48  10
  49  10
  50  10
  51  10
  52  10
  53  10
  54  10
  55  10
  56  10
  57  10
  58  10
  59  10
  60  10
  61  10
  62  10
  63  10
  64  10
  65  10
  67  10
  68  10
  69  10
  70  10
  71  10
  72  10
  73  10
  74  10
  77  10
  78  10
  79  10
  80  10
  81  10
  82  10
  83  10
  84  10
  85  10
  86  10
  87  10
  88  10
  89  10
  90  10
  91  10
  92  10
  93  10
  94  10
  95  10
  96  10
  97  10
  98  10
  99  10
 100  10
 101  10
 102  10
 103  10
 104  10
 105  10
 106  10
 107  10
 108  10
 109  10
 110  10
 111  10
 112  10
 113  10
 114  10
 116  10
 119  10
 120  10
 121  10
 122  10
 123  10
 124  10
 125  10
 126  10
 132  10
 133  10
 134  10
 135  10
 136  10
 137  10
 138  10
 139  10
 140  10
 141  10
 142  10
 143  10
 144  10
 145  10
 146  10
 147  10
 148  10
 149  10
 150  10
 151  10
 152  10
 154  10
 155  10
 156  10
 157  10
 162  10
 163  10
 164  10
 165  10
 166  10
 167  10
 168  10
 169  10
 170  10
 171  10
 172  10
 173  10
 174  10
 175  10
 179  10
 180  10
 181  10
 182  10
 183  10
 184  10
 185  10
 186  10
 187  10
 188  10
 189  10
 190  10
 191  10
 192  10
 193  10
 194  10
 195  10
 196  10
 197  10
 198  10
 199  10
 200  10
 201  10
 202  10
 203  10
 204  10
 205  10
 206  10
 207  10
 208  10
 209  10
 210  10
 211  10
 212  10
 213  10
 214  10
 215  10
 216  10
 217  10
 218  10
 219  10
 220  10
 221  10
 222  10
 223  10
 225  10
 226  10
 227  10
 228  10
 229  10
 230  10
 231  10
 232  10
 233  10
 234  10
 235  10
 236  10
 237  10
 238  10
 239  10
 240  10
 241  10
 242  10
 243  10
 244  10
 245  10
 246  10
 247  10
 248  10
 249  10
 250  10
 251  10
 252  10
 253  10
 254  10
 255  10
 256  10
 257  10
 258  10
 259  10
 260  10
 262  10
 263  10
 265  10
 266  10
 267  10
 269  10
 271  10
 272  10
 273  10
 274  10
 276  10
 277  10
 278  10
 279  10
 281  10
 282  10
 283  10
 284  10
 285  10
 286  10
 287  10
 288  10
 289  10
 290  10
 291  10
 292  10
 293  10
 294  10
 295  10
 296  10
 297  10
 298  10
 299  10
 300  10
 301  10
 302  10
 303  10
 304  10
 305  10
 306  10
 307  10
 308  10
 309  10
 310  10
 311  10
 312  10
 313  10
 314  10
 315  10
 316  10
 317  10
 318  10
 319  10
 320  10
 321  10
 322  10
 323  10
 324  10
 325  10
 326  10
 327  10
 328  10
 329  10
 330  10
 331  10
 332  10
 333  10
 334  10
 335  10
 336  10
 337  10
 338  10
 339  10
 340  10
 341  10
 342  10
 343  10
 344  10
 345  10
 346  10
 347  10
 348  10
 349  10
 350  10
 351  10
 352  10
 353  10
 354  10
 355  10
 356  10
 357  10
 358  10
 359  10
 360  10
 361  10
 362  10
 363  10
 364  10
 365  10
 366  10
 367  10
 368  10
 369  10
 370  10
 371  10
 372  10
 374  10
 375  10
 376  10
 377  10
 378  10
 379  10
 380  10
 381  10
 382  10
 383  10
 384  10
 385  10
 386  10
 387  10
 388  10
 389  10
 390  10
 391  10
 392  10
 393  10
 394  10
 395  10
 396  10
 397  10
 398  10
 399  10
 400  10
 401  10
 402  10
 403  10
 404  10
 405  10
 406  10
 407  10
 408  10
 409  10
 410  10
 411  10
 412  10
 413  10
 414  10
 415  10
 416  10
 417  10
 418  10
 419  10
 420  10
 421  10
 422  10
 423  10
 424  10
 425  10
 426  10
 427  10
 428  10
 429  10
 430  10
 431  10
 432  10
 433  10
 434  10
 435  10
 436  10
 437  10
 438  10
 439  10
 440  10
 441  10
 442  10
 443  10
 444  10
 445  10
 446  10
 447  10
 448  10
 449  10
 450  10
 451  10
 452  10
 453  10
 454  10
 455  10
 456  10
 457  10
 458  10
 459  10
 460  10
 461  10
 462  10
 463  10
 464  10
 465  10
 466  10
 467  10
 468  10
 469  10
 470  10
 471  10
 472  10
 473  10
 474  10
 475  10
 476  10
 477  10
 478  10
 479  10
 480  10
 481  10
 482  10
 483  10
 484  10
 485  10
 486  10
 487  10
 488  10
 489  10
 490  10
 491  10
 492  10
 493  10
 494  10
 495  10
 496  10
 497  10
 498  10
 499  10
 500  10
   1  11
   3  11
   4  11
   5  11
   6  11
   7  11
   8  11
   9  11
  10  11
  12  11
  13  11
  22  11
  23  11
  28  11
  29  11
  30  11
  33  11
  34  11
  35  11
  36  11
  37  11
  39  11
  40  11
  41  11
  42  11
  43  11
  44  11
  46  11
  47  11
  48  11
  49  11
  50  11
  51  11
  52  11
  53  11
  54  11
  55  11
  56  11
  57  11
  58  11
  59  11
  60  11
  61  11
  62  11
  63  11
  64  11
  65  11
  67  11
  68  11
  69  11
  70  11
  71  11
  72  11
  73  11
  74  11
  76  11
  77  11
  78  11
  79  11
  80  11
  81  11
  82  11
  83  11
  84  11
  85  11
  86  11
  87  11
  88  11
  89  11
  90  11
  91  11
  92  11
  93  11
  94  11
  95  11
  96  11
  97  11
  98  11
  99  11
 100  11
 101  11
 102  11
 103  11
 104  11
 105  11
 106  11
 107  11
 108  11
 109  11
 110  11
 111  11
 112  11
 113  11
 114  11
 116  11
 119  11
 120  11
 121  11
 122  11
 123  11
 124  11
 125  11
 126  11
 132  11
 133  11
 134  11
 135  11
 136  11
 137  11
 138  11
 139  11
 140  11
 141  11
 142  11
 143  11
 144  11
 145  11
 146  11
 147  11
 148  11
 149  11
 150  11
 151  11
 152  11
 153  11
 154  11
 155  11
 156  11
 157  11
 158  11
 159  11
 160  11
 161  11
 162  11
 163  11
 164  11
 165  11
 166  11
 167  11
 168  11
 169  11
 170  11
 171  11
 172  11
 173  11
 174  11
 175  11
 176  11
 177  11
 178  11
 179  11
 180  11
 181  11
 182  11
 183  11
 184  11
 185  11
 186  11
 187  11
 188  11
 189  11
 190  11
 191  11
 192  11
 193  11
 194  11
 195  11
 196  11
 197  11
 198  11
 199  11
 200  11
 201  11
 202  11
 203  11
 204  11
 205  11
 206  11
 207  11
 208  11
 209  11
 210  11
 211  11
 212  11
 213  11
 214  11
 215  11
 216  11
 217  11
 218  11
 219  11
 220  11
 221  11
 222  11
 223  11
 224  11
 225  11
 226  11
 227  11
 228  11
 229  11
 230  11
 231  11
 232  11
 233  11
 234  11
 235  11
 236  11
 237  11
 238  11
 239  11
 240  11
 241  11
 242  11
 243  11
 244  11
 245  11
 246  11
 247  11
 248  11
 249  11
 250  11
 251  11
 252  11
 253  11
 254  11
 255  11
 256  11
 257  11
 258  11
 259  11
 260  11
 262  11
 263  11
 265  11
 266  11
 267  11
 269  11
 271  11
 272  11
 273  11
 274  11
 276  11
 277  11
 278  11
 279  11
 280  11
 281  11
 282  11
 283  11
 284  11
 285  11
 286  11
 287  11
 288  11
 289  11
 290  11
 291  11
 292  11
 293  11
 294  11
 295  11
 296  11
 297  11
 298  11
 299  11
 300  11
 301  11
 302  11
 303  11
 304  11
 305  11
 306  11
 307  11
 308  11
 309  11
 310  11
 311  11
 312  11
 313  11
 314  11
 315  11
 316  11
 317  11
 318  11
 319  11
 320  11
 321  11
 322  11
 323  11
 324  11
 325  11
 326  11
 327  11
 328  11
 329  11
 330  11
 331  11
 332  11
 333  11
 334  11
 335  11
 336  11
 337  11
 338  11
 339  11
 340  11
 341  11
 342  11
 343  11
 344  11
 345  11
 346  11
 347  11
 348  11
 349  11
 350  11
 351  11
 352  11
 353  11
 354  11
 355  11
 356  11
 357  11
 358  11
 359  11
 360  11
 361  11
 362  11
 363  11
 364  11
 365  11
 366  11
 367  11
 368  11
 369  11
 370  11
 371  11
 372  11
 374  11
 375  11
 376  11
 377  11
 378  11
 379  11
 380  11
 381  11
 382  11
 383  11
 384  11
 385  11
 386  11
 387  11
 388  11
 389  11
 390  11
 391  11
 392  11
 393  11
 394  11
 395  11
 396  11
 397  11
 398  11
 399  11
 400  11
 401  11
 402  11
 403  11
 404  11
 405  11
 406  11
 407  11
 408  11
 409  11
 410  11
 411  11
 412  11
 413  11
 414  11
 415  11
 416  11
 417  11
 418  11
 419  11
 420  11
 421  11
 422  11
 423  11
 424  11
 425  11
 426  11
 427  11
 428  11
 429  11
 430  11
 431  11
 432  11
 433  11
 434  11
 435  11
 436  11
 437  11
 438  11
 439  11
 440  11
 441  11
 442  11
 443  11
 444  11
 445  11
 446  11
 447  11
 448  11
 449  11
 450  11
 451  11
 452  11
 453  11
 454  11
 455  11
 456  11
 457  11
 458  11
 459  11
 460  11
 461  11
 462  11
 463  11
 464  11
 465  11
 466  11
 467  11
 468  11
 469  11
 470  11
 471  11
 472  11
 473  11
 474  11
 475  11
 476  11
 477  11
 478  11
 479  11
 480  11
 481  11
 482  11
 483  11
 484  11
 485  11
 486  11
 487  11
 488  11
 489  11
 490  11
 491  11
 492  11
 493  11
 494  11
 495  11
 496  11
 497  11
 498  11
 499  11
 500  11
   1  12
   3  12
   4  12
   5  12
   6  12
   7  12
   8  12
   9  12
  10  12
  11  12
  13  12
  22  12
  23  12
  28  12
  29  12
  30  12
  33  12
  34  12
  35  12
  36  12
  37  12
  39  12
  40  12
  41  12
  42  12
  43  12
  44  12
  46  12
  47  12
  48  12
  49  12
  50  12
  51  12
  52  12
  53  12
  54  12
  55  12
  56  12
  57  12
  58  12
  59  12
  60  12
  61  12
  62  12
  63  12
  64  12
  65  12
  67  12
  68  12
  69  12
  70  12
  71  12
  72  12
  73  12
  74  12
  76  12
  77  12
  78  12
  79  12
  80  12
  81  12
  82  12
  83  12
  84  12
  85  12
  86  12
  87  12
  88  12
  89  12
  90  12
  91  12
  92  12
  93  12
  94  12
  95  12
  96  12
  97  12
  98  12
  99  12
 100  12
 101  12
 102  12
 103  12
 104  12
 105  12
 106  12
 107  12
 108  12
 109  12
 110  12
 111  12
 112  12
 113  12
 114  12
 116  12
 119  12
 120  12
 121  12
 122  12
 123  12
 124  12
 125  12
 126  12
 132  12
 133  12
 134  12
 135  12
 136  12
 137  12
 138  12
 139  12
 140  12
 141  12
 142  12
 143  12
 144  12
 145  12
 146  12
 147  12
 148  12
 149  12
 150  12
 151  12
 152  12
 153  12
 154  12
 155  12
 156  12
 157  12
 158  12
 159  12
 160  12
 161  12
 162  12
 163  12
 164  12
 165  12
 166  12
 167  12
 168  12
 169  12
 170  12
 171  12
 172  12
 173  12
 174  12
 175  12
 176  12
 177  12
 178  12
 179  12
 180  12
 181  12
 182  12
 183  12
 184  12
 185  12
 186  12
 187  12
 188  12
 189  12
 190  12
 191  12
 192  12
 193  12
 194  12
 195  12
 196  12
 197  12
 198  12
 199  12
 200  12
 201  12
 202  12
 203  12
 204  12
 205  12
 206  12
 207  12
 208  12
 209  12
 210  12
 211  12
 212  12
 213  12
 214  12
 215  12
 216  12
 217  12
 218  12
 219  12
 220  12
 221  12
 222  12
 223  12
 224  12
 225  12
 226  12
 227  12
 228  12
 229  12
 230  12
 231  12
 232  12
 233  12
 234  12
 235  12
 236  12
 237  12
 238  12
 239  12
 240  12
 241  12
 242  12
 243  12
 244  12
 245  12
 246  12
 247  12
 248  12
 249  12
 250  12
 251  12
 252  12
 253  12
 254  12
 255  12
 256  12
 257  12
 258  12
 259  12
 260  12
 262  12
 263  12
 265  12
 266  12
 267  12
 269  12
 271  12
 272  12
 273  12
 274  12
 276  12
 277  12
 278  12
 279  12
 280  12
 281  12
 282  12
 283  12
 284  12
 285  12
 286  12
 287  12
 288  12
 289  12
 290  12
 291  12
 292  12
 293  12
 294  12
 295  12
 296  12
 297  12
 298  12
 299  12
 300  12
 301  12
 302  12
 303  12
 304  12
 305  12
 306  12
 307  12
 308  12
 309  12
 310  12
 311  12
 312  12
 313  12
 314  12
 315  12
 316  12
 317  12
 318  12
 319  12
 320  12
 321  12
 322  12
 323  12
 324  12
 325  12
 326  12
 327  12
 328  12
 329  12
 330  12
 331  12
 332  12
 333  12
 334  12
 335  12
 336  12
 337  12
 338  12
 339  12
 340  12
 341  12
 342  12
 343  12
 344  12
 345  12
 346  12
 347  12
 348  12
 349  12
 350  12
 351  12
 352  12
 353  12
 354  12
 355  12
 356  12
 357  12
 358  12
 359  12
 360  12
 361  12
 362  12
 363  12
 364  12
 365  12
 366  12
 367  12
 368  12
 369  12
 370  12
 371  12
 372  12
 374  12
 375  12
 376  12
 377  12
 378  12
 379  12
 380  12
 381  12
 382  12
 383  12
 384  12
 385  12
 386  12
 387  12
 388  12
 389  12
 390  12
 391  12
 392  12
 393  12
 394  12
 395  12
 396  12
 397  12
 398  12
 399  12
 400  12
 401  12
 402  12
 403  12
 404  12
 405  12
 406  12
 407  12
 408  12
 409  12
 410  12
 411  12
 412  12
 413  12
 414  12
 415  12
 416  12
 417  12
 418  12
 419  12
 420  12
 421  12
 422  12
 423  12
 424  12
 425  12
 426  12
 427  12
 428  12
 429  12
 430  12
 431  12
 432  12
 433  12
 434  12
 435  12
 436  12
 437  12
 438  12
 439  12
 440  12
 441  12
 442  12
 443  12
 444  12
 445  12
 446  12
 447  12
 448  12
 449  12
 450  12
 451  12
 452  12
 453  12
 454  12
 455  12
 456  12
 457  12
 458  12
 459  12
 460  12
 461  12
 462  12
 463  12
 464  12
 465  12
 466  12
 467  12
 468  12
 469  12
 470  12
 471  12
 472  12
 473  12
 474  12
 475  12
 476  12
 477  12
 478  12
 479  12
 480  12
 481  12
 482  12
 483  12
 484  12
 485  12
 486  12
 487  12
 488  12
 489  12
 490  12
 491  12
 492  12
 493  12
 494  12
 495  12
 496  12
 497  12
 498  12
 499  12
 500  12
   1  13
   3  13
   4  13
   5  13
   6  13
   7  13
   8  13
   9  13
  10  13
  11  13
  12  13
  22  13
  23  13
  28  13
  29  13
  30  13
  33  13
  34  13
  35  13
  36  13
  37  13
  39  13
  40  13
  41  13
  42  13
  43  13
  44  13
  46  13
  47  13
  48  13
  49  13
  50  13
  51  13
  52  13
  53  13
  54  13
  55  13
  56  13
  57  13
  58  13
  59  13
  60  13
  61  13
  62  13
  63  13
  64  13
  65  13
  67  13
  68  13
  69  13
  70  13
  71  13
  72  13
  73  13
  74  13
  76  13
  77  13
  78  13
  79  13
  80  13
  81  13
  82  13
  83  13
  84  13
  85  13
  86  13
  87  13
  88  13
  89  13
  90  13
  91  13
  92  13
  93  13
  94  13
  95  13
  96  13
  97  13
  98  13
  99  13
 100  13
 101  13
 102  13
 103  13
 104  13
 105  13
 106  13
 107  13
 108  13
 109  13
 110  13
 111  13
 112  13
 113  13
 114  13
 116  13
 119  13
 120  13
 121  13
 122  13
 123  13
 124  13
 125  13
 126  13
 132  13
 133  13
 134  13
 135  13
 136  13
 137  13
 138  13
 139  13
 140  13
 141  13
 142  13
 143  13
 144  13
 145  13
 146  13
 147  13
 148  13
 149  13
 150  13
 151  13
 152  13
 153  13
 154  13
 155  13
 156  13
 157  13
 158  13
 159  13
 160  13
 161  13
 162  13
 163  13
 164  13
 165  13
 166  13
 167  13
 168  13
 169  13
 170  13
 171  13
 172  13
 173  13
 174  13
 175  13
 176  13
 177  13
 178  13
 179  13
 180  13
 181  13
 182  13
 183  13
 184  13
 185  13
 186  13
 187  13
 188  13
 189  13
 190  13
 191  13
 192  13
 193  13
 194  13
 195  13
 196  13
 197  13
 198  13
 199  13
 200  13
 201  13
 202  13
 203  13
 204  13
 205  13
 206  13
 207  13
 208  13
 209  13
 210  13
 211  13
 212  13
 213  13
 214  13
 215  13
 216  13
 217  13
 218  13
 219  13
 220  13
 221  13
 222  13
 223  13
 224  13
 225  13
 226  13
 227  13
 228  13
 229  13
 230  13
 231  13
 232  13
 233  13
 234  13
 235  13
 236  13
 237  13
 238  13
 239  13
 240  13
 241  13
 242  13
 243  13
 244  13
 245  13
 246  13
 247  13
 248  13
 249  13
 250  13
 251  13
 252  13
 253  13
 254  13
 255  13
 256  13
 257  13
 258  13
 259  13
 260  13
 262  13
 263  13
 265  13
 266  13
 267  13
 269  13
 271  13
 272  13
 273  13
 274  13
 276  13
 277  13
 278  13
 279  13
 280  13
 281  13
 282  13
 283  13
 284  13
 285  13
 286  13
 287  13
 288  13
 289  13
 290  13
 291  13
 292  13
 293  13
 294  13
 295  13
 296  13
 297  13
 298  13
 299  13
 300  13
 301  13
 302  13
 303  13
 304  13
 305  13
 306  13
 307  13
 308  13
 309  13
 310  13
 311  13
 312  13
 313  13
 314  13
 315  13
 316  13
 317  13
 318  13
 319  13
 320  13
 321  13
 322  13
 323  13
 324  13
 325  13
 326  13
 327  13
 328  13
 329  13
 330  13
 331  13
 332  13
 333  13
 334  13
 335  13
 336  13
 337  13
 338  13
 339  13
 340  13
 341  13
 342  13
 343  13
 344  13
 345  13
 346  13
 347  13
 348  13
 349  13
 350  13
 351  13
 352  13
 353  13
 354  13
 355  13
 356  13
 357  13
 358  13
 359  13
 360  13
 361  13
 362  13
 363  13
 364  13
 365  13
 366  13
 367  13
 368  13
 369  13
 370  13
 371  13
 372  13
 374  13
 375  13
 376  13
 377  13
 378  13
 379  13
 380  13
 381  13
 382  13
 383  13
 384  13
 385  13
 386  13
 387  13
 388  13
 389  13
 390  13
 391  13
 392  13
 393  13
 394  13
 395  13
 396  13
 397  13
 398  13
 399  13
 400  13
 401  13
 402  13
 403  13
 404  13
 405  13
 406  13
 407  13
 408  13
 409  13
 410  13
 411  13
 412  13
 413  13
 414  13
 415  13
 416  13
 417  13
 418  13
 419  13
 420  13
 421  13
 422  13
 423  13
 424  13
 425  13
 426  13
 427  13
 428  13
 429  13
 430  13
 431  13
 432  13
 433  13
 434  13
 435  13
 436  13
 437  13
 438  13
 439  13
 440  13
 441  13
 442  13
 443  13
 444  13
 445  13
 446  13
 447  13
 448  13
 449  13
 450  13
 451  13
 452  13
 453  13
 454  13
 455  13
 456  13
 457  13
 458  13
 459  13
 460  13
 461  13
 462  13
 463  13
 464  13
 465  13
 466  13
 467  13
 468  13
 469  13
 470  13
 471  13
 472  13
 473  13
 474  13
 475  13
 476  13
 477  13
 478  13
 479  13
 480  13
 481  13
 482  13
 483  13
 484  13
 485  13
 486  13
 487  13
 488  13
 489  13
 490  13
 491  13
 492  13
 493  13
 494  13
 495  13
 496  13
 497  13
 498  13
 499  13
 500  13
   1  14
  54  14
   1  15
  54  15
   1  16
   8  16
  17  16
  18  16
  19  16
  31  16
  32  16
  54  16
  73  16
 152  16
 259  16
 274  16
   1  17
   3  17
  18  17
  19  17
  29  17
  30  17
  31  17
  32  17
  36  17
  54  17
 244  17
 255  17
 257  17
   1  18
   3  18
  17  18
  19  18
  29  18
  30  18
  31  18
  32  18
  36  18
  54  18
   1  19
  17  19
  18  19
  31  19
  32  19
  54  19
 111  19
 262  19
   1  20
   9  20
  54  20
 112  20
 114  20
 355  20
 371  20
   1  21
   8  21
   9  21
  54  21
  72  21
 112  21
 114  21
   1  22
   9  22
  54  22
 112  22
 114  22
 433  22
   1  23
   9  23
  54  23
 112  23
 114  23
   1  24
   9  24
  54  24
 112  24
 114  24
 378  24
 440  24
 448  24
 483  24
   1  25
   9  25
  54  25
 112  25
 114  25
 395  25
 396  25
 449  25
 477  25
 478  25
   1  26
   8  26
   9  26
  38  26
  54  26
  72  26
 112  26
 114  26
 130  26
 149  26
 274  26
   1  27
   8  27
   9  27
  54  27
  72  27
 112  27
 129  27
   1  28
   3  28
   4  28
   5  28
   6  28
   7  28
   8  28
   9  28
  10  28
  11  28
  12  28
  13  28
  22  28
  23  28
  29  28
  30  28
  33  28
  34  28
  35  28
  36  28
  37  28
  39  28
  40  28
  41  28
  42  28
  43  28
  46  28
  47  28
  48  28
  49  28
  50  28
  51  28
  52  28
  53  28
  54  28
  55  28
  56  28
  57  28
  58  28
  59  28
  60  28
  61  28
  62  28
  63  28
  64  28
  65  28
  67  28
  68  28
  69  28
  70  28
  71  28
  72  28
  73  28
  74  28
  77  28
  78  28
  79  28
  80  28
  81  28
  82  28
  83  28
  84  28
  85  28
  86  28
  87  28
  88  28
  89  28
  90  28
  91  28
  92  28
  93  28
  94  28
  95  28
  96  28
  97  28
  98  28
  99  28
 100  28
 101  28
 102  28
 103  28
 104  28
 105  28
 106  28
 107  28
 108  28
 109  28
 110  28
 111  28
 112  28
 113  28
 114  28
 116  28
 119  28
 120  28
 121  28
 122  28
 123  28
 124  28
 125  28
 126  28
 132  28
 133  28
 134  28
 135  28
 136  28
 137  28
 138  28
 139  28
 140  28
 141  28
 142  28
 143  28
 144  28
 145  28
 146  28
 147  28
 148  28
 149  28
 150  28
 151  28
 152  28
 154  28
 155  28
 156  28
 157  28
 162  28
 163  28
 164  28
 165  28
 166  28
 167  28
 168  28
 169  28
 170  28
 171  28
 172  28
 173  28
 174  28
 175  28
 179  28
 180  28
 181  28
 182  28
 183  28
 184  28
 185  28
 186  28
 187  28
 188  28
 189  28
 190  28
 191  28
 192  28
 193  28
 194  28
 195  28
 196  28
 197  28
 198  28
 199  28
 200  28
 201  28
 202  28
 203  28
 204  28
 205  28
 206  28
 207  28
 208  28
 209  28
 210  28
 211  28
 212  28
 213  28
 214  28
 215  28
 216  28
 217  28
 218  28
 219  28
 220  28
 221  28
 222  28
 223  28
 225  28
 226  28
 227  28
 228  28
 229  28
 230  28
 231  28
 232  28
 233  28
 234  28
 235  28
 236  28
 237  28
 238  28
 239  28
 240  28
 241  28
 242  28
 243  28
 244  28
 245  28
 246  28
 247  28
 248  28
 249  28
 250  28
 251  28
 252  28
 253  28
 254  28
 255  28
 256  28
 257  28
 258  28
 259  28
 260  28
 262  28
 263  28
 265  28
 266  28
 267  28
 269  28
 271  28
 272  28
 273  28
 274  28
 276  28
 277  28
 278  28
 279  28
 281  28
 282  28
 283  28
 284  28
 285  28
 286  28
 287  28
 288  28
 289  28
 290  28
 291  28
 292  28
 293  28
 294  28
 295  28
 296  28
 297  28
 298  28
 299  28
 300  28
 301  28
 302  28
 303  28
 304  28
 305  28
 306  28
 307  28
 308  28
 309  28
 310  28
 311  28
 312  28
 313  28
 314  28
 315  28
 316  28
 317  28
 318  28
 319  28
 320  28
 321  28
 322  28
 323  28
 324  28
 325  28
 326  28
 327  28
 328  28
 329  28
 330  28
 331  28
 332  28
 333  28
 334  28
 335  28
 336  28
 337  28
 338  28
 339  28
 340  28
 341  28
 342  28
 343  28
 344  28
 345  28
 346  28
 347  28
 348  28
 349  28
 350  28
 351  28
 352  28
 353  28
 354  28
 355  28
 356  28
 357  28
 358  28
 359  28
 360  28
 361  28
 362  28
 363  28
 364  28
 365  28
 366  28
 367  28
 368  28
 369  28
 370  28
 371  28
 372  28
 374  28
 375  28
 376  28
 377  28
 378  28
 379  28
 380  28
 381  28
 382  28
 383  28
 384  28
 385  28
 386  28
 387  28
 388  28
 389  28
 390  28
 391  28
 392  28
 393  28
 394  28
 395  28
 396  28
 397  28
 398  28
 399  28
 400  28
 401  28
 402  28
 403  28
 404  28
 405  28
 406  28
 407  28
 408  28
 409  28
 410  28
 411  28
 412  28
 413  28
 414  28
 415  28
 416  28
 417  28
 418  28
 419  28
 420  28
 421  28
 422  28
 423  28
 424  28
 425  28
 426  28
 427  28
 428  28
 429  28
 430  28
 431  28
 432  28
 433  28
 434  28
 435  28
 436  28
 437  28
 438  28
 439  28
 440  28
 441  28
 442  28
 443  28
 444  28
 445  28
 446  28
 447  28
 448  28
 449  28
 450  28
 451  28
 452  28
 453  28
 454  28
 455  28
 456  28
 457  28
 458  28
 459  28
 460  28
 461  28
 462  28
 463  28
 464  28
 465  28
 466  28
 467  28
 468  28
 469  28
 470  28
 471  28
 472  28
 473  28
 474  28
 475  28
 476  28
 477  28
 478  28
 479  28
 480  28
 481  28
 482  28
 483  28
 484  28
 485  28
 486  28
 487  28
 488  28
 489  28
 490  28
 491  28
 492  28
 493  28
 494  28
 495  28
 496  28
 497  28
 498  28
 499  28
 500  28
   3  29
  30  29
  33  29
  34  29
  35  29
  36  29
  37  29
  56  29
  57  29
  58  29
  59  29
  60  29
  61  29
  62  29
  63  29
  64  29
  65  29
  67  29
  68  29
   3  30
   6  30
  29  30
  33  30
  34  30
  35  30
  36  30
  37  30
  55  30
  56  30
  57  30
  58  30
  59  30
  60  30
  61  30
  62  30
  63  30
  64  30
  65  30
  67  30
  68  30
   3  31
   6  31
  29  31
  30  31
  33  31
  34  31
  35  31
  36  31
  37  31
  55  31
  56  31
  57  31
  58  31
  59  31
  60  31
  61  31
  62  31
  63  31
  64  31
  65  31
  67  31
  68  31
   3  32
   6  32
  29  32
  30  32
  33  32
  34  32
  35  32
  36  32
  37  32
  55  32
  56  32
  57  32
  58  32
  59  32
  60  32
  61  32
  62  32
  63  32
  64  32
  65  32
  67  32
  68  32
   3  33
  29  33
  30  33
  34  33
  35  33
  36  33
  37  33
  56  33
  57  33
  58  33
  59  33
  60  33
  61  33
  62  33
  63  33
  64  33
  65  33
  67  33
  68  33
   3  34
  29  34
  30  34
  33  34
  35  34
  36  34
  37  34
  56  34
  57  34
  58  34
  59  34
  60  34
  61  34
  62  34
  63  34
  64  34
  65  34
  67  34
  68  34
   3  35
  29  35
  30  35
  33  35
  34  35
  36  35
  37  35
  56  35
  57  35
  58  35
  59  35
  60  35
  61  35
  62  35
  63  35
  64  35
  65  35
  67  35
  68  35
   3  36
   6  36
  29  36
  30  36
  33  36
  34  36
  35  36
  37  36
  55  36
  56  36
  57  36
  58  36
  59  36
  60  36
  61  36
  62  36
  63  36
  64  36
  65  36
  67  36
  68  36
   3  37
  29  37
  30  37
  33  37
  34  37
  35  37
  36  37
  56  37
  57  37
  58  37
  59  37
  60  37
  61  37
  62  37
  63  37
  64  37
  65  37
  67  37
  68  37
   3  38
  29  38
  30  38
  36  38
  79  38
   4  39
  41  39
  42  39
  43  39
  70  39
  71  39
  72  39
  73  39
  74  39
  77  39
   4  40
  39  40
  41  40
  42  40
  43  40
  44  40
  70  40
  71  40
  72  40
  73  40
  74  40
  76  40
  77  40
   4  41
  39  41
  42  41
  43  41
  44  41
  70  41
  71  41
  72  41
  73  41
  74  41
  76  41
  77  41
   4  42
   6  42
  39  42
  41  42
  43  42
  55  42
  70  42
  71  42
  72  42
  73  42
  74  42
  76  42
  77  42
   4  43
  39  43
  41  43
  42  43
  44  43
  70  43
  71  43
  72  43
  73  43
  74  43
  76  43
  77  43
   4  44
   6  44
  39  44
  55  44
  76  44
 153  44
 158  44
 159  44
 160  44
 161  44
 176  44
 177  44
 178  44
 224  44
 280  44
   4  45
  39  45
  44  45
   5  46
  47  46
  48  46
  49  46
  50  46
  51  46
  52  46
  53  46
 235  46
 236  46
 237  46
 238  46
 239  46
 240  46
 241  46
   5  47
  46  47
  48  47
  49  47
  50  47
  51  47
  52  47
  53  47
 235  47
 236  47
 237  47
 238  47
 239  47
 240  47
 241  47
   5  48
   6  48
  46  48
  47  48
  49  48
  50  48
  51  48
  52  48
  53  48
  55  48
 235  48
 236  48
 237  48
 238  48
 239  48
 240  48
 241  48
   5  49
   6  49
  46  49
  47  49
  48  49
  50  49
  51  49
  52  49
  53  49
  55  49
 235  49
 236  49
 237  49
 238  49
 239  49
 240  49
 241  49
   5  50
   6  50
  46  50
  47  50
  48  50
  49  50
  51  50
  52  50
  53  50
  55  50
 235  50
 236  50
 237  50
 238  50
 239  50
 240  50
 241  50
   5  51
   6  51
  46  51
  47  51
  48  51
  49  51
  50  51
  52  51
  53  51
  55  51
 235  51
 236  51
 237  51
 238  51
 239  51
 240  51
 241  51
   5  52
   6  52
  46  52
  47  52
  48  52
  49  52
  50  52
  51  52
  53  52
  55  52
 235  52
 236  52
 237  52
 238  52
 239  52
 240  52
 241  52
   5  53
   6  53
  46  53
  47  53
  48  53
  49  53
  50  53
  51  53
  52  53
  55  53
 235  53
 236  53
 237  53
 238  53
 239  53
 240  53
 241  53
   6  54
   7  54
  40  54
  55  54
  69  54
 150  54
 155  54
   6  55
  44  55
  76  55
 153  55
 158  55
 159  55
 160  55
 161  55
 176  55
 177  55
 178  55
 224  55
 280  55
   6  56
  55  56
   6  57
  55  57
   6  58
  55  58
  57  58
  59  58
  60  58
   6  59
  55  59
  57  59
  58  59
  60  59
   6  60
  55  60
  57  60
  58  60
  59  60
   6  61
  55  61
   6  62
  55  62
   6  63
  55  63
  62  63
  64  63
  65  63
   6  64
  55  64
  62  64
  63  64
  65  64
   6  65
  55  65
  62  65
  63  65
  64  65
   6  66
  55  66
  62  66
  63  66
  64  66
  65  66
   6  67
  55  67
   6  68
  55  68
   6  69
  40  69
  55  69
   6  70
  55  70
   6  71
  41  71
  55  71
  70  71
  72  71
  73  71
  74  71
   6  72
  41  72
  55  72
  70  72
  71  72
  73  72
  74  72
   6  73
  41  73
  55  73
  70  73
  71  73
  72  73
  74  73
   6  74
  41  74
  55  74
  70  74
  71  74
  72  74
  73  74
   6  75
  41  75
  55  75
  70  75
  71  75
  72  75
  73  75
  74  75
   6  76
  42  76
  44  76
  55  76
   6  77
  55  77
   6  78
  55  78
   6  79
  55  79
   6  80
  55  80
   6  81
  55  81
  80  81
   6  82
  55  82
  80  82
   6  83
  55  83
  80  83
  82  83
   6  84
  55  84
  80  84
  82  84
  83  84
   6  85
  55  85
  80  85
  82  85
  83  85
  84  85
   6  86
  55  86
  80  86
  82  86
  83  86
  84  86
  85  86
   6  87
  55  87
  80  87
  82  87
  83  87
  84  87
  85  87
  86  87
   6  88
  55  88
  80  88
  82  88
  83  88
  84  88
  85  88
  86  88
  87  88
   6  89
  55  89
  86  89
   6  90
  55  90
  85  90
   6  91
  55  91
  85  91
   6  92
  55  92
  82  92
   6  93
  55  93
  82  93
   6  94
  55  94
  82  94
   6  95
  55  95
  81  95
   6  96
  55  96
  81  96
   6  97
  55  97
  80  97
   6  98
  55  98
  80  98
   6  99
  55  99
  80  99
  81  99
  82  99
  83  99
  84  99
  85  99
  86  99
  87  99
  88  99
  89  99
  90  99
  91  99
  92  99
  93  99
  94  99
  95  99
  96  99
  97  99
  98  99
   6 100
  55 100
   6 101
  55 101
 100 101
 102 101
 103 101
 104 101
 105 101
 106 101
   6 102
  55 102
 100 102
 101 102
 103 102
 104 102
 105 102
 106 102
   6 103
  55 103
 100 103
 101 103
 102 103
 104 103
 105 103
 106 103
   6 104
  55 104
 100 104
 101 104
 102 104
 103 104
 105 104
 106 104
   6 105
  55 105
 100 105
 101 105
 102 105
 103 105
 104 105
 106 105
   6 106
  55 106
 100 106
 101 106
 102 106
 103 106
 104 106
 105 106
   6 107
  55 107
   6 108
  55 108
 107 108
 109 108
   6 109
  55 109
 107 109
 108 109
   6 110
   8 110
  55 110
  78 110
  79 110
  80 110
  81 110
  82 110
  83 110
  84 110
  85 110
  86 110
  87 110
  88 110
  89 110
  90 110
  91 110
  92 110
  93 110
  94 110
  95 110
  96 110
  97 110
  98 110
  99 110
 100 110
 101 110
 102 110
 103 110
 104 110
 105 110
 106 110
 107 110
 108 110
 109 110
 111 110
   6 111
  55 111
   6 112
   9 112
  22 112
  23 112
  55 112
 113 112
 114 112
 116 112
 119 112
 120 112
 121 112
 122 112
 123 112
 125 112
 126 112
   6 113
  55 113
   6 114
  55 114
 113 114
 116 114
   6 115
  55 115
 113 115
 114 115
 116 115
   6 116
  55 116
   6 117
   9 117
  22 117
  23 117
  55 117
 112 117
 113 117
 114 117
 116 117
 119 117
 120 117
 121 117
 122 117
 123 117
 125 117
 126 117
   6 118
   9 118
  22 118
  23 118
  55 118
 112 118
 113 118
 114 118
 116 118
 119 118
 120 118
 121 118
 122 118
 123 118
 125 118
 126 118
   6 119
  55 119
   6 120
  22 120
  55 120
 119 120
 121 120
 122 120
 123 120
 125 120
 420 120
 421 120
   6 121
  22 121
  55 121
 119 121
 120 121
 122 121
 123 121
 125 121
   6 122
  22 122
  55 122
 119 122
 120 122
 121 122
 123 122
 125 122
   6 123
  22 123
  55 123
 119 123
 120 123
 121 123
 122 123
 125 123
 433 123
 434 123
   6 124
  22 124
  55 124
 119 124
 120 124
 121 124
 122 124
 123 124
 125 124
   6 125
  22 125
  55 125
 119 125
 120 125
 121 125
 122 125
 123 125
   6 126
  55 126
   6 127
   9 127
  22 127
  23 127
  55 127
 112 127
 113 127
 114 127
 116 127
 119 127
 120 127
 121 127
 122 127
 123 127
 125 127
 126 127
   6 128
   9 128
  22 128
  23 128
  55 128
 112 128
 113 128
 114 128
 116 128
 119 128
 120 128
 121 128
 122 128
 123 128
 125 128
 126 128
   6 129
   9 129
  22 129
  23 129
  55 129
 112 129
 113 129
 114 129
 116 129
 119 129
 120 129
 121 129
 122 129
 123 129
 125 129
 126 129
   6 130
   9 130
  22 130
  23 130
  55 130
 112 130
 113 130
 114 130
 116 130
 119 130
 120 130
 121 130
 122 130
 123 130
 125 130
 126 130
   6 131
  55 131
   6 132
  13 132
  55 132
 133 132
   6 133
  13 133
  55 133
 132 133
   6 134
  55 134
 135 134
 136 134
 137 134
 138 134
 139 134
 140 134
 141 134
 142 134
 143 134
 144 134
 145 134
 146 134
 147 134
 148 134
 149 134
   6 135
  55 135
   6 136
  55 136
   6 137
  55 137
   6 138
  55 138
   6 139
  55 139
   6 140
  55 140
   6 141
  55 141
   6 142
  55 142
 141 142
 143 142
 144 142
 145 142
 146 142
   6 143
  55 143
 141 143
 142 143
 144 143
 145 143
 146 143
   6 144
  55 144
 141 144
 142 144
 143 144
 145 144
 146 144
   6 145
  55 145
 141 145
 142 145
 143 145
 144 145
 146 145
   6 146
  55 146
 141 146
 142 146
 143 146
 144 146
 145 146
   6 147
  55 147
   6 148
  55 148
   6 149
  55 149
 148 149
   6 150
  55 150
   6 151
  28 151
  44 151
  55 151
  76 151
 153 151
 158 151
 159 151
 160 151
 161 151
 176 151
 177 151
 178 151
 224 151
 280 151
   6 152
  55 152
 153 152
 154 152
 155 152
 156 152
 157 152
 162 152
 163 152
 164 152
 165 152
 166 152
 167 152
 168 152
 169 152
 170 152
 171 152
 172 152
 173 152
 174 152
 175 152
 179 152
   6 153
  55 153
 152 153
 158 153
 159 153
 160 153
 161 153
 176 153
 177 153
 178 153
   6 154
  55 154
 155 154
 158 154
   6 155
  55 155
 154 155
 156 155
 157 155
 159 155
   6 156
  55 156
 154 156
 155 156
 157 156
 160 156
   6 157
  55 157
 154 157
 155 157
 156 157
 161 157
   6 158
  55 158
 153 158
 154 158
 159 158
 160 158
 161 158
 176 158
 177 158
 178 158
   6 159
  55 159
 158 159
 160 159
 161 159
   6 160
  55 160
 156 160
 158 160
 159 160
 161 160
   6 161
  55 161
 157 161
 158 161
 159 161
 160 161
   6 162
  55 162
   6 163
  55 163
 162 163
   6 164
  55 164
 162 164
   6 165
  55 165
 162 165
   6 166
  55 166
 162 166
   6 167
  55 167
 162 167
   6 168
  55 168
 162 168
   6 169
  55 169
 162 169
   6 170
  55 170
 162 170
   6 171
  55 171
 162 171
   6 172
  55 172
 162 172
   6 173
  55 173
 176 173
   6 174
  55 174
 173 174
 175 174
 177 174
 179 174
   6 175
  55 175
 152 175
 173 175
 174 175
 178 175
 179 175
   6 176
  55 176
 153 176
 158 176
 159 176
 160 176
 161 176
 173 176
 177 176
 178 176
   6 177
  55 177
 174 177
 176 177
 178 177
   6 178
  55 178
 175 178
 176 178
 177 178
   6 179
  55 179
   6 180
  55 180
 181 180
 182 180
 183 180
 184 180
 185 180
 186 180
 187 180
 188 180
 189 180
 190 180
 191 180
 192 180
 193 180
 194 180
 195 180
 196 180
 197 180
 198 180
 199 180
 200 180
 201 180
 202 180
 203 180
 204 180
 205 180
 206 180
 207 180
 208 180
 209 180
 210 180
 211 180
 212 180
 213 180
 214 180
 215 180
 216 180
 217 180
 218 180
 219 180
 220 180
 221 180
   6 181
  55 181
   6 182
  55 182
   6 183
  55 183
   6 184
  55 184
 185 184
 186 184
 187 184
 188 184
 197 184
 198 184
 199 184
 200 184
 201 184
 202 184
 203 184
 204 184
 205 184
 206 184
 207 184
 208 184
 209 184
 210 184
 211 184
 212 184
 213 184
 214 184
 215 184
 216 184
 217 184
 218 184
 219 184
 220 184
   6 185
  55 185
 184 185
 186 185
 187 185
 188 185
 189 185
 190 185
 191 185
 192 185
 193 185
 194 185
 195 185
 196 185
 197 185
 198 185
 199 185
 200 185
 201 185
 202 185
 203 185
 204 185
 205 185
 206 185
 207 185
 208 185
 209 185
 210 185
 211 185
 212 185
 213 185
 214 185
 215 185
 216 185
 217 185
 218 185
 219 185
 220 185
   6 186
  55 186
 184 186
 185 186
 187 186
 188 186
 189 186
 190 186
 191 186
 192 186
 193 186
 194 186
 195 186
 196 186
 197 186
 198 186
 199 186
 200 186
 201 186
 202 186
 203 186
 204 186
 205 186
 206 186
 207 186
 208 186
 209 186
 210 186
 211 186
 212 186
 213 186
 214 186
 215 186
 216 186
 217 186
 218 186
 219 186
 220 186
   6 187
  55 187
 184 187
 185 187
 186 187
 188 187
 189 187
 190 187
 191 187
 192 187
 193 187
 194 187
 195 187
 196 187
 197 187
 198 187
 199 187
 200 187
 201 187
 202 187
 203 187
 204 187
 205 187
 206 187
 207 187
 208 187
 209 187
 210 187
 211 187
 212 187
 213 187
 214 187
 215 187
 216 187
 217 187
 218 187
 219 187
 220 187
   6 188
  55 188
 184 188
 185 188
 186 188
 187 188
 189 188
 190 188
 191 188
 192 188
 193 188
 194 188
 195 188
 196 188
 197 188
 198 188
 199 188
 200 188
 201 188
 202 188
 203 188
 204 188
 205 188
 206 188
 207 188
 208 188
 209 188
 210 188
 211 188
 212 188
 213 188
 214 188
 215 188
 216 188
 217 188
 218 188
 219 188
 220 188
   6 189
  55 189
 190 189
 191 189
 192 189
 193 189
 194 189
 195 189
 196 189
   6 190
  55 190
 184 190
 189 190
 191 190
 192 190
 193 190
 194 190
 195 190
 196 190
   6 191
  55 191
 184 191
 189 191
 190 191
 192 191
 193 191
 194 191
 195 191
 196 191
   6 192
  55 192
 184 192
 189 192
 190 192
 191 192
 193 192
 194 192
 195 192
 196 192
   6 193
  55 193
 184 193
 189 193
 190 193
 191 193
 192 193
 194 193
 195 193
 196 193
   6 194
  55 194
 184 194
 189 194
 190 194
 191 194
 192 194
 193 194
 195 194
 196 194
   6 195
  55 195
 184 195
 189 195
 190 195
 191 195
 192 195
 193 195
 194 195
 196 195
   6 196
  55 196
 184 196
 189 196
 190 196
 191 196
 192 196
 193 196
 194 196
 195 196
   6 197
  55 197
 184 197
 185 197
 186 197
 187 197
 188 197
 189 197
 190 197
 191 197
 192 197
 193 197
 194 197
 195 197
 196 197
 198 197
 199 197
 200 197
 201 197
 202 197
 203 197
 204 197
 205 197
 206 197
 207 197
 208 197
 209 197
 210 197
 211 197
 212 197
 213 197
 214 197
 215 197
 216 197
 217 197
 218 197
 219 197
 220 197
   6 198
  55 198
 184 198
 185 198
 186 198
 187 198
 188 198
 189 198
 190 198
 191 198
 192 198
 193 198
 194 198
 195 198
 196 198
 197 198
 199 198
 200 198
 201 198
 202 198
 203 198
 204 198
 205 198
 206 198
 207 198
 208 198
 209 198
 210 198
 211 198
 212 198
 213 198
 214 198
 215 198
 216 198
 217 198
 218 198
 219 198
 220 198
   6 199
  55 199
 184 199
 185 199
 186 199
 187 199
 188 199
 189 199
 190 199
 191 199
 192 199
 193 199
 194 199
 195 199
 196 199
 197 199
 198 199
 200 199
 201 199
 202 199
 203 199
 204 199
 205 199
 206 199
 207 199
 208 199
 209 199
 210 199
 211 199
 212 199
 213 199
 214 199
 215 199
 216 199
 217 199
 218 199
 219 199
 220 199
   6 200
  55 200
 184 200
 185 200
 186 200
 187 200
 188 200
 189 200
 190 200
 191 200
 192 200
 193 200
 194 200
 195 200
 196 200
 197 200
 198 200
 199 200
 201 200
 202 200
 203 200
 204 200
 205 200
 206 200
 207 200
 208 200
 209 200
 210 200
 211 200
 212 200
 213 200
 214 200
 215 200
 216 200
 217 200
 218 200
 219 200
 220 200
   6 201
  55 201
 184 201
 185 201
 186 201
 187 201
 188 201
 189 201
 190 201
 191 201
 192 201
 193 201
 194 201
 195 201
 196 201
 197 201
 198 201
 199 201
 200 201
 202 201
 203 201
 204 201
 205 201
 206 201
 207 201
 208 201
 209 201
 210 201
 211 201
 212 201
 213 201
 214 201
 215 201
 216 201
 217 201
 218 201
 219 201
 220 201
   6 202
  55 202
 184 202
 185 202
 186 202
 187 202
 188 202
 189 202
 190 202
 191 202
 192 202
 193 202
 194 202
 195 202
 196 202
 197 202
 198 202
 199 202
 200 202
 201 202
 203 202
 204 202
 205 202
 206 202
 207 202
 208 202
 209 202
 210 202
 211 202
 212 202
 213 202
 214 202
 215 202
 216 202
 217 202
 218 202
 219 202
 220 202
   6 203
  55 203
 184 203
 185 203
 186 203
 187 203
 188 203
 189 203
 190 203
 191 203
 192 203
 193 203
 194 203
 195 203
 196 203
 197 203
 198 203
 199 203
 200 203
 201 203
 202 203
 204 203
 205 203
 206 203
 207 203
 208 203
 209 203
 210 203
 211 203
 212 203
 213 203
 214 203
 215 203
 216 203
 217 203
 218 203
 219 203
 220 203
   6 204
  55 204
 184 204
 185 204
 186 204
 187 204
 188 204
 189 204
 190 204
 191 204
 192 204
 193 204
 194 204
 195 204
 196 204
 197 204
 198 204
 199 204
 200 204
 201 204
 202 204
 203 204
 205 204
 206 204
 207 204
 208 204
 209 204
 210 204
 211 204
 212 204
 213 204
 214 204
 215 204
 216 204
 217 204
 218 204
 219 204
 220 204
   6 205
  55 205
 184 205
 185 205
 186 205
 187 205
 188 205
 189 205
 190 205
 191 205
 192 205
 193 205
 194 205
 195 205
 196 205
 197 205
 198 205
 199 205
 200 205
 201 205
 202 205
 203 205
 204 205
 206 205
 207 205
 208 205
 209 205
 210 205
 211 205
 212 205
 213 205
 214 205
 215 205
 216 205
 217 205
 218 205
 219 205
 220 205
   6 206
  55 206
 184 206
 185 206
 186 206
 187 206
 188 206
 189 206
 190 206
 191 206
 192 206
 193 206
 194 206
 195 206
 196 206
 197 206
 198 206
 199 206
 200 206
 201 206
 202 206
 203 206
 204 206
 205 206
 207 206
 208 206
 209 206
 210 206
 211 206
 212 206
 213 206
 214 206
 215 206
 216 206
 217 206
 218 206
 219 206
 220 206
   6 207
  55 207
 184 207
 185 207
 186 207
 187 207
 188 207
 189 207
 190 207
 191 207
 192 207
 193 207
 194 207
 195 207
 196 207
 197 207
 198 207
 199 207
 200 207
 201 207
 202 207
 203 207
 204 207
 205 207
 206 207
 208 207
 209 207
 210 207
 211 207
 212 207
 213 207
 214 207
 215 207
 216 207
 217 207
 218 207
 219 207
 220 207
   6 208
  55 208
 184 208
 185 208
 186 208
 187 208
 188 208
 189 208
 190 208
 191 208
 192 208
 193 208
 194 208
 195 208
 196 208
 197 208
 198 208
 199 208
 200 208
 201 208
 202 208
 203 208
 204 208
 205 208
 206 208
 207 208
 209 208
 210 208
 211 208
 212 208
 213 208
 214 208
 215 208
 216 208
 217 208
 218 208
 219 208
 220 208
   6 209
  55 209
 184 209
 185 209
 186 209
 187 209
 188 209
 189 209
 190 209
 191 209
 192 209
 193 209
 194 209
 195 209
 196 209
 197 209
 198 209
 199 209
 200 209
 201 209
 202 209
 203 209
 204 209
 205 209
 206 209
 207 209
 208 209
 210 209
 211 209
 212 209
 213 209
 214 209
 215 209
 216 209
 217 209
 218 209
 219 209
 220 209
   6 210
  55 210
 184 210
 185 210
 186 210
 187 210
 188 210
 189 210
 190 210
 191 210
 192 210
 193 210
 194 210
 195 210
 196 210
 197 210
 198 210
 199 210
 200 210
 201 210
 202 210
 203 210
 204 210
 205 210
 206 210
 207 210
 208 210
 209 210
 211 210
 212 210
 213 210
 214 210
 215 210
 216 210
 217 210
 218 210
 219 210
 220 210
   6 211
  55 211
 184 211
 185 211
 186 211
 187 211
 188 211
 189 211
 190 211
 191 211
 192 211
 193 211
 194 211
 195 211
 196 211
 197 211
 198 211
 199 211
 200 211
 201 211
 202 211
 203 211
 204 211
 205 211
 206 211
 207 211
 208 211
 209 211
 210 211
 212 211
 213 211
 214 211
 215 211
 216 211
 217 211
 218 211
 219 211
 220 211
   6 212
  55 212
 184 212
 185 212
 186 212
 187 212
 188 212
 189 212
 190 212
 191 212
 192 212
 193 212
 194 212
 195 212
 196 212
 197 212
 198 212
 199 212
 200 212
 201 212
 202 212
 203 212
 204 212
 205 212
 206 212
 207 212
 208 212
 209 212
 210 212
 211 212
 213 212
 214 212
 215 212
 216 212
 217 212
 218 212
 219 212
 220 212
   6 213
  55 213
 184 213
 185 213
 186 213
 187 213
 188 213
 189 213
 190 213
 191 213
 192 213
 193 213
 194 213
 195 213
 196 213
 197 213
 198 213
 199 213
 200 213
 201 213
 202 213
 203 213
 204 213
 205 213
 206 213
 207 213
 208 213
 209 213
 210 213
 211 213
 212 213
 214 213
 215 213
 216 213
 217 213
 218 213
 219 213
 220 213
   6 214
  55 214
 184 214
 185 214
 186 214
 187 214
 188 214
 189 214
 190 214
 191 214
 192 214
 193 214
 194 214
 195 214
 196 214
 197 214
 198 214
 199 214
 200 214
 201 214
 202 214
 203 214
 204 214
 205 214
 206 214
 207 214
 208 214
 209 214
 210 214
 211 214
 212 214
 213 214
 215 214
 216 214
 217 214
 218 214
 219 214
 220 214
   6 215
  55 215
 184 215
 185 215
 186 215
 187 215
 188 215
 189 215
 190 215
 191 215
 192 215
 193 215
 194 215
 195 215
 196 215
 197 215
 198 215
 199 215
 200 215
 201 215
 202 215
 203 215
 204 215
 205 215
 206 215
 207 215
 208 215
 209 215
 210 215
 211 215
 212 215
 213 215
 214 215
 216 215
 217 215
 218 215
 219 215
 220 215
   6 216
  55 216
 184 216
 185 216
 186 216
 187 216
 188 216
 189 216
 190 216
 191 216
 192 216
 193 216
 194 216
 195 216
 196 216
 197 216
 198 216
 199 216
 200 216
 201 216
 202 216
 203 216
 204 216
 205 216
 206 216
 207 216
 208 216
 209 216
 210 216
 211 216
 212 216
 213 216
 214 216
 215 216
 217 216
 218 216
 219 216
 220 216
   6 217
  55 217
 184 217
 185 217
 186 217
 187 217
 188 217
 189 217
 190 217
 191 217
 192 217
 193 217
 194 217
 195 217
 196 217
 197 217
 198 217
 199 217
 200 217
 201 217
 202 217
 203 217
 204 217
 205 217
 206 217
 207 217
 208 217
 209 217
 210 217
 211 217
 212 217
 213 217
 214 217
 215 217
 216 217
 218 217
 219 217
 220 217
   6 218
  55 218
 184 218
 185 218
 186 218
 187 218
 188 218
 189 218
 190 218
 191 218
 192 218
 193 218
 194 218
 195 218
 196 218
 197 218
 198 218
 199 218
 200 218
 201 218
 202 218
 203 218
 204 218
 205 218
 206 218
 207 218
 208 218
 209 218
 210 218
 211 218
 212 218
 213 218
 214 218
 215 218
 216 218
 217 218
 219 218
 220 218
   6 219
  55 219
 184 219
 185 219
 186 219
 187 219
 188 219
 189 219
 190 219
 191 219
 192 219
 193 219
 194 219
 195 219
 196 219
 197 219
 198 219
 199 219
 200 219
 201 219
 202 219
 203 219
 204 219
 205 219
 206 219
 207 219
 208 219
 209 219
 210 219
 211 219
 212 219
 213 219
 214 219
 215 219
 216 219
 217 219
 218 219
 220 219
   6 220
  55 220
 184 220
 185 220
 186 220
 187 220
 188 220
 189 220
 190 220
 191 220
 192 220
 193 220
 194 220
 195 220
 196 220
 197 220
 198 220
 199 220
 200 220
 201 220
 202 220
 203 220
 204 220
 205 220
 206 220
 207 220
 208 220
 209 220
 210 220
 211 220
 212 220
 213 220
 214 220
 215 220
 216 220
 217 220
 218 220
 219 220
   6 221
  55 221
 180 221
 181 221
 182 221
 183 221
 184 221
 185 221
 186 221
 187 221
 188 221
 189 221
 190 221
 191 221
 192 221
 193 221
 194 221
 195 221
 196 221
 197 221
 198 221
 199 221
 200 221
 201 221
 202 221
 203 221
 204 221
 205 221
 206 221
 207 221
 208 221
 209 221
 210 221
 211 221
 212 221
 213 221
 214 221
 215 221
 216 221
 217 221
 218 221
 219 221
 220 221
   6 222
  55 222
   6 223
  55 223
 224 223
   6 224
  55 224
 223 224
   6 225
  55 225
 226 225
 227 225
 228 225
 229 225
 230 225
 231 225
 232 225
 233 225
   6 226
  55 226
 225 226
 227 226
 228 226
 229 226
 230 226
 231 226
 232 226
 233 226
   6 227
  55 227
 225 227
 226 227
 228 227
 229 227
 230 227
 231 227
 232 227
 233 227
   6 228
  55 228
 225 228
 226 228
 227 228
 229 228
 230 228
 231 228
 232 228
 233 228
   6 229
  55 229
 225 229
 226 229
 227 229
 228 229
 230 229
 231 229
 232 229
 233 229
   6 230
  55 230
 225 230
 226 230
 227 230
 228 230
 229 230
 231 230
 232 230
 233 230
   6 231
  55 231
 225 231
 226 231
 227 231
 228 231
 229 231
 230 231
 232 231
 233 231
   6 232
  55 232
 225 232
 226 232
 227 232
 228 232
 229 232
 230 232
 231 232
 233 232
   6 233
  55 233
 225 233
 226 233
 227 233
 228 233
 229 233
 230 233
 231 233
 232 233
   6 234
  55 234
   6 235
  55 235
   6 236
  47 236
  55 236
 235 236
 237 236
 238 236
 239 236
 240 236
   6 237
  47 237
  55 237
 235 237
 236 237
 238 237
 239 237
 240 237
   6 238
  47 238
  55 238
 235 238
 236 238
 237 238
 239 238
 240 238
   6 239
  47 239
  55 239
 235 239
 236 239
 237 239
 238 239
 240 239
   6 240
  47 240
  55 240
 235 240
 236 240
 237 240
 238 240
 239 240
   6 241
  55 241
   6 242
  55 242
 243 242
 244 242
 245 242
 246 242
 247 242
 248 242
 249 242
   6 243
  55 243
 242 243
 244 243
 245 243
 246 243
 247 243
 248 243
 249 243
   6 244
  55 244
   6 245
  55 245
 244 245
 246 245
   6 246
  55 246
 244 246
   6 247
  55 247
 242 247
 248 247
   6 248
  55 248
 242 248
 247 248
   6 249
  55 249
   6 250
  55 250
 251 250
   6 251
  55 251
   6 252
  55 252
 124 252
 253 252
 254 252
 255 252
 256 252
 257 252
 258 252
 259 252
 260 252
 262 252
 263 252
 265 252
 266 252
 267 252
 269 252
 271 252
 272 252
 273 252
 274 252
   6 253
  55 253
 124 253
 252 253
 254 253
 255 253
 256 253
 257 253
 258 253
 259 253
 260 253
 262 253
 263 253
 265 253
 266 253
 267 253
 269 253
 271 253
 272 253
 273 253
 274 253
   6 254
  55 254
 124 254
 252 254
 253 254
 255 254
 256 254
 257 254
 258 254
 259 254
 260 254
 262 254
 263 254
 265 254
 266 254
 267 254
 269 254
 271 254
 272 254
 273 254
 274 254
   6 255
  55 255
 124 255
 252 255
 253 255
 254 255
 256 255
 257 255
 258 255
 259 255
 260 255
 262 255
 263 255
 265 255
 266 255
 267 255
 269 255
 271 255
 272 255
 273 255
 274 255
   6 256
  55 256
   6 257
  55 257
 252 257
 255 257
 256 257
 258 257
 259 257
 260 257
 262 257
 263 257
   6 258
  55 258
 252 258
 255 258
 256 258
 257 258
 259 258
 260 258
 262 258
 263 258
   6 259
  55 259
 252 259
 255 259
 256 259
 257 259
 258 259
 260 259
 262 259
 263 259
   6 260
  55 260
 252 260
 255 260
 256 260
 257 260
 258 260
 259 260
 262 260
 263 260
   6 261
  55 261
 255 261
 256 261
 257 261
 258 261
 259 261
 260 261
 262 261
 263 261
   6 262
  55 262
   6 263
  55 263
   6 264
  55 264
 124 264
 252 264
 253 264
 254 264
 255 264
 256 264
 257 264
 258 264
 259 264
 260 264
 262 264
 263 264
 265 264
 266 264
 267 264
 269 264
 271 264
 272 264
 273 264
 274 264
   6 265
  55 265
   6 266
  55 266
 252 266
 265 266
 267 266
   6 267
  55 267
 252 267
 265 267
 266 267
   6 268
  55 268
 265 268
 266 268
 267 268
   6 269
  55 269
 252 269
   6 270
  55 270
 124 270
 252 270
 253 270
 254 270
 255 270
 256 270
 257 270
 258 270
 259 270
 260 270
 262 270
 263 270
 265 270
 266 270
 267 270
 269 270
 271 270
 272 270
 273 270
 274 270
   6 271
  55 271
   6 272
  36 272
  55 272
 124 272
 252 272
 253 272
 254 272
 255 272
 256 272
 257 272
 258 272
 259 272
 260 272
 262 272
 263 272
 265 272
 266 272
 267 272
 269 272
 271 272
 273 272
 274 272
   6 273
  55 273
 272 273
   6 274
  55 274
 253 274
   6 275
  55 275
 124 275
 252 275
 253 275
 254 275
 255 275
 256 275
 257 275
 258 275
 259 275
 260 275
 262 275
 263 275
 265 275
 266 275
 267 275
 269 275
 271 275
 272 275
 273 275
 274 275
   6 276
  55 276
   6 277
  55 277
   6 278
  55 278
   6 279
  12 279
  55 279
 276 279
 277 279
 278 279
 280 279
 281 279
 282 279
 283 279
 284 279
 285 279
 286 279
 287 279
 288 279
 289 279
 290 279
 291 279
   6 280
  55 280
 279 280
   6 281
  12 281
  55 281
 276 281
 277 281
 278 281
 279 281
 282 281
 283 281
 284 281
 285 281
 286 281
 287 281
 288 281
 289 281
 290 281
 291 281
   6 282
  12 282
  55 282
 276 282
 277 282
 278 282
 279 282
 281 282
 283 282
 284 282
 285 282
 286 282
 287 282
 288 282
 289 282
 290 282
 291 282
   6 283
  12 283
  55 283
 276 283
 277 283
 278 283
 279 283
 281 283
 282 283
 284 283
 285 283
 286 283
 287 283
 288 283
 289 283
 290 283
 291 283
   6 284
  12 284
  55 284
 276 284
 277 284
 278 284
 279 284
 281 284
 282 284
 283 284
 285 284
 286 284
 287 284
 288 284
 289 284
 290 284
 291 284
   6 285
  12 285
  55 285
 276 285
 277 285
 278 285
 279 285
 281 285
 282 285
 283 285
 284 285
 286 285
 287 285
 288 285
 289 285
 290 285
 291 285
   6 286
  12 286
  55 286
 276 286
 277 286
 278 286
 279 286
 281 286
 282 286
 283 286
 284 286
 285 286
 287 286
 288 286
 289 286
 290 286
 291 286
   6 287
  12 287
  55 287
 276 287
 277 287
 278 287
 279 287
 281 287
 282 287
 283 287
 284 287
 285 287
 286 287
 288 287
 289 287
 290 287
 291 287
   6 288
  12 288
  55 288
 276 288
 277 288
 278 288
 279 288
 281 288
 282 288
 283 288
 284 288
 285 288
 286 288
 287 288
 289 288
 290 288
 291 288
   6 289
  12 289
  55 289
 276 289
 277 289
 278 289
 279 289
 281 289
 282 289
 283 289
 284 289
 285 289
 286 289
 287 289
 288 289
 290 289
 291 289
   6 290
  12 290
  55 290
 276 290
 277 290
 278 290
 279 290
 281 290
 282 290
 283 290
 284 290
 285 290
 286 290
 287 290
 288 290
 289 290
 291 290
   6 291
  12 291
  55 291
 276 291
 277 291
 278 291
 279 291
 281 291
 282 291
 283 291
 284 291
 285 291
 286 291
 287 291
 288 291
 289 291
 290 291
   6 292
  55 292
   6 293
  55 293
   6 294
  55 294
 293 294
   6 295
  55 295
 293 295
 294 295
 296 295
 297 295
 298 295
 299 295
 300 295
 301 295
 302 295
 303 295
 304 295
 305 295
 306 295
 307 295
 308 295
 309 295
 310 295
 311 295
 312 295
 313 295
 314 295
 315 295
 316 295
 317 295
 318 295
 319 295
 320 295
 321 295
 322 295
 323 295
 324 295
 325 295
 326 295
 327 295
 328 295
 329 295
 330 295
 331 295
 332 295
 333 295
 334 295
 335 295
 336 295
 337 295
 338 295
 339 295
 340 295
 341 295
 342 295
 343 295
 344 295
 345 295
 346 295
 347 295
 348 295
 349 295
 350 295
 351 295
 352 295
 353 295
 354 295
 355 295
 356 295
 357 295
 358 295
 359 295
 360 295
 361 295
 362 295
 363 295
 364 295
 365 295
 366 295
 367 295
 368 295
 369 295
 370 295
 371 295
 372 295
 374 295
 375 295
 376 295
 377 295
 378 295
 379 295
 380 295
 381 295
 382 295
 383 295
 384 295
 385 295
 386 295
 387 295
 388 295
 389 295
 390 295
 391 295
 392 295
 393 295
 394 295
 395 295
 396 295
 397 295
 398 295
 399 295
 400 295
 401 295
 402 295
 403 295
 404 295
 405 295
 406 295
 407 295
 408 295
 409 295
 410 295
 411 295
 412 295
 413 295
 414 295
 415 295
 416 295
 417 295
 418 295
 419 295
 420 295
 421 295
 422 295
 423 295
 424 295
 425 295
 426 295
 427 295
 428 295
 429 295
 430 295
 431 295
 432 295
 433 295
 434 295
 435 295
 436 295
 437 295
 438 295
 439 295
 440 295
 441 295
 442 295
 443 295
 444 295
 445 295
 446 295
 447 295
 448 295
 449 295
 450 295
 451 295
 452 295
 453 295
 454 295
 455 295
 456 295
 457 295
 458 295
 459 295
 460 295
 461 295
 462 295
 463 295
 464 295
 465 295
 466 295
 467 295
 468 295
 469 295
 470 295
 471 295
 472 295
 473 295
 474 295
 475 295
 476 295
 477 295
 478 295
 479 295
 480 295
 481 295
 482 295
 483 295
 484 295
 485 295
 486 295
 487 295
 488 295
 489 295
 490 295
 491 295
 492 295
 493 295
 494 295
 495 295
 496 295
 497 295
 498 295
 499 295
 500 295
   6 296
  55 296
   6 297
  55 297
   6 298
  55 298
   6 299
  55 299
   6 300
  55 300
   6 301
  55 301
   6 302
  55 302
   6 303
  55 303
   6 304
  55 304
   6 305
  55 305
   6 306
  55 306
   6 307
  55 307
   6 308
  55 308
   6 309
  55 309
   6 310
  55 310
   6 311
  55 311
   6 312
  55 312
   6 313
  55 313
   6 314
  55 314
   6 315
  55 315
   6 316
  55 316
   6 317
  55 317
   6 318
  55 318
   6 319
  55 319
   6 320
  55 320
   6 321
  55 321
   6 322
  55 322
   6 323
  55 323
   6 324
  55 324
   6 325
  55 325
   6 326
  55 326
   6 327
  55 327
   6 328
  55 328
   6 329
  55 329
   6 330
  55 330
   6 331
  55 331
   6 332
  55 332
   6 333
  55 333
   6 334
  55 334
   6 335
  55 335
   6 336
  55 336
   6 337
  55 337
   6 338
  55 338
   6 339
  55 339
   6 340
  55 340
   6 341
  55 341
   6 342
  55 342
   6 343
  55 343
   6 344
  55 344
   6 345
  55 345
   6 346
  55 346
   6 347
  55 347
   6 348
  55 348
   6 349
  55 349
   6 350
  55 350
 296 350
 297 350
 298 350
 299 350
 300 350
 301 350
 302 350
 303 350
 304 350
 305 350
 306 350
 307 350
 308 350
 309 350
 310 350
 311 350
 312 350
 313 350
 314 350
 315 350
 316 350
 317 350
 318 350
 319 350
 320 350
 321 350
 322 350
 323 350
 324 350
 325 350
 326 350
 327 350
 328 350
 329 350
 330 350
 331 350
 332 350
 333 350
 334 350
 335 350
 336 350
 337 350
 338 350
 339 350
 340 350
 341 350
 342 350
 343 350
 344 350
 345 350
 346 350
 347 350
 348 350
 349 350
   6 351
  55 351
   6 352
  55 352
   6 353
  55 353
   6 354
  55 354
   6 355
  55 355
 354 355
   6 356
  55 356
   6 357
  55 357
 356 357
   6 358
  55 358
   6 359
  55 359
 358 359
   6 360
  55 360
   6 361
  55 361
 360 361
   6 362
  55 362
   6 363
  55 363
 362 363
   6 364
  55 364
   6 365
  55 365
   6 366
  55 366
 365 366
   6 367
  55 367
   6 368
  55 368
   6 369
  55 369
 368 369
   6 370
  55 370
   6 371
  55 371
 370 371
 372 371
   6 372
  55 372
 370 372
 371 372
   6 373
  55 373
   6 374
  55 374
   6 375
  55 375
 374 375
   6 376
  55 376
   6 377
  55 377
 376 377
   6 378
  55 378
   6 379
  55 379
   6 380
  55 380
 379 380
   6 381
  55 381
   6 382
  55 382
   6 383
  55 383
 382 383
 384 383
   6 384
  55 384
 382 384
 383 384
   6 385
  55 385
   6 386
  55 386
 385 386
   6 387
  55 387
   6 388
  55 388
 387 388
   6 389
  55 389
   6 390
  55 390
   6 391
  55 391
   6 392
  55 392
   6 393
  55 393
 392 393
 394 393
   6 394
  55 394
 392 394
 393 394
   6 395
  55 395
   6 396
  55 396
 395 396
   6 397
  55 397
   6 398
  55 398
 397 398
   6 399
  55 399
   6 400
  55 400
   6 401
  55 401
 400 401
 402 401
   6 402
  55 402
 400 402
 401 402
   6 403
  55 403
   6 404
  55 404
   6 405
  55 405
 404 405
 406 405
   6 406
  55 406
 404 406
 405 406
   6 407
  55 407
   6 408
  55 408
 407 408
   6 409
  55 409
   6 410
  55 410
 409 410
   6 411
  55 411
   6 412
  55 412
 411 412
 413 412
 414 412
 415 412
   6 413
  55 413
 411 413
 412 413
 414 413
 415 413
   6 414
  55 414
 411 414
 412 414
 413 414
 415 414
   6 415
  55 415
 411 415
 412 415
 413 415
 414 415
   6 416
  55 416
   6 417
  55 417
 416 417
   6 418
  55 418
   6 419
  55 419
 418 419
   6 420
  55 420
   6 421
  55 421
 420 421
   6 422
  55 422
   6 423
  55 423
 422 423
 424 423
 425 423
 426 423
 427 423
 428 423
 429 423
   6 424
  55 424
 422 424
 423 424
 425 424
 426 424
 427 424
 428 424
 429 424
   6 425
  55 425
   6 426
  55 426
   6 427
  55 427
   6 428
  55 428
   6 429
  55 429
   6 430
  55 430
   6 431
  55 431
 430 431
   6 432
  55 432
   6 433
  55 433
 432 433
   6 434
  55 434
   6 435
  55 435
 434 435
   6 436
  55 436
   6 437
  55 437
   6 438
  55 438
   6 439
  55 439
 438 439
   6 440
  55 440
   6 441
  55 441
   6 442
  55 442
 441 442
   6 443
  55 443
   6 444
  55 444
 443 444
   6 445
  55 445
   6 446
  55 446
   6 447
  55 447
 446 447
   6 448
  55 448
   6 449
  55 449
   6 450
  55 450
 449 450
   6 451
  55 451
   6 452
  55 452
 451 452
   6 453
  55 453
   6 454
  55 454
 453 454
   6 455
  55 455
   6 456
  55 456
 455 456
 457 456
   6 457
  55 457
 455 457
 456 457
   6 458
  55 458
   6 459
  55 459
 458 459
 460 459
 461 459
   6 460
  55 460
 458 460
 459 460
 461 460
   6 461
  55 461
 458 461
 459 461
 460 461
   6 462
  55 462
   6 463
  55 463
 462 463
   6 464
  55 464
   6 465
  55 465
 464 465
   6 466
  55 466
   6 467
  55 467
 466 467
   6 468
  55 468
   6 469
  55 469
 468 469
   6 470
  55 470
   6 471
  55 471
   6 472
  55 472
 471 472
 473 472
 474 472
   6 473
  55 473
 471 473
 472 473
 474 473
   6 474
  55 474
 471 474
 472 474
 473 474
   6 475
  55 475
   6 476
  55 476
 475 476
   6 477
  55 477
   6 478
  55 478
 477 478
   6 479
  55 479
   6 480
  55 480
 479 480
 481 480
   6 481
  55 481
 479 481
 480 481
   6 482
  55 482
   6 483
  55 483
 482 483
   6 484
  55 484
   6 485
  55 485
 484 485
 486 485
 487 485
   6 486
  55 486
 484 486
 485 486
 487 486
   6 487
  55 487
 484 487
 485 487
 486 487
   6 488
  55 488
   6 489
  55 489
 488 489
   6 490
  55 490
   6 491
  55 491
 490 491
   6 492
  55 492
   6 493
  55 493
 492 493
   6 494
  55 494
   6 495
  55 495
 494 495
   6 496
  55 496
   6 497
  55 497
   6 498
  55 498
 497 498
 499 498
   6 499
  55 499
 497 499
 498 499
   6 500
  55 500
