I,E,S,R
0.001000,0.000850,0.998150,0.000000
0.001000,0.001550,0.997350,0.000100
0.001250,0.001950,0.996550,0.000250
0.001200,0.002650,0.995600,0.000550
0.001700,0.003300,0.994350,0.000650
0.002600,0.004050,0.992600,0.000750
0.003650,0.005650,0.989800,0.000900
0.004300,0.007600,0.986700,0.001400
0.005600,0.009000,0.983200,0.002200
0.007150,0.012050,0.977600,0.003200
0.009850,0.015250,0.970900,0.004000
0.012750,0.019100,0.962500,0.005650
0.016250,0.024950,0.951750,0.007050
0.020500,0.031350,0.938900,0.009250
0.026400,0.041150,0.920550,0.011900
0.034900,0.049700,0.899750,0.015650
0.043800,0.064700,0.871350,0.020150
0.056550,0.079300,0.838750,0.025400
0.071150,0.099050,0.796350,0.033450
0.087800,0.120700,0.748050,0.043450
0.108600,0.145500,0.690600,0.055300
0.132950,0.170100,0.626650,0.070300
0.162000,0.191450,0.558350,0.088200
0.195200,0.212000,0.484250,0.108550
0.225600,0.227500,0.412000,0.134900
0.262800,0.234850,0.338550,0.163800
0.294700,0.232950,0.273850,0.198500
0.317400,0.228150,0.216400,0.238050
0.339100,0.214550,0.166400,0.279950
0.355450,0.193500,0.127550,0.323500
0.364300,0.168300,0.097100,0.370300
0.364800,0.145500,0.074200,0.415500
0.355300,0.123000,0.056900,0.464800
0.340800,0.104050,0.044550,0.510600
0.328950,0.082600,0.035300,0.553150
0.308000,0.067650,0.028350,0.596000
0.286650,0.055050,0.023400,0.634900
0.264600,0.043100,0.020500,0.671800
0.242250,0.034550,0.019150,0.704050
0.220600,0.026500,0.018300,0.734600
0.198200,0.022400,0.017800,0.761600
0.178450,0.017300,0.018650,0.785600
0.160250,0.014550,0.019550,0.805650
0.141750,0.012450,0.019900,0.825900
0.126150,0.011000,0.020800,0.842050
0.113500,0.008900,0.022350,0.855250
0.099700,0.008350,0.022350,0.869600
0.088900,0.007350,0.023450,0.880300
0.079000,0.006500,0.025350,0.889150
0.069200,0.006300,0.027200,0.897300
0.061050,0.005700,0.029600,0.903650
0.054000,0.005000,0.031650,0.909350
0.046900,0.004900,0.033750,0.914450
0.041950,0.003750,0.035550,0.918750
0.036200,0.004350,0.037950,0.921500
0.032350,0.004050,0.040500,0.923100
0.028300,0.003750,0.043350,0.924600
0.024700,0.003500,0.045950,0.925850
0.022000,0.003200,0.048650,0.926150
0.019750,0.002750,0.050900,0.926600
0.017850,0.002550,0.053750,0.925850
0.016000,0.002100,0.056350,0.925550
0.014400,0.002300,0.059400,0.923900
0.012550,0.002300,0.061800,0.923350
0.011350,0.002300,0.064650,0.921700
0.010450,0.002300,0.067550,0.919700
0.009650,0.002150,0.069850,0.918350
0.008800,0.002250,0.072650,0.916300
0.008050,0.002300,0.075600,0.914050
0.007550,0.002200,0.078700,0.911550
0.007050,0.002250,0.081400,0.909300
0.006500,0.002200,0.083600,0.907700
0.006250,0.001950,0.087150,0.904650
0.006000,0.001600,0.090400,0.902000
0.005500,0.001350,0.092700,0.900450
0.005050,0.001300,0.096250,0.897400
0.004550,0.001250,0.098900,0.895300
0.004050,0.001400,0.101600,0.892950
0.003500,0.001200,0.104500,0.890800
0.003300,0.001100,0.107550,0.888050
0.003050,0.001250,0.109450,0.886250
0.003150,0.000800,0.112100,0.883950
0.002950,0.000750,0.115750,0.880550
0.002800,0.000600,0.118850,0.877750
0.002550,0.000400,0.121600,0.875450
0.002300,0.000500,0.124300,0.872900
0.002200,0.000650,0.127000,0.870150
0.001950,0.000550,0.130000,0.867500
0.001650,0.000600,0.132400,0.865350
0.001650,0.000400,0.135700,0.862250
0.001650,0.000450,0.138050,0.859850
0.001550,0.000750,0.140150,0.857550
0.001450,0.000700,0.142550,0.855300
0.001300,0.000600,0.144750,0.853350
0.001150,0.000600,0.146900,0.851350
0.001100,0.000600,0.149500,0.848800
0.001100,0.000550,0.152500,0.845850
0.001000,0.000550,0.154750,0.843700
0.001000,0.000500,0.157400,0.841100
0.000850,0.000450,0.160250,0.838450
0.000900,0.000500,0.162650,0.835950
0.000950,0.000350,0.165600,0.833100
0.001050,0.000150,0.167900,0.830900
0.000950,0.000200,0.170250,0.828600
0.000850,0.000250,0.172600,0.826300
0.000850,0.000450,0.174800,0.823900
0.000750,0.000500,0.176950,0.821800
0.000700,0.000400,0.179250,0.819650
0.000700,0.000500,0.181300,0.817500
0.000950,0.000450,0.183500,0.815100
0.000800,0.000450,0.186400,0.812350
0.000850,0.000400,0.189150,0.809600
0.000900,0.000450,0.191800,0.806850
0.000800,0.000550,0.194500,0.804150
0.000850,0.000650,0.196350,0.802150
0.000950,0.000550,0.197950,0.800550
0.000950,0.000550,0.201300,0.797200
0.000950,0.000550,0.203700,0.794800
0.000900,0.000750,0.206000,0.792350
0.000850,0.000750,0.207600,0.790800
0.001050,0.000600,0.209300,0.789050
0.001150,0.000500,0.211800,0.786550
0.001100,0.000350,0.214200,0.784350
0.000950,0.000400,0.216800,0.781850
0.001000,0.000650,0.218500,0.779850
0.001100,0.000700,0.219700,0.778500
0.001050,0.000700,0.221850,0.776400
0.001200,0.000600,0.223650,0.774550
0.001150,0.000600,0.226150,0.772100
0.001100,0.000450,0.228000,0.770450
0.001050,0.000500,0.230250,0.768200
0.001100,0.000500,0.231850,0.766550
0.001150,0.000700,0.233650,0.764500
0.001200,0.000950,0.235800,0.762050
0.001250,0.000850,0.237650,0.760250
0.001700,0.000500,0.239650,0.758150
0.001700,0.000600,0.241550,0.756150
0.001350,0.000750,0.243900,0.754000
0.001150,0.000950,0.245500,0.752400
0.001150,0.001000,0.247600,0.750250
0.001300,0.000800,0.249900,0.748000
0.001250,0.001150,0.251500,0.746100
0.001200,0.001000,0.253700,0.744100
0.001200,0.000950,0.256150,0.741700
0.001000,0.000750,0.258700,0.739550
0.000950,0.000600,0.260750,0.737700
0.000950,0.000550,0.262500,0.736000
0.001100,0.000600,0.263950,0.734350
0.001100,0.000750,0.265450,0.732700
0.001200,0.000650,0.267350,0.730800
0.001150,0.000650,0.268800,0.729400
0.000850,0.000700,0.270300,0.728150
0.000950,0.000550,0.272650,0.725850
0.000950,0.000700,0.274500,0.723850
0.000950,0.000600,0.276100,0.722350
0.001150,0.000650,0.277900,0.720300
0.001150,0.000550,0.279900,0.718400
0.001200,0.000750,0.282200,0.715850
0.001350,0.000750,0.284000,0.713900
0.001450,0.001050,0.285100,0.712400
0.001500,0.001250,0.286450,0.710800
0.001400,0.001500,0.288000,0.709100
0.001850,0.001450,0.289300,0.707400
0.001850,0.001600,0.290550,0.706000
0.001900,0.001550,0.292250,0.704300
0.002000,0.001450,0.293550,0.703000
0.002100,0.001500,0.294750,0.701650
0.002250,0.001550,0.296250,0.699950
0.002200,0.001450,0.297900,0.698450
0.002150,0.001550,0.299300,0.697000
0.002550,0.001400,0.301050,0.695000
0.002550,0.001650,0.302450,0.693350
0.002600,0.001400,0.304350,0.691650
0.002600,0.001850,0.305750,0.689800
0.002750,0.002000,0.307350,0.687900
0.003050,0.002250,0.308600,0.686100
0.003050,0.002600,0.309750,0.684600
0.003500,0.002400,0.311200,0.682900
0.003400,0.002700,0.312700,0.681200
0.003500,0.002800,0.313550,0.680150
0.003750,0.003050,0.314100,0.679100
0.004500,0.002700,0.316100,0.676700
0.004650,0.002700,0.317550,0.675100
0.004650,0.003050,0.318250,0.674050
0.004900,0.003150,0.318800,0.673150
0.005050,0.003800,0.319350,0.671800
0.005750,0.004250,0.319550,0.670450
0.006300,0.004050,0.320650,0.669000
0.006850,0.004100,0.321550,0.667500
0.006550,0.005000,0.322500,0.665950
0.006700,0.005650,0.322650,0.665000
0.007350,0.005500,0.322750,0.664400
0.007800,0.006100,0.322650,0.663450
0.008150,0.006950,0.321950,0.662950
0.008650,0.007150,0.321250,0.662950
0.010000,0.007150,0.321000,0.661850
0.011350,0.007200,0.320350,0.661100
0.011950,0.007700,0.319800,0.660550
0.012800,0.008350,0.318700,0.660150
0.013650,0.009750,0.316600,0.660000
0.015100,0.010150,0.315050,0.659700
0.016400,0.010950,0.313200,0.659450
0.017800,0.011800,0.310850,0.659550
0.018750,0.013100,0.308100,0.660050
0.020150,0.014650,0.304150,0.661050
0.021300,0.015450,0.301250,0.662000
0.023050,0.015800,0.298550,0.662600
0.024550,0.016750,0.295200,0.663500
0.026300,0.018150,0.291450,0.664100
0.027150,0.019950,0.286900,0.666000
0.028250,0.021250,0.282250,0.668250
0.030450,0.021350,0.278000,0.670200
0.032150,0.022450,0.273100,0.672300
0.032500,0.024050,0.267800,0.675650
0.035200,0.024050,0.263200,0.677550
0.036700,0.024850,0.258500,0.679950
0.038750,0.024700,0.254100,0.682450
0.039950,0.025600,0.249750,0.684700
0.041150,0.026250,0.244400,0.688200
0.043950,0.026300,0.239100,0.690650
0.046850,0.024900,0.234350,0.693900
0.047150,0.026150,0.228700,0.698000
0.048950,0.026150,0.222400,0.702500
0.048850,0.026200,0.218050,0.706900
0.049000,0.029450,0.211100,0.710450
0.050250,0.028900,0.206200,0.714650
0.051650,0.028300,0.200550,0.719500
0.052750,0.028200,0.195600,0.723450
0.052400,0.028700,0.190800,0.728100
0.053250,0.028550,0.185900,0.732300
0.055050,0.026700,0.182300,0.735950
0.056100,0.026250,0.177100,0.740550
0.056750,0.024250,0.174300,0.744700
0.055950,0.025150,0.169400,0.749500
0.055000,0.024950,0.165000,0.755050
0.054700,0.025300,0.160700,0.759300
0.055000,0.024100,0.157950,0.762950
0.052950,0.023900,0.155250,0.767900
0.051850,0.023550,0.151950,0.772650
0.052600,0.022500,0.148800,0.776100
0.050600,0.023100,0.146000,0.780300
0.051100,0.022500,0.143800,0.782600
0.049250,0.022500,0.141800,0.786450
0.048300,0.022050,0.139600,0.790050
0.048200,0.021900,0.137450,0.792450
0.047400,0.020800,0.135700,0.796100
0.047600,0.019750,0.134100,0.798550
0.047100,0.018800,0.133350,0.800750
0.046350,0.018100,0.132550,0.803000
0.044500,0.017750,0.132600,0.805150
0.042450,0.017150,0.132550,0.807850
0.042250,0.016800,0.131050,0.809900
0.041500,0.015750,0.131150,0.811600
0.040500,0.015850,0.129750,0.813900
0.038050,0.016050,0.129500,0.816400
0.037650,0.014000,0.130500,0.817850
0.036100,0.013700,0.131600,0.818600
0.035800,0.012450,0.131950,0.819800
0.034550,0.011950,0.133250,0.820250
0.033900,0.011800,0.133250,0.821050
0.032400,0.011800,0.134050,0.821750
0.030850,0.012800,0.134950,0.821400
0.029800,0.012500,0.135750,0.821950
0.028650,0.012400,0.138050,0.820900
0.029250,0.012200,0.138650,0.819900
0.029300,0.011350,0.139400,0.819950
0.029050,0.011800,0.140150,0.819000
0.028150,0.011500,0.140600,0.819750
0.028300,0.011100,0.142150,0.818450
0.028200,0.010650,0.143900,0.817250
0.027200,0.010700,0.144600,0.817500
0.026350,0.010700,0.145750,0.817200
0.024800,0.010550,0.148300,0.816350
0.025150,0.008550,0.150500,0.815800
0.023050,0.009300,0.152000,0.815650
0.022500,0.008750,0.153950,0.814800
0.021950,0.009050,0.155650,0.813350
0.021600,0.009300,0.158050,0.811050
0.021300,0.009400,0.159250,0.810050
0.021350,0.008900,0.161600,0.808150
0.020900,0.009450,0.163150,0.806500
0.020750,0.009050,0.164300,0.805900
0.020650,0.008850,0.166400,0.804100
0.020400,0.009000,0.168150,0.802450
0.020250,0.009100,0.169750,0.800900
0.021300,0.008200,0.171650,0.798850
0.021450,0.008150,0.174200,0.796200
0.021250,0.008800,0.175500,0.794450
0.020800,0.009700,0.176450,0.793050
0.020450,0.009750,0.178700,0.791100
0.019050,0.009950,0.180650,0.790350
0.019450,0.010100,0.181750,0.788700
0.019550,0.010150,0.182100,0.788200
0.020050,0.010250,0.183200,0.786500
0.020250,0.009600,0.184800,0.785350
0.020500,0.009400,0.186150,0.783950
0.019750,0.010600,0.187400,0.782250
0.019650,0.010150,0.190200,0.780000
0.020400,0.009750,0.192150,0.777700
0.020150,0.010450,0.192650,0.776750
0.020900,0.009550,0.195000,0.774550
0.020650,0.009750,0.196650,0.772950
0.020250,0.010500,0.197250,0.772000
0.020200,0.010600,0.198800,0.770400
0.020250,0.010900,0.200150,0.768700
0.021200,0.010850,0.201700,0.766250
0.021800,0.010350,0.203750,0.764100
0.020850,0.011050,0.205300,0.762800
0.020550,0.011600,0.206400,0.761450
0.020100,0.011350,0.206450,0.762100
0.019400,0.011250,0.208200,0.761150
0.020450,0.011000,0.209300,0.759250
0.021250,0.011000,0.210850,0.756900
0.020900,0.011000,0.212600,0.755500
0.021150,0.012150,0.212900,0.753800
0.021750,0.011600,0.214750,0.751900
0.021850,0.012350,0.215400,0.750400
0.022850,0.012900,0.215500,0.748750
0.023150,0.012950,0.215950,0.747950
0.023500,0.013300,0.214950,0.748250
0.023700,0.014150,0.214950,0.747200
0.024150,0.014450,0.214600,0.746800
0.024850,0.014500,0.214550,0.746100
0.025650,0.014700,0.215150,0.744500
0.026700,0.014500,0.215250,0.743550
0.026500,0.015600,0.214900,0.743000
0.028250,0.014400,0.215400,0.741950
0.029000,0.014400,0.214550,0.742050
0.029600,0.016000,0.212450,0.741950
0.030350,0.015950,0.212500,0.741200
0.031150,0.017400,0.210400,0.741050
0.030900,0.017850,0.208950,0.742300
0.030950,0.018650,0.209250,0.741150
0.030900,0.017850,0.209550,0.741700
0.032850,0.017000,0.209250,0.740900
0.033250,0.017250,0.208950,0.740550
0.033000,0.017650,0.207900,0.741450
0.033600,0.017100,0.207250,0.742050
0.034650,0.017200,0.205450,0.742700
0.035350,0.016550,0.205100,0.743000
0.034700,0.017450,0.204850,0.743000
0.034900,0.017650,0.205100,0.742350
0.035600,0.016800,0.205250,0.742350
0.035400,0.016750,0.205400,0.742450
0.034750,0.019000,0.202500,0.743750
0.035350,0.018300,0.201650,0.744700
0.034900,0.018650,0.200150,0.746300
0.034200,0.019050,0.199350,0.747400
0.033050,0.020300,0.198550,0.748100
0.033550,0.020350,0.198200,0.747900
0.034400,0.019500,0.197850,0.748250
0.035400,0.019100,0.197450,0.748050
0.035450,0.019100,0.196250,0.749200
0.034750,0.019150,0.195350,0.750750
0.035050,0.018950,0.195250,0.750750
0.035750,0.019000,0.194450,0.750800
0.036050,0.018150,0.194350,0.751450
0.036700,0.018000,0.192900,0.752400
0.038000,0.018100,0.191450,0.752450
0.037900,0.019450,0.190100,0.752550
0.037150,0.020500,0.189250,0.753100
0.037950,0.020400,0.187400,0.754250
0.039000,0.019550,0.186550,0.754900
0.039600,0.019850,0.185100,0.755450
0.040100,0.019100,0.185400,0.755400
0.040250,0.018850,0.185800,0.755100
0.040900,0.018400,0.185000,0.755700
0.040250,0.017800,0.186000,0.755950
0.039600,0.019250,0.184750,0.756400
0.039350,0.019850,0.183550,0.757250
0.038100,0.020700,0.181850,0.759350
0.038300,0.020100,0.182200,0.759400
0.038200,0.021100,0.181200,0.759500
0.039900,0.019800,0.181150,0.759150
0.040100,0.019550,0.180500,0.759850
0.041600,0.018300,0.179800,0.760300
0.040650,0.018900,0.178850,0.761600
0.041650,0.018050,0.178900,0.761400
0.040100,0.019200,0.176900,0.763800
0.039900,0.020500,0.175250,0.764350
0.039300,0.020550,0.175150,0.765000
0.040250,0.019850,0.175550,0.764350
0.041100,0.019000,0.175150,0.764750
0.040450,0.020050,0.173600,0.765900
0.040550,0.019650,0.173550,0.766250
0.039750,0.020200,0.173750,0.766300
0.038700,0.020050,0.172850,0.768400
0.039050,0.018950,0.172550,0.769450
0.038700,0.018350,0.172250,0.770700
0.039100,0.017100,0.173000,0.770800
0.038350,0.018050,0.171350,0.772250
0.037450,0.018850,0.170950,0.772750
0.038150,0.018200,0.171100,0.772550
0.038500,0.017350,0.171000,0.773150
0.037450,0.017550,0.171850,0.773150
0.038200,0.017350,0.172200,0.772250
0.037300,0.017750,0.172350,0.772600
0.037400,0.017550,0.172900,0.772150
0.037650,0.016900,0.173350,0.772100
0.037000,0.017750,0.172750,0.772500
0.037250,0.017400,0.172700,0.772650
0.037650,0.016950,0.173000,0.772400
0.037050,0.016500,0.173500,0.772950
0.037150,0.016400,0.172600,0.773850
0.035700,0.016850,0.172800,0.774650
0.034650,0.017750,0.172750,0.774850
0.034450,0.017650,0.172850,0.775050
0.034950,0.016950,0.173050,0.775050
0.035700,0.016400,0.173150,0.774750
0.035750,0.016650,0.174600,0.773000
0.035300,0.015850,0.175150,0.773700
0.036050,0.015300,0.175950,0.772700
0.036100,0.015650,0.174900,0.773350
0.035400,0.017150,0.174200,0.773250
0.035450,0.017800,0.173250,0.773500
0.036350,0.016150,0.174350,0.773150
0.035400,0.016700,0.173950,0.773950
0.036800,0.016500,0.173150,0.773550
0.037000,0.015800,0.173300,0.773900
0.035800,0.016900,0.173350,0.773950
0.035150,0.017050,0.174350,0.773450
0.034050,0.017550,0.173800,0.774600
0.033700,0.017700,0.174200,0.774400
0.033900,0.017150,0.174800,0.774150
0.033250,0.017000,0.175850,0.773900
0.034250,0.016350,0.176650,0.772750
0.033850,0.017000,0.176700,0.772450
0.034100,0.016250,0.177350,0.772300
0.033600,0.017050,0.177450,0.771900
0.033850,0.017150,0.177800,0.771200
0.034100,0.016850,0.177600,0.771450
0.034400,0.016800,0.177700,0.771100
0.035000,0.016450,0.178000,0.770550
0.034450,0.016200,0.179400,0.769950
0.033600,0.015650,0.180650,0.770100
0.034200,0.016050,0.181400,0.768350
0.035350,0.014950,0.182950,0.766750
0.034200,0.014900,0.183050,0.767850
0.035300,0.014800,0.183050,0.766850
0.035200,0.013950,0.183500,0.767350
0.034200,0.015650,0.182400,0.767750
0.033250,0.017450,0.182600,0.766700
0.033850,0.016000,0.182950,0.767200
0.033950,0.015200,0.183100,0.767750
0.033150,0.014950,0.182750,0.769150
0.032700,0.014700,0.185250,0.767350
0.033100,0.015250,0.185500,0.766150
0.032950,0.016700,0.185900,0.764450
0.033150,0.016650,0.185850,0.764350
0.033050,0.016500,0.185900,0.764550
0.033050,0.016750,0.185850,0.764350
0.033700,0.016400,0.185700,0.764200
0.032900,0.016800,0.185400,0.764900
0.032600,0.016950,0.186150,0.764300
0.033250,0.016750,0.185700,0.764300
0.033000,0.016350,0.186450,0.764200
0.032650,0.016750,0.186450,0.764150
0.032850,0.017000,0.186200,0.763950
0.033300,0.016150,0.188050,0.762500
0.033850,0.015600,0.188150,0.762400
0.033700,0.016300,0.186800,0.763200
0.033000,0.016550,0.186950,0.763500
0.033600,0.016800,0.186800,0.762800
0.034400,0.015700,0.187500,0.762400
0.034700,0.015600,0.188100,0.761600
0.033900,0.017300,0.187350,0.761450
0.033750,0.017850,0.187350,0.761050
0.032200,0.017950,0.188600,0.761250
0.033400,0.017000,0.189200,0.760400
0.033700,0.017650,0.189600,0.759050
0.034600,0.018000,0.189050,0.758350
0.034000,0.017900,0.188650,0.759450
0.035250,0.017250,0.188700,0.758800
0.035600,0.016100,0.188900,0.759400
0.035150,0.017100,0.188200,0.759550
0.036250,0.017700,0.187600,0.758450
0.034600,0.018200,0.187400,0.759800
0.035550,0.017200,0.186450,0.760800
0.035250,0.018200,0.185550,0.761000
0.035250,0.019200,0.183950,0.761600
0.034800,0.019150,0.182400,0.763650
0.035100,0.017650,0.182150,0.765100
0.035450,0.017000,0.182800,0.764750
0.036100,0.016600,0.182900,0.764400
0.036400,0.017100,0.181250,0.765250
0.035800,0.017200,0.180850,0.766150
0.035850,0.017400,0.180900,0.765850
0.035600,0.016950,0.180800,0.766650
0.035900,0.016500,0.180150,0.767450
0.035450,0.016150,0.181500,0.766900
0.035400,0.015000,0.182400,0.767200
0.034950,0.015850,0.181600,0.767600
0.034450,0.016450,0.181400,0.767700
0.034150,0.016850,0.181450,0.767550
0.033550,0.017050,0.181950,0.767450
0.033450,0.016750,0.181900,0.767900
0.033400,0.015800,0.182100,0.768700
0.033900,0.015450,0.182050,0.768600
0.034300,0.015200,0.182800,0.767700
0.033300,0.015900,0.182800,0.768000
0.033300,0.015750,0.183550,0.767400
0.032700,0.016200,0.183050,0.768050
0.033000,0.015700,0.184150,0.767150
0.032350,0.016900,0.183850,0.766900
0.032850,0.016650,0.185000,0.765500
0.033200,0.016450,0.184450,0.765900
0.033650,0.016250,0.184950,0.765150
0.032600,0.016050,0.185900,0.765450
0.032750,0.016350,0.184950,0.765950
0.033350,0.014800,0.185800,0.766050
0.033500,0.014850,0.186400,0.765250
0.032850,0.016100,0.186100,0.764950
0.032800,0.017250,0.185400,0.764550
0.034600,0.015950,0.185750,0.763700
0.034750,0.016450,0.184500,0.764300
0.034150,0.016500,0.185050,0.764300
0.034200,0.016650,0.184650,0.764500
0.034050,0.017000,0.184900,0.764050
0.035050,0.017200,0.184250,0.763500
0.034450,0.016000,0.184000,0.765550
0.034600,0.016700,0.183900,0.764800
0.034950,0.017850,0.183250,0.763950
0.035350,0.017550,0.183300,0.763800
0.035450,0.016850,0.183600,0.764100
0.034500,0.017550,0.182200,0.765750
0.034900,0.017600,0.182450,0.765050
0.034650,0.017450,0.181700,0.766200
0.034000,0.017550,0.181450,0.767000
0.034750,0.017800,0.180650,0.766800
0.034300,0.017750,0.180350,0.767600
0.034700,0.017600,0.179750,0.767950
0.033400,0.017700,0.180250,0.768650
0.034300,0.017550,0.179900,0.768250
0.034650,0.016550,0.182000,0.766800
0.035700,0.017000,0.181400,0.765900
0.035500,0.017500,0.181300,0.765700
0.035900,0.017150,0.181400,0.765550
0.036350,0.016950,0.182100,0.764600
0.034550,0.018300,0.182100,0.765050
0.035250,0.017850,0.182350,0.764550
0.035800,0.017050,0.183000,0.764150
0.035550,0.016550,0.183650,0.764250
0.036000,0.016050,0.183800,0.764150
0.034750,0.016650,0.183450,0.765150
0.036000,0.016200,0.182800,0.765000
0.035550,0.017100,0.182100,0.765250
0.035900,0.016600,0.182750,0.764750
0.036650,0.015450,0.183450,0.764450
0.036400,0.015750,0.182250,0.765600
0.035450,0.016350,0.182150,0.766050
0.035300,0.016750,0.182850,0.765100
0.034900,0.017800,0.182300,0.765000
0.035750,0.017900,0.181650,0.764700
0.036150,0.019550,0.179250,0.765050
0.036950,0.018650,0.179250,0.765150
0.037200,0.017650,0.179150,0.766000
0.036650,0.018550,0.177600,0.767200
0.035950,0.019400,0.176850,0.767800
0.036650,0.018000,0.177000,0.768350
0.038050,0.017450,0.176700,0.767800
0.036850,0.018450,0.175850,0.768850
0.037350,0.017600,0.175450,0.769600
0.037500,0.017600,0.175400,0.769500
0.036800,0.017900,0.175150,0.770150
0.037850,0.017200,0.175650,0.769300
0.037550,0.017650,0.175150,0.769650
0.036900,0.016350,0.176550,0.770200
0.036200,0.016400,0.176350,0.771050
0.036500,0.016600,0.176750,0.770150
0.036200,0.016200,0.177900,0.769700
0.035000,0.015800,0.178700,0.770500
0.034100,0.016200,0.179250,0.770450
0.034100,0.016250,0.180800,0.768850
0.033500,0.016850,0.180850,0.768800
0.034150,0.016900,0.180750,0.768200
0.033300,0.016450,0.181700,0.768550
0.033650,0.016100,0.182100,0.768150
0.034500,0.016300,0.182800,0.766400
0.034300,0.015600,0.184000,0.766100
0.033700,0.015600,0.185150,0.765550
0.034350,0.015200,0.185450,0.765000
0.033650,0.015750,0.185850,0.764750
0.033850,0.015900,0.185900,0.764350
0.033200,0.016800,0.186350,0.763650
0.032750,0.016300,0.187150,0.763800
0.032350,0.016550,0.187150,0.763950
0.031800,0.019000,0.185350,0.763850
0.032850,0.018050,0.185750,0.763350
0.033350,0.018100,0.185750,0.762800
0.034000,0.017250,0.185200,0.763550
0.033800,0.017400,0.185400,0.763400
0.033800,0.018450,0.185500,0.762250
0.035200,0.017200,0.185700,0.761900
0.034850,0.017900,0.185550,0.761700
0.034800,0.018600,0.184450,0.762150
0.035200,0.019350,0.184300,0.761150
0.035750,0.018100,0.185450,0.760700
0.035300,0.018850,0.185000,0.760850
0.037000,0.018200,0.184250,0.760550
0.037100,0.018700,0.183500,0.760700
0.036550,0.018750,0.183850,0.760850
0.036750,0.017500,0.184250,0.761500
0.036250,0.017750,0.184550,0.761450
0.036950,0.017350,0.185000,0.760700
0.037350,0.016650,0.184450,0.761550
0.036800,0.016400,0.184900,0.761900
0.036300,0.017100,0.184650,0.761950
0.037100,0.016850,0.184500,0.761550
0.036100,0.018150,0.184350,0.761400
0.037250,0.018200,0.184700,0.759850
0.037200,0.017250,0.185300,0.760250
0.036400,0.017700,0.185650,0.760250
0.035850,0.017800,0.185600,0.760750
0.036250,0.018000,0.186100,0.759650
0.036700,0.018800,0.185700,0.758800
0.036800,0.019350,0.184750,0.759100
0.036800,0.019400,0.184200,0.759600
0.037700,0.019650,0.183100,0.759550
0.038600,0.019550,0.182950,0.758900
0.039050,0.019700,0.182150,0.759100
0.038700,0.019150,0.182350,0.759800
0.039150,0.019000,0.181950,0.759900
0.039350,0.019150,0.181000,0.760500
0.040050,0.019450,0.179750,0.760750
0.038700,0.018750,0.180600,0.761950
0.039300,0.019300,0.180150,0.761250
0.038100,0.019250,0.179300,0.763350
0.037900,0.019050,0.178900,0.764150
0.039150,0.019400,0.178000,0.763450
0.038450,0.020300,0.176600,0.764650
0.038700,0.019250,0.177000,0.765050
0.038600,0.019950,0.176350,0.765100
0.038750,0.019200,0.175500,0.766550
0.038000,0.018900,0.176550,0.766550
0.039850,0.017350,0.176300,0.766500
0.037250,0.018750,0.176050,0.767950
0.036800,0.019050,0.175350,0.768800
0.037200,0.018000,0.175900,0.768900
0.037450,0.017600,0.175500,0.769450
0.037350,0.017750,0.175550,0.769350
0.036700,0.017150,0.176550,0.769600
0.036950,0.017200,0.176950,0.768900
0.035850,0.017150,0.177300,0.769700
0.035350,0.018050,0.177150,0.769450
0.035000,0.019050,0.176950,0.769000
0.035850,0.018550,0.177700,0.767900
0.035100,0.018200,0.177600,0.769100
0.035700,0.017800,0.177100,0.769400
0.035350,0.018000,0.177050,0.769600
0.034200,0.017950,0.177050,0.770800
0.034300,0.017950,0.176750,0.771000
0.035050,0.017900,0.176500,0.770550
0.034650,0.018150,0.176200,0.771000
0.034800,0.018000,0.176400,0.770800
0.035400,0.017850,0.176700,0.770050
0.035950,0.016600,0.178000,0.769450
0.036200,0.016600,0.177800,0.769400
0.036000,0.016950,0.177800,0.769250
0.034800,0.017950,0.177450,0.769800
0.035200,0.017800,0.177950,0.769050
0.034850,0.018050,0.178250,0.768850
0.034500,0.018050,0.179450,0.768000
0.034400,0.019200,0.178650,0.767750
0.035000,0.018650,0.179200,0.767150
0.036150,0.017200,0.180100,0.766550
0.035450,0.018400,0.180400,0.765750
0.035300,0.018700,0.179950,0.766050
0.036100,0.017600,0.180000,0.766300
0.036050,0.018400,0.180100,0.765450
0.035800,0.018100,0.180600,0.765500
0.035400,0.018200,0.181450,0.764950
0.034850,0.018300,0.181350,0.765500
0.034900,0.018650,0.180450,0.766000
0.035300,0.017750,0.180350,0.766600
0.035200,0.017400,0.181250,0.766150
0.035350,0.018500,0.179800,0.766350
0.036800,0.017900,0.180100,0.765200
0.037400,0.017700,0.180150,0.764750
0.036200,0.018300,0.179500,0.766000
0.037600,0.017700,0.179050,0.765650
0.038350,0.017450,0.179200,0.765000
0.036650,0.019050,0.178250,0.766050
0.036150,0.018650,0.179700,0.765500
0.037450,0.017700,0.180100,0.764750
0.037950,0.018600,0.180450,0.763000
0.038350,0.019050,0.180300,0.762300
0.039100,0.019150,0.179800,0.761950
0.040700,0.018500,0.179200,0.761600
0.040150,0.018350,0.179050,0.762450
0.040050,0.018900,0.178150,0.762900
0.040200,0.018800,0.177450,0.763550
0.039550,0.018850,0.177100,0.764500
0.039600,0.018800,0.176750,0.764850
0.039600,0.019100,0.176800,0.764500
0.039700,0.019600,0.175150,0.765550
0.039450,0.019250,0.175050,0.766250
0.039800,0.019500,0.173650,0.767050
0.039450,0.018450,0.174500,0.767600
0.039300,0.018850,0.174100,0.767750
0.040050,0.018250,0.173650,0.768050
0.040000,0.018800,0.174000,0.767200
0.040700,0.018750,0.173650,0.766900
0.039600,0.019400,0.173300,0.767700
0.040550,0.018700,0.172000,0.768750
0.040600,0.019500,0.170750,0.769150
0.041350,0.019600,0.169250,0.769800
0.041000,0.018900,0.169900,0.770200
0.039700,0.019400,0.169400,0.771500
0.039600,0.019550,0.169050,0.771800
0.038950,0.019750,0.168850,0.772450
0.039250,0.019600,0.167950,0.773200
0.039650,0.018700,0.167400,0.774250
0.040050,0.017800,0.167700,0.774450
0.038750,0.019150,0.167300,0.774800
0.037700,0.019450,0.167000,0.775850
0.037650,0.018550,0.168800,0.775000
0.037750,0.017650,0.170250,0.774350
0.036900,0.018800,0.170200,0.774100
0.037600,0.018150,0.170500,0.773750
0.037100,0.019250,0.169100,0.774550
0.038400,0.018800,0.168950,0.773850
0.039400,0.019250,0.168100,0.773250
0.039900,0.018650,0.168150,0.773300
0.040550,0.018800,0.168300,0.772350
0.041100,0.018100,0.167950,0.772850
0.040450,0.018450,0.167650,0.773450
0.039400,0.017500,0.169450,0.773650
0.038600,0.018100,0.169800,0.773500
0.037200,0.018150,0.170050,0.774600
0.036900,0.016650,0.171800,0.774650
