I,E,S,R
0.001000,0.000850,0.998150,0.000000
0.001150,0.001350,0.997450,0.000050
0.001400,0.001650,0.996700,0.000250
0.001400,0.002150,0.995850,0.000600
0.001750,0.002750,0.994750,0.000750
0.002400,0.003350,0.993250,0.001000
0.002800,0.005100,0.990750,0.001350
0.004000,0.005750,0.988600,0.001650
0.005050,0.006950,0.985850,0.002150
0.006050,0.009100,0.982150,0.002700
0.007600,0.012300,0.976450,0.003650
0.010100,0.015300,0.970100,0.004500
0.012900,0.021400,0.960200,0.005500
0.017050,0.026150,0.949100,0.007700
0.022600,0.034100,0.933650,0.009650
0.030050,0.042100,0.915550,0.012300
0.038100,0.055250,0.890600,0.016050
0.048250,0.068200,0.862200,0.021350
0.063050,0.083800,0.827000,0.026150
0.078500,0.106000,0.780800,0.034700
0.100150,0.127850,0.726950,0.045050
0.121400,0.150400,0.670300,0.057900
0.149100,0.174900,0.602100,0.073900
0.178550,0.198450,0.529550,0.093450
0.210200,0.220950,0.452150,0.116700
0.243700,0.232400,0.378950,0.144950
0.278300,0.234950,0.310300,0.176450
0.308700,0.236800,0.241150,0.213350
0.334650,0.225500,0.186850,0.253000
0.353500,0.202700,0.145700,0.298100
0.360950,0.182400,0.110550,0.346100
0.365000,0.157800,0.083400,0.393800
0.358550,0.134550,0.064700,0.442200
0.349200,0.113250,0.049200,0.488350
0.341550,0.090650,0.038300,0.529500
0.320900,0.076450,0.029700,0.572950
0.302750,0.059750,0.025200,0.612300
0.282550,0.046700,0.021150,0.649600
0.256450,0.036900,0.019550,0.687100
0.230250,0.029350,0.018600,0.721800
0.207750,0.023550,0.018100,0.750600
0.184400,0.019450,0.018500,0.777650
0.164750,0.016200,0.019300,0.799750
0.145350,0.013950,0.019500,0.821200
0.131150,0.012000,0.019950,0.836900
0.119550,0.008750,0.022550,0.849150
0.106200,0.008100,0.024100,0.861600
0.095300,0.006950,0.025500,0.872250
0.083250,0.006350,0.027050,0.883350
0.073500,0.006150,0.028050,0.892300
0.065900,0.005450,0.030600,0.898050
0.058050,0.005400,0.032250,0.904300
0.051350,0.004400,0.034450,0.909800
0.048400,0.004100,0.036000,0.911500
0.042250,0.004250,0.037800,0.915700
0.037250,0.004650,0.039950,0.918150
0.033000,0.004550,0.042400,0.920050
0.028750,0.004650,0.044800,0.921800
0.026500,0.004800,0.046950,0.921750
0.024500,0.004150,0.049450,0.921900
0.021600,0.003950,0.051550,0.922900
0.020150,0.003350,0.053950,0.922550
0.018550,0.003000,0.057400,0.921050
0.016600,0.003000,0.059200,0.921200
0.014750,0.002750,0.061600,0.920900
0.013600,0.002350,0.063200,0.920850
0.012550,0.002300,0.066150,0.919000
0.011250,0.002050,0.068750,0.917950
0.009950,0.001900,0.071100,0.917050
0.008650,0.001650,0.073300,0.916400
0.007150,0.001850,0.076900,0.914100
0.006350,0.001900,0.079850,0.911900
0.006250,0.001800,0.082900,0.909050
0.005750,0.001700,0.085300,0.907250
0.005650,0.001100,0.088450,0.904800
0.005050,0.001250,0.091800,0.901900
0.004500,0.001400,0.094500,0.899600
0.004300,0.001400,0.097650,0.896650
0.004150,0.001300,0.100200,0.894350
0.003750,0.001200,0.102850,0.892200
0.003800,0.001000,0.105850,0.889350
0.003750,0.000750,0.107750,0.887750
0.003550,0.000750,0.110550,0.885150
0.003300,0.000850,0.113550,0.882300
0.003150,0.000900,0.116450,0.879500
0.002950,0.001000,0.118500,0.877550
0.002900,0.000950,0.120600,0.875550
0.002900,0.000950,0.123100,0.873050
0.002400,0.001000,0.125450,0.871150
0.002050,0.000950,0.128650,0.868350
0.002100,0.001050,0.130800,0.866050
0.002050,0.000950,0.134100,0.862900
0.002050,0.000750,0.136300,0.860900
0.001850,0.000650,0.139500,0.858000
0.001700,0.000650,0.142050,0.855600
0.001700,0.000600,0.144350,0.853350
0.001500,0.000450,0.146600,0.851450
0.001400,0.000350,0.149200,0.849050
0.001450,0.000200,0.151550,0.846800
0.001100,0.000400,0.154650,0.843850
0.000850,0.000550,0.156500,0.842100
0.000950,0.000400,0.159550,0.839100
0.001000,0.000350,0.161800,0.836850
0.000950,0.000350,0.163750,0.834950
0.001000,0.000350,0.165750,0.832900
0.001000,0.000450,0.168250,0.830300
0.000950,0.000550,0.170600,0.827900
0.000950,0.000450,0.172600,0.826000
0.000900,0.000500,0.175400,0.823200
0.001000,0.000400,0.177900,0.820700
0.001000,0.000350,0.180250,0.818400
0.000950,0.000350,0.183100,0.815600
0.000800,0.000350,0.185500,0.813350
0.000850,0.000250,0.187700,0.811200
0.000650,0.000300,0.190300,0.808750
0.000550,0.000400,0.192900,0.806150
0.000600,0.000450,0.195200,0.803750
0.000550,0.000450,0.197850,0.801150
0.000550,0.000550,0.199550,0.799350
0.000650,0.000550,0.201750,0.797050
0.000550,0.000500,0.203750,0.795200
0.000600,0.000400,0.206050,0.792950
0.000650,0.000350,0.209000,0.790000
0.000750,0.000600,0.211000,0.787650
0.000850,0.000550,0.213200,0.785400
0.000900,0.000800,0.215000,0.783300
0.000900,0.000850,0.216550,0.781700
0.001100,0.000600,0.218500,0.779800
0.001200,0.000650,0.220450,0.777700
0.000900,0.000750,0.222400,0.775950
0.001000,0.000650,0.224650,0.773700
0.001150,0.000400,0.226400,0.772050
0.001050,0.000450,0.228550,0.769950
0.001250,0.000500,0.230250,0.768000
0.001000,0.000650,0.232650,0.765700
0.001150,0.000650,0.234550,0.763650
0.001100,0.000850,0.236150,0.761900
0.001100,0.000900,0.239000,0.759000
0.001000,0.001100,0.241050,0.756850
0.001150,0.000950,0.243050,0.754850
0.001250,0.000750,0.245000,0.753000
0.001500,0.000550,0.246700,0.751250
0.001600,0.000550,0.249150,0.748700
0.001600,0.000800,0.250800,0.746800
0.001800,0.000800,0.252650,0.744750
0.001800,0.000850,0.254800,0.742550
0.001750,0.000850,0.256550,0.740850
0.001750,0.001200,0.258500,0.738550
0.001850,0.001200,0.259950,0.737000
0.002000,0.001250,0.261250,0.735500
0.002050,0.001200,0.262950,0.733800
0.002250,0.001450,0.264650,0.731650
0.002350,0.001450,0.266350,0.729850
0.002300,0.001900,0.267850,0.727950
0.002400,0.001700,0.270050,0.725850
0.002700,0.001800,0.271000,0.724500
0.002950,0.001800,0.271800,0.723450
0.002850,0.001800,0.273600,0.721750
0.003000,0.002150,0.274500,0.720350
0.003300,0.002050,0.275800,0.718850
0.003500,0.002550,0.275800,0.718150
0.003950,0.002500,0.277250,0.716300
0.004100,0.002700,0.278550,0.714650
0.004450,0.002700,0.279500,0.713350
0.004650,0.002900,0.280500,0.711950
0.005050,0.002800,0.281750,0.710400
0.005250,0.003350,0.282700,0.708700
0.005550,0.003100,0.284300,0.707050
0.005800,0.003250,0.285450,0.705500
0.006050,0.003550,0.286550,0.703850
0.006450,0.003300,0.287550,0.702700
0.006550,0.003950,0.288250,0.701250
0.006400,0.004350,0.289550,0.699700
0.006400,0.004650,0.290550,0.698400
0.007200,0.005100,0.290800,0.696900
0.008000,0.005200,0.291250,0.695550
0.008750,0.005400,0.291800,0.694050
0.009400,0.005550,0.291300,0.693750
0.010150,0.006350,0.291400,0.692100
0.010100,0.007300,0.291800,0.690800
0.011300,0.007250,0.291300,0.690150
0.011300,0.008050,0.291350,0.689300
0.012200,0.008450,0.291150,0.688200
0.013050,0.009600,0.289800,0.687550
0.013850,0.010550,0.288000,0.687600
0.014750,0.010900,0.287100,0.687250
0.015850,0.011600,0.285600,0.686950
0.016600,0.011450,0.284050,0.687900
0.017150,0.012800,0.282650,0.687400
0.018200,0.013200,0.280500,0.688100
0.018850,0.013650,0.278550,0.688950
0.019350,0.012450,0.277650,0.690550
0.019550,0.013400,0.276100,0.690950
0.020400,0.013550,0.274150,0.691900
0.022250,0.014200,0.271150,0.692400
0.023550,0.014900,0.268350,0.693200
0.024300,0.015350,0.266050,0.694300
0.025400,0.015950,0.264150,0.694500
0.025850,0.017400,0.261100,0.695650
0.026950,0.018100,0.258050,0.696900
0.029200,0.017500,0.255900,0.697400
0.030000,0.018800,0.252300,0.698900
0.030900,0.020550,0.247500,0.701050
0.033300,0.020350,0.243900,0.702450
0.035350,0.019650,0.240300,0.704700
0.035650,0.021200,0.235550,0.707600
0.036900,0.021050,0.231850,0.710200
0.038150,0.023300,0.227000,0.711550
0.039250,0.023200,0.223450,0.714100
0.041200,0.022550,0.219500,0.716750
0.042350,0.022050,0.215850,0.719750
0.042450,0.023000,0.212100,0.722450
0.043500,0.022600,0.207950,0.725950
0.043900,0.023900,0.202700,0.729500
0.043900,0.024550,0.199150,0.732400
0.043700,0.024150,0.195250,0.736900
0.044350,0.024400,0.191250,0.740000
0.045350,0.024500,0.187400,0.742750
0.046250,0.024250,0.184050,0.745450
0.047050,0.024050,0.181150,0.747750
0.047150,0.024600,0.177200,0.751050
0.047750,0.024200,0.173450,0.754600
0.047900,0.024450,0.168600,0.759050
0.049600,0.023450,0.165450,0.761500
0.049100,0.023950,0.161800,0.765150
0.048750,0.022550,0.159850,0.768850
0.046850,0.022550,0.157200,0.773400
0.046700,0.021750,0.154400,0.777150
0.046450,0.020000,0.153650,0.779900
0.046850,0.020050,0.152600,0.780500
0.045150,0.019850,0.151800,0.783200
0.045500,0.018850,0.150150,0.785500
0.044550,0.018850,0.147500,0.789100
0.043800,0.018050,0.146750,0.791400
0.043000,0.018050,0.145250,0.793700
0.043150,0.016650,0.145100,0.795100
0.041950,0.016950,0.145000,0.796100
0.040900,0.016800,0.144400,0.797900
0.041200,0.015400,0.143500,0.799900
0.041200,0.015200,0.141550,0.802050
0.041100,0.014250,0.140800,0.803850
0.039050,0.014800,0.139700,0.806450
0.037350,0.014050,0.139750,0.808850
0.036700,0.013300,0.140350,0.809650
0.036450,0.011800,0.142350,0.809400
0.033550,0.012600,0.142600,0.811250
0.032250,0.011700,0.144050,0.812000
0.032100,0.010600,0.145200,0.812100
0.029850,0.011200,0.145300,0.813650
0.029200,0.011250,0.145750,0.813800
0.029300,0.010850,0.147100,0.812750
0.028800,0.011650,0.147800,0.811750
0.028650,0.010950,0.148800,0.811600
0.027400,0.011300,0.150150,0.811150
0.027800,0.010600,0.150800,0.810800
0.026750,0.010400,0.152400,0.810450
0.025300,0.010300,0.154650,0.809750
0.024850,0.010500,0.155900,0.808750
0.025450,0.010000,0.158100,0.806450
0.024800,0.009800,0.160450,0.804950
0.023950,0.010300,0.161850,0.803900
0.023250,0.009850,0.163350,0.803550
0.022300,0.009900,0.164550,0.803250
0.022700,0.010200,0.164950,0.802150
0.022750,0.010200,0.166300,0.800750
0.022500,0.009950,0.167200,0.800350
0.023000,0.009250,0.169000,0.798750
0.021850,0.010000,0.170100,0.798050
0.021050,0.010850,0.170450,0.797650
0.020300,0.010150,0.172500,0.797050
0.020400,0.009900,0.173050,0.796650
0.020550,0.009950,0.175350,0.794150
0.020600,0.009900,0.177400,0.792100
0.020650,0.010200,0.178600,0.790550
0.021100,0.010600,0.180050,0.788250
0.021750,0.010700,0.181300,0.786250
0.021550,0.010050,0.183400,0.785000
0.022050,0.009700,0.184150,0.784100
0.022200,0.010200,0.185900,0.781700
0.021550,0.011150,0.186350,0.780950
0.021800,0.011600,0.187250,0.779350
0.022550,0.010950,0.188700,0.777800
0.022750,0.011550,0.189700,0.776000
0.022800,0.012450,0.188850,0.775900
0.023350,0.012550,0.188800,0.775300
0.024400,0.011500,0.190550,0.773550
0.024350,0.012200,0.190600,0.772850
0.024050,0.012050,0.190850,0.773050
0.023500,0.012200,0.192900,0.771400
0.023800,0.012350,0.193850,0.770000
0.023850,0.012650,0.194150,0.769350
0.023450,0.013000,0.194800,0.768750
0.023750,0.012800,0.194950,0.768500
0.024150,0.012400,0.196450,0.767000
0.024000,0.013050,0.196350,0.766600
0.023150,0.013750,0.196950,0.766150
0.024250,0.013650,0.197500,0.764600
0.024600,0.013350,0.198050,0.764000
0.024400,0.013450,0.198900,0.763250
0.025450,0.012950,0.199200,0.762400
0.025400,0.013000,0.199800,0.761800
0.025100,0.012800,0.201150,0.760950
0.025900,0.013000,0.201950,0.759150
0.026200,0.013450,0.202200,0.758150
0.025500,0.015150,0.202650,0.756700
0.027150,0.014150,0.203400,0.755300
0.027000,0.013600,0.204550,0.754850
0.027950,0.013800,0.204250,0.754000
0.027900,0.013600,0.203600,0.754900
0.028550,0.014850,0.202900,0.753700
0.029450,0.014100,0.203100,0.753350
0.029650,0.014600,0.202400,0.753350
0.029300,0.016200,0.201950,0.752550
0.029850,0.016850,0.200850,0.752450
0.032100,0.016100,0.200750,0.751050
0.032650,0.016000,0.199650,0.751700
0.033000,0.017650,0.198050,0.751300
0.034150,0.017050,0.197850,0.750950
0.035500,0.016850,0.197550,0.750100
0.035300,0.016750,0.197150,0.750800
0.035250,0.017400,0.197000,0.750350
0.035200,0.017850,0.196550,0.750400
0.034700,0.018600,0.196050,0.750650
0.035200,0.018550,0.194650,0.751600
0.035650,0.018300,0.194700,0.751350
0.036250,0.017350,0.194500,0.751900
0.035950,0.018450,0.192650,0.752950
0.036800,0.017350,0.192150,0.753700
0.035450,0.018050,0.192150,0.754350
0.036150,0.016300,0.192850,0.754700
0.036900,0.016250,0.192750,0.754100
0.037350,0.016750,0.192250,0.753650
0.036000,0.018200,0.190800,0.755000
0.036000,0.018800,0.190450,0.754750
0.035550,0.019850,0.189800,0.754800
0.036100,0.019250,0.189450,0.755200
0.035500,0.019350,0.188550,0.756600
0.036100,0.018850,0.188300,0.756750
0.036800,0.019200,0.187550,0.756450
0.038450,0.018750,0.187300,0.755500
0.038400,0.019350,0.186350,0.755900
0.038050,0.018300,0.187050,0.756600
0.037650,0.017650,0.187650,0.757050
0.036750,0.017850,0.186800,0.758600
0.035200,0.019100,0.186500,0.759200
0.036450,0.018300,0.186100,0.759150
0.035650,0.019800,0.184600,0.759950
0.035950,0.019550,0.184750,0.759750
0.036950,0.018800,0.185250,0.759000
0.037600,0.018200,0.184350,0.759850
0.038300,0.017300,0.183500,0.760900
0.038550,0.017250,0.183500,0.760700
0.037750,0.017900,0.183150,0.761200
0.038000,0.017700,0.182950,0.761350
0.037750,0.017500,0.183000,0.761750
0.037200,0.018550,0.181900,0.762350
0.036550,0.019250,0.182050,0.762150
0.038000,0.018900,0.181200,0.761900
0.037500,0.019100,0.181350,0.762050
0.037650,0.018600,0.181650,0.762100
0.037450,0.018500,0.180400,0.763650
0.037400,0.018800,0.179750,0.764050
0.037200,0.018950,0.179600,0.764250
0.036350,0.018650,0.180650,0.764350
0.037600,0.017200,0.181250,0.763950
0.037650,0.017600,0.180700,0.764050
0.036600,0.018150,0.180300,0.764950
0.037650,0.018000,0.180150,0.764200
0.037200,0.019300,0.179750,0.763750
0.037600,0.019050,0.179300,0.764050
0.038750,0.018250,0.180200,0.762800
0.037950,0.019250,0.180050,0.762750
0.037450,0.019150,0.179150,0.764250
0.037400,0.019600,0.179000,0.764000
0.037500,0.018800,0.179550,0.764150
0.037800,0.018450,0.178250,0.765500
0.037450,0.017450,0.178050,0.767050
0.036350,0.018050,0.178350,0.767250
0.036700,0.016800,0.179350,0.767150
0.036550,0.016800,0.179750,0.766900
0.035700,0.018200,0.178900,0.767200
0.036300,0.017600,0.178200,0.767900
0.036350,0.016800,0.178650,0.768200
0.035650,0.018050,0.178000,0.768300
0.036050,0.018000,0.177800,0.768150
0.036000,0.017550,0.177900,0.768550
0.036500,0.017450,0.178450,0.767600
0.038100,0.016300,0.178300,0.767300
0.037800,0.016750,0.178350,0.767100
0.036100,0.018200,0.178000,0.767700
0.036600,0.018350,0.179200,0.765850
0.036500,0.018350,0.178350,0.766800
0.037200,0.017550,0.178600,0.766650
0.037900,0.017400,0.179250,0.765450
0.038100,0.017000,0.179600,0.765300
0.039600,0.017150,0.177900,0.765350
0.039500,0.017950,0.177250,0.765300
0.039850,0.017650,0.176350,0.766150
0.038750,0.017300,0.175800,0.768150
0.038050,0.017350,0.176000,0.768600
0.038200,0.016900,0.175800,0.769100
0.036750,0.016500,0.175700,0.771050
0.036300,0.016800,0.174900,0.772000
0.036050,0.017350,0.175550,0.771050
0.034850,0.017250,0.175950,0.771950
0.034850,0.017250,0.176200,0.771700
0.035250,0.017800,0.176500,0.770450
0.035950,0.016800,0.175650,0.771600
0.036700,0.015500,0.177600,0.770200
0.036200,0.016300,0.176950,0.770550
0.036400,0.016200,0.177850,0.769550
0.036000,0.016050,0.178000,0.769950
0.035550,0.016800,0.178700,0.768950
0.034450,0.017450,0.178950,0.769150
0.033900,0.018650,0.178550,0.768900
0.033950,0.018200,0.179150,0.768700
0.034600,0.016700,0.180350,0.768350
0.034800,0.016550,0.179900,0.768750
0.036500,0.016950,0.179200,0.767350
0.036250,0.017150,0.178650,0.767950
0.037350,0.016950,0.178300,0.767400
0.036850,0.016800,0.178450,0.767900
0.037000,0.017050,0.177150,0.768800
0.036300,0.018150,0.175700,0.769850
0.036100,0.019500,0.175300,0.769100
0.034950,0.019650,0.175800,0.769600
0.036850,0.017800,0.175550,0.769800
0.037400,0.016950,0.176550,0.769100
0.035750,0.018100,0.175800,0.770350
0.035550,0.017650,0.176000,0.770800
0.035800,0.017450,0.175550,0.771200
0.035950,0.017950,0.174750,0.771350
0.036600,0.017400,0.176150,0.769850
0.036800,0.017350,0.176900,0.768950
0.036650,0.018350,0.175700,0.769300
0.036600,0.017500,0.175300,0.770600
0.037000,0.017850,0.174900,0.770250
0.036400,0.017850,0.175200,0.770550
0.037450,0.018150,0.174750,0.769650
0.036950,0.018000,0.174500,0.770550
0.036650,0.017800,0.174250,0.771300
0.037100,0.017750,0.174450,0.770700
0.035900,0.017800,0.173850,0.772450
0.036850,0.016650,0.173850,0.772650
0.036650,0.017150,0.173100,0.773100
0.037400,0.017050,0.172700,0.772850
0.036650,0.016800,0.173000,0.773550
0.036150,0.016150,0.173000,0.774700
0.035950,0.016900,0.172000,0.775150
0.036000,0.016850,0.171750,0.775400
0.036600,0.016700,0.171900,0.774800
0.036550,0.016000,0.173450,0.774000
0.036350,0.015250,0.173350,0.775050
0.036900,0.015400,0.173500,0.774200
0.036650,0.015800,0.173450,0.774100
0.036500,0.016150,0.173300,0.774050
0.036900,0.016550,0.172100,0.774450
0.036400,0.016250,0.172100,0.775250
0.036000,0.015100,0.172700,0.776200
0.035200,0.016400,0.172300,0.776100
0.034250,0.016750,0.173100,0.775900
0.035200,0.015200,0.173200,0.776400
0.035150,0.015150,0.174100,0.775600
0.034850,0.015600,0.174400,0.775150
0.033350,0.015300,0.175100,0.776250
0.034300,0.014850,0.175200,0.775650
0.033900,0.015200,0.175200,0.775700
0.032650,0.015850,0.175150,0.776350
0.032750,0.015250,0.175950,0.776050
0.032550,0.016050,0.176150,0.775250
0.033250,0.014600,0.175550,0.776600
0.032900,0.015350,0.175150,0.776600
0.033450,0.014300,0.175800,0.776450
0.033250,0.013750,0.177250,0.775750
0.033500,0.013650,0.176900,0.775950
0.032650,0.014150,0.177050,0.776150
0.032350,0.014600,0.177250,0.775800
0.032400,0.014700,0.178000,0.774900
0.032450,0.014350,0.179600,0.773600
0.032500,0.015600,0.179750,0.772150
0.032950,0.015050,0.179800,0.772200
0.033300,0.015200,0.179250,0.772250
0.032900,0.016550,0.179250,0.771300
0.033750,0.015600,0.180500,0.770150
0.032450,0.016050,0.180700,0.770800
0.032250,0.016300,0.180500,0.770950
0.031900,0.015300,0.180850,0.771950
0.031750,0.015500,0.180550,0.772200
0.032450,0.015150,0.180950,0.771450
0.032650,0.014950,0.181850,0.770550
0.032850,0.014100,0.182650,0.770400
0.032550,0.014850,0.181450,0.771150
0.031100,0.015100,0.182050,0.771750
0.031600,0.014900,0.182800,0.770700
0.031400,0.014700,0.181900,0.772000
0.030700,0.015200,0.182700,0.771400
0.030500,0.015650,0.182400,0.771450
0.030350,0.015050,0.182900,0.771700
0.030250,0.016450,0.183400,0.769900
0.030900,0.015900,0.184200,0.769000
0.031800,0.016000,0.184400,0.767800
0.031750,0.016000,0.183900,0.768350
0.031650,0.015600,0.184550,0.768200
0.031800,0.014650,0.185850,0.767700
0.030800,0.015550,0.185900,0.767750
0.031650,0.015300,0.186600,0.766450
0.032600,0.015500,0.186400,0.765500
0.032550,0.016250,0.185850,0.765350
0.032300,0.016100,0.186450,0.765150
0.032750,0.016650,0.187250,0.763350
0.033500,0.017050,0.186400,0.763050
0.033550,0.016400,0.187050,0.763000
0.033850,0.016500,0.186200,0.763450
0.033850,0.016850,0.186250,0.763050
0.034050,0.016900,0.185500,0.763550
0.034200,0.018000,0.185150,0.762650
0.034800,0.018650,0.184850,0.761700
0.036050,0.018100,0.184950,0.760900
0.036800,0.018600,0.183550,0.761050
0.036550,0.019200,0.181900,0.762350
0.036200,0.019600,0.180800,0.763400
0.036200,0.019000,0.181450,0.763350
0.037000,0.018200,0.181400,0.763400
0.037500,0.017300,0.181800,0.763400
0.037750,0.017600,0.181550,0.763100
0.036900,0.018400,0.180200,0.764500
0.037750,0.018200,0.179550,0.764500
0.037750,0.018250,0.179750,0.764250
0.037650,0.018100,0.180550,0.763700
0.037800,0.017750,0.179450,0.765000
0.038200,0.016650,0.180450,0.764700
0.038400,0.018000,0.178600,0.765000
0.037950,0.017900,0.178100,0.766050
0.037950,0.017250,0.177750,0.767050
0.039050,0.016100,0.177850,0.767000
0.038100,0.018150,0.176450,0.767300
0.039050,0.017150,0.176100,0.767700
0.039250,0.016050,0.177450,0.767250
0.038950,0.017250,0.176700,0.767100
0.038600,0.016300,0.177150,0.767950
0.038650,0.015550,0.177350,0.768450
0.038200,0.016600,0.177600,0.767600
0.037600,0.017200,0.177350,0.767850
0.037900,0.016500,0.177900,0.767700
0.037250,0.016650,0.177900,0.768200
0.036800,0.017100,0.178050,0.768050
0.036750,0.018250,0.176700,0.768300
0.037450,0.016700,0.177350,0.768500
0.036550,0.017700,0.177050,0.768700
0.036000,0.017050,0.177050,0.769900
0.036500,0.016650,0.178050,0.768800
0.035400,0.017100,0.178700,0.768800
0.034450,0.018400,0.177650,0.769500
0.035050,0.018100,0.177100,0.769750
0.035850,0.017400,0.177400,0.769350
0.036450,0.017150,0.176200,0.770200
0.035700,0.016650,0.176150,0.771500
0.035100,0.016450,0.176450,0.772000
0.035000,0.016200,0.176650,0.772150
0.034100,0.017400,0.176450,0.772050
0.033300,0.016600,0.177900,0.772200
0.032800,0.017650,0.178300,0.771250
0.033250,0.017450,0.178550,0.770750
0.033350,0.017050,0.179050,0.770550
0.032550,0.018100,0.178650,0.770700
0.032350,0.017550,0.180500,0.769600
0.032700,0.016750,0.182550,0.768000
0.032300,0.016400,0.183100,0.768200
0.032950,0.015500,0.184250,0.767300
0.032900,0.016500,0.184450,0.766150
0.033850,0.016500,0.184400,0.765250
0.033850,0.016750,0.183800,0.765600
0.033650,0.017000,0.183350,0.766000
0.033850,0.017200,0.182900,0.766050
0.033400,0.017000,0.183600,0.766000
0.033500,0.016400,0.183600,0.766500
0.034100,0.016450,0.184000,0.765450
0.033550,0.017500,0.184250,0.764700
0.032900,0.018500,0.183750,0.764850
0.033700,0.017800,0.185050,0.763450
0.034100,0.017650,0.185500,0.762750
0.034400,0.017100,0.185850,0.762650
0.034500,0.017550,0.186000,0.761950
0.034800,0.017250,0.186500,0.761450
0.034850,0.017500,0.186350,0.761300
0.034750,0.018050,0.186750,0.760450
0.036350,0.017550,0.186400,0.759700
0.037100,0.016900,0.186950,0.759050
0.036850,0.018450,0.186150,0.758550
0.037100,0.018900,0.185000,0.759000
0.037850,0.018200,0.184850,0.759100
0.038500,0.019100,0.183600,0.758800
0.039300,0.018200,0.183300,0.759200
0.038600,0.018500,0.182500,0.760400
0.038700,0.018450,0.181400,0.761450
0.038100,0.017750,0.182050,0.762100
0.038200,0.017700,0.181100,0.763000
0.039000,0.016500,0.182100,0.762400
0.038950,0.016300,0.182650,0.762100
0.038300,0.016000,0.182300,0.763400
0.036600,0.016500,0.181950,0.764950
0.037350,0.016150,0.182750,0.763750
0.036700,0.016750,0.181250,0.765300
0.036050,0.017550,0.181250,0.765150
0.036150,0.016700,0.182450,0.764700
0.035200,0.017850,0.182250,0.764700
0.036300,0.016850,0.183500,0.763350
0.036350,0.016750,0.184300,0.762600
0.035550,0.018350,0.183150,0.762950
0.034750,0.018450,0.183650,0.763150
0.036400,0.017500,0.182200,0.763900
0.036700,0.017400,0.181500,0.764400
0.036850,0.017700,0.181200,0.764250
0.036750,0.018400,0.181200,0.763650
0.036200,0.018400,0.181850,0.763550
0.036400,0.018300,0.182350,0.762950
0.036450,0.017600,0.182750,0.763200
0.037250,0.016900,0.182450,0.763400
0.036900,0.017000,0.182900,0.763200
0.035400,0.018150,0.182000,0.764450
0.035650,0.017000,0.182400,0.764950
0.035150,0.018500,0.180700,0.765650
0.035350,0.018700,0.180750,0.765200
0.036600,0.018450,0.181250,0.763700
0.034950,0.019450,0.181050,0.764550
0.035950,0.018250,0.181550,0.764250
0.035150,0.018600,0.180850,0.765400
0.034750,0.018250,0.181150,0.765850
0.035000,0.018400,0.180250,0.766350
0.034250,0.018850,0.179300,0.767600
0.035200,0.018600,0.179400,0.766800
0.035400,0.018100,0.180100,0.766400
0.036550,0.017000,0.180850,0.765600
0.038450,0.016850,0.180700,0.764000
0.037600,0.016550,0.181800,0.764050
0.038550,0.015450,0.182600,0.763400
0.037950,0.015950,0.181800,0.764300
0.037450,0.017250,0.180900,0.764400
0.035650,0.018050,0.180300,0.766000
0.035550,0.017350,0.182550,0.764550
0.035900,0.016650,0.183400,0.764050
0.035750,0.016700,0.183600,0.763950
0.035150,0.018150,0.182300,0.764400
0.035300,0.017900,0.183200,0.763600
0.035450,0.017050,0.183550,0.763950
0.035500,0.017850,0.183700,0.762950
0.036450,0.017050,0.183850,0.762650
0.036800,0.016800,0.184150,0.762250
0.037450,0.016900,0.184200,0.761450
0.036900,0.017300,0.183800,0.762000
0.036200,0.017850,0.183400,0.762550
0.036000,0.018800,0.181900,0.763300
0.035550,0.018750,0.181850,0.763850
0.036150,0.017500,0.183300,0.763050
0.037350,0.017600,0.182450,0.762600
0.036000,0.018100,0.181850,0.764050
0.035700,0.018800,0.182600,0.762900
0.036350,0.019350,0.181550,0.762750
0.036400,0.018700,0.181450,0.763450
0.037300,0.018050,0.181200,0.763450
0.036550,0.018650,0.180250,0.764550
0.036650,0.017950,0.180300,0.765100
0.037900,0.017950,0.180100,0.764050
0.037300,0.019050,0.179250,0.764400
0.037950,0.018200,0.179200,0.764650
0.038700,0.017700,0.179150,0.764450
0.039300,0.016350,0.179300,0.765050
0.039100,0.016950,0.178400,0.765550
0.037650,0.018100,0.176900,0.767350
0.038700,0.017400,0.177650,0.766250
0.036600,0.018000,0.178100,0.767300
0.036250,0.017600,0.178250,0.767900
0.036000,0.018400,0.178700,0.766900
0.036100,0.019050,0.178000,0.766850
0.036200,0.019750,0.176800,0.767250
0.037450,0.017650,0.177600,0.767300
0.037700,0.017000,0.177100,0.768200
0.037250,0.017050,0.176500,0.769200
0.037900,0.016650,0.175600,0.769850
0.037650,0.017950,0.174650,0.769750
0.036750,0.017550,0.174900,0.770800
0.036000,0.017850,0.174550,0.771600
0.036250,0.017200,0.175450,0.771100
0.035800,0.017750,0.174950,0.771500
0.035750,0.017450,0.174800,0.772000
0.036650,0.017750,0.175350,0.770250
0.037050,0.018150,0.174300,0.770500
0.038850,0.016550,0.174350,0.770250
0.037850,0.016700,0.174600,0.770850
0.037350,0.017900,0.172750,0.772000
0.038000,0.017700,0.171550,0.772750
0.038250,0.016950,0.172600,0.772200
0.038350,0.016250,0.172750,0.772650
0.039000,0.016300,0.172700,0.772000
0.037400,0.017050,0.172100,0.773450
0.036950,0.017500,0.172350,0.773200
0.037250,0.016900,0.173350,0.772500
0.035950,0.017450,0.174200,0.772400
0.036400,0.017250,0.173800,0.772550
0.035600,0.016500,0.174800,0.773100
0.035500,0.016050,0.175300,0.773150
0.036050,0.015800,0.174550,0.773600
0.035600,0.016800,0.174050,0.773550
0.035200,0.017350,0.173550,0.773900
0.036050,0.016400,0.174400,0.773150
0.035850,0.016500,0.174850,0.772800
0.035250,0.016600,0.174800,0.773350
0.035050,0.015850,0.175450,0.773650
0.034450,0.017850,0.174950,0.772750
0.035300,0.017150,0.175550,0.772000
0.035250,0.016750,0.175150,0.772850
0.034600,0.015800,0.176950,0.772650
0.034800,0.015800,0.177650,0.771750
0.033950,0.016100,0.178250,0.771700
0.033400,0.016300,0.178750,0.771550
0.033400,0.016250,0.179950,0.770400
0.033550,0.015850,0.181100,0.769500
0.033200,0.016550,0.181400,0.768850
0.033300,0.017500,0.181450,0.767750
0.033100,0.017400,0.181050,0.768450
0.033050,0.017500,0.181650,0.767800
0.032800,0.017250,0.181250,0.768700
0.034000,0.016450,0.181300,0.768250
0.034100,0.017700,0.180350,0.767850
0.034900,0.017550,0.180300,0.767250
0.034550,0.017550,0.179800,0.768100
0.034050,0.017700,0.179800,0.768450
0.034450,0.016850,0.180350,0.768350
0.032950,0.017800,0.180150,0.769100
0.034350,0.016450,0.180600,0.768600
