I,E,S,R
0.001000,0.001050,0.997950,0.000000
0.000900,0.001950,0.996900,0.000250
0.001400,0.002400,0.995900,0.000300
0.001950,0.003250,0.994200,0.000600
0.002650,0.003950,0.992550,0.000850
0.003600,0.004750,0.990350,0.001300
0.004100,0.007450,0.986700,0.001750
0.005800,0.008300,0.983750,0.002150
0.007700,0.011050,0.978250,0.003000
0.010750,0.013900,0.971550,0.003800
0.013050,0.018900,0.962500,0.005550
0.016950,0.023750,0.952200,0.007100
0.021750,0.031300,0.937350,0.009600
0.028500,0.040800,0.919000,0.011700
0.036750,0.050850,0.897300,0.015100
0.047300,0.064550,0.868650,0.019500
0.059550,0.079200,0.835600,0.025650
0.073750,0.099350,0.792150,0.034750
0.092400,0.123150,0.740550,0.043900
0.113800,0.145100,0.684900,0.056200
0.140450,0.168600,0.620050,0.070900
0.170900,0.188650,0.552050,0.088400
0.203200,0.211300,0.476200,0.109300
0.235900,0.229450,0.398150,0.136500
0.267850,0.235100,0.326850,0.170200
0.298700,0.233400,0.262250,0.205650
0.321450,0.224950,0.206850,0.246750
0.342850,0.205200,0.162400,0.289550
0.354200,0.185650,0.124300,0.335850
0.359650,0.165900,0.094300,0.380150
0.356750,0.145600,0.070700,0.426950
0.350000,0.120950,0.054750,0.474300
0.338050,0.099800,0.042800,0.519350
0.321750,0.079950,0.034350,0.563950
0.300150,0.064800,0.028700,0.606350
0.277350,0.051650,0.025450,0.645550
0.252500,0.041850,0.022650,0.683000
0.229850,0.034250,0.020900,0.715000
0.207100,0.027650,0.020800,0.744450
0.187350,0.021450,0.020000,0.771200
0.168350,0.018700,0.020300,0.792650
0.148200,0.016400,0.020050,0.815350
0.133750,0.014050,0.020150,0.832050
0.119900,0.011550,0.021000,0.847550
0.107000,0.009950,0.022450,0.860600
0.095900,0.008450,0.023800,0.871850
0.086400,0.007650,0.024450,0.881500
0.075800,0.007100,0.026400,0.890700
0.066850,0.006550,0.027500,0.899100
0.059300,0.005950,0.028900,0.905850
0.052600,0.005650,0.030650,0.911100
0.047050,0.005150,0.033050,0.914750
0.042950,0.003900,0.035150,0.918000
0.038200,0.003000,0.037850,0.920950
0.032700,0.003000,0.040250,0.924050
0.028900,0.002750,0.043800,0.924550
0.026100,0.002950,0.046400,0.924550
0.023050,0.003050,0.049250,0.924650
0.020550,0.003250,0.052250,0.923950
0.018550,0.003100,0.054050,0.924300
0.016450,0.002750,0.056900,0.923900
0.014950,0.002300,0.059800,0.922950
0.013600,0.002250,0.062800,0.921350
0.012200,0.002150,0.065450,0.920200
0.011000,0.001850,0.068350,0.918800
0.009750,0.001750,0.071450,0.917050
0.009000,0.002000,0.074400,0.914600
0.007750,0.002400,0.078050,0.911800
0.007050,0.002350,0.080100,0.910500
0.006450,0.002250,0.082850,0.908450
0.005950,0.001950,0.085900,0.906200
0.005550,0.001700,0.088500,0.904250
0.005300,0.001500,0.090800,0.902400
0.004750,0.001950,0.093150,0.900150
0.004750,0.001400,0.096250,0.897600
0.003950,0.001500,0.099400,0.895150
0.003500,0.001400,0.101350,0.893750
0.003200,0.001250,0.104150,0.891400
0.003000,0.001000,0.106650,0.889350
0.002700,0.001050,0.109300,0.886950
0.002550,0.000950,0.111950,0.884550
0.002600,0.000800,0.114450,0.882150
0.002400,0.000900,0.116950,0.879750
0.002200,0.000950,0.119800,0.877050
0.002000,0.000850,0.122850,0.874300
0.002000,0.000950,0.124950,0.872100
0.002050,0.000750,0.127150,0.870050
0.001950,0.000750,0.130050,0.867250
0.001900,0.000750,0.132900,0.864450
0.001700,0.000800,0.135950,0.861550
0.001450,0.000800,0.139050,0.858700
0.001450,0.000850,0.142000,0.855700
0.001300,0.001050,0.144900,0.852750
0.001400,0.000850,0.147650,0.850100
0.001500,0.000600,0.149700,0.848200
0.001400,0.000750,0.152450,0.845400
0.001550,0.000550,0.154750,0.843150
0.001400,0.000550,0.157100,0.840950
0.001300,0.000600,0.159250,0.838850
0.001200,0.000650,0.162050,0.836100
0.001300,0.000600,0.164250,0.833850
0.001250,0.000600,0.166700,0.831450
0.001350,0.000550,0.169000,0.829100
0.001350,0.000450,0.171550,0.826650
0.001350,0.000700,0.174350,0.823600
0.001350,0.000750,0.176450,0.821450
0.001200,0.000750,0.179150,0.818900
0.001200,0.000500,0.181950,0.816350
0.000950,0.000550,0.184450,0.814050
0.001050,0.000500,0.186700,0.811750
0.001050,0.000500,0.189500,0.808950
0.001150,0.000500,0.191600,0.806750
0.001100,0.000650,0.194150,0.804100
0.001050,0.000700,0.195850,0.802400
0.001250,0.000650,0.198500,0.799600
0.001200,0.000600,0.201300,0.796900
0.001100,0.000700,0.203150,0.795050
0.001100,0.000800,0.205900,0.792200
0.001200,0.000900,0.208000,0.789900
0.001200,0.001000,0.210550,0.787250
0.001250,0.000950,0.212250,0.785550
0.001500,0.000950,0.214250,0.783300
0.001450,0.000800,0.216850,0.780900
0.001250,0.001050,0.219050,0.778650
0.001250,0.000950,0.220400,0.777400
0.001250,0.000900,0.222550,0.775300
0.001200,0.001000,0.224800,0.773000
0.001300,0.000750,0.227050,0.770900
0.001100,0.001100,0.228900,0.768900
0.001350,0.001050,0.231100,0.766500
0.001400,0.001050,0.233100,0.764450
0.001400,0.001250,0.235200,0.762150
0.001600,0.001100,0.237300,0.760000
0.001700,0.001050,0.239150,0.758100
0.001900,0.000800,0.241650,0.755650
0.001950,0.000700,0.243600,0.753750
0.001800,0.000800,0.245050,0.752350
0.001750,0.000750,0.246850,0.750650
0.001850,0.000900,0.248500,0.748750
0.001850,0.001200,0.249900,0.747050
0.001950,0.001250,0.251450,0.745350
0.002150,0.001350,0.253000,0.743500
0.002200,0.001500,0.254650,0.741650
0.002300,0.001550,0.256000,0.740150
0.002450,0.001750,0.257650,0.738150
0.002700,0.001600,0.259600,0.736100
0.002800,0.001500,0.261250,0.734450
0.002800,0.001600,0.262650,0.732950
0.003000,0.001950,0.263950,0.731100
0.003100,0.002000,0.265150,0.729750
0.002900,0.002350,0.266950,0.727800
0.003100,0.002350,0.268800,0.725750
0.002950,0.002550,0.270000,0.724500
0.003250,0.002700,0.270650,0.723400
0.003450,0.003000,0.271650,0.721900
0.003800,0.002850,0.272850,0.720500
0.003950,0.003050,0.273650,0.719350
0.004350,0.003050,0.274700,0.717900
0.004800,0.002600,0.275600,0.717000
0.005100,0.002600,0.277250,0.715050
0.005150,0.002950,0.277850,0.714050
0.005350,0.003150,0.279550,0.711950
0.005000,0.003800,0.280750,0.710450
0.005000,0.004200,0.282450,0.708350
0.005600,0.003600,0.283950,0.706850
0.006150,0.003800,0.284350,0.705700
0.006350,0.004600,0.284900,0.704150
0.006850,0.005250,0.285700,0.702200
0.006950,0.006000,0.285350,0.701700
0.007650,0.005550,0.286450,0.700350
0.008750,0.006250,0.286000,0.699000
0.009650,0.006300,0.285950,0.698100
0.009800,0.007150,0.285850,0.697200
0.010550,0.006900,0.286450,0.696100
0.011400,0.007000,0.286050,0.695550
0.012150,0.007750,0.285350,0.694750
0.012750,0.009200,0.283500,0.694550
0.013750,0.009200,0.283400,0.693650
0.014300,0.009800,0.282200,0.693700
0.015200,0.009900,0.281600,0.693300
0.015800,0.010300,0.280050,0.693850
0.017100,0.010250,0.279550,0.693100
0.018200,0.011350,0.277600,0.692850
0.018950,0.011650,0.276000,0.693400
0.020050,0.013550,0.273050,0.693350
0.021050,0.014050,0.271150,0.693750
0.022850,0.014400,0.268150,0.694600
0.023300,0.015650,0.266000,0.695050
0.024250,0.016100,0.262500,0.697150
0.026050,0.015850,0.259950,0.698150
0.027150,0.017050,0.256000,0.699800
0.028300,0.017400,0.253400,0.700900
0.028900,0.018250,0.249500,0.703350
0.030800,0.018550,0.246550,0.704100
0.031200,0.019350,0.243200,0.706250
0.032750,0.019250,0.240650,0.707350
0.032400,0.020400,0.236950,0.710250
0.033200,0.021000,0.234150,0.711650
0.033550,0.020900,0.231400,0.714150
0.035950,0.020600,0.226850,0.716600
0.037950,0.020200,0.223800,0.718050
0.038050,0.019800,0.220200,0.721950
0.038000,0.020100,0.217250,0.724650
0.038500,0.021000,0.213300,0.727200
0.039100,0.021400,0.209950,0.729550
0.039850,0.021600,0.206050,0.732500
0.039500,0.022100,0.202300,0.736100
0.040750,0.022950,0.197650,0.738650
0.041500,0.022200,0.194650,0.741650
0.042050,0.021050,0.192150,0.744750
0.042750,0.020300,0.190100,0.746850
0.043850,0.019700,0.186500,0.749950
0.042300,0.020650,0.182700,0.754350
0.040850,0.020750,0.180600,0.757800
0.040950,0.020500,0.178250,0.760300
0.041900,0.020750,0.175900,0.761450
0.041750,0.020400,0.173600,0.764250
0.043200,0.019850,0.171050,0.765900
0.042450,0.020300,0.169050,0.768200
0.041650,0.019700,0.167800,0.770850
0.040500,0.019800,0.165850,0.773850
0.040800,0.018900,0.164350,0.775950
0.040500,0.018250,0.163000,0.778250
0.039900,0.017200,0.162500,0.780400
0.039300,0.016900,0.160850,0.782950
0.039100,0.017000,0.158850,0.785050
0.038400,0.016350,0.158450,0.786800
0.037750,0.015950,0.156950,0.789350
0.037800,0.014650,0.156700,0.790850
0.036300,0.015350,0.156250,0.792100
0.035500,0.015700,0.155900,0.792900
0.033800,0.015600,0.155200,0.795400
0.034500,0.015400,0.154700,0.795400
0.033450,0.015800,0.153600,0.797150
0.033700,0.015600,0.153700,0.797000
0.033500,0.015250,0.153800,0.797450
0.032350,0.015600,0.152350,0.799700
0.031100,0.015650,0.153050,0.800200
0.030900,0.014000,0.154350,0.800750
0.030500,0.014050,0.154550,0.800900
0.028650,0.015200,0.153650,0.802500
0.029450,0.012900,0.154650,0.803000
0.029900,0.013000,0.154600,0.802500
0.029350,0.013100,0.154950,0.802600
0.028750,0.012350,0.155800,0.803100
0.028100,0.011400,0.157350,0.803150
0.027350,0.012150,0.158600,0.801900
0.027000,0.011300,0.160500,0.801200
0.026850,0.012100,0.160950,0.800100
0.025750,0.013000,0.161650,0.799600
0.025200,0.013350,0.161100,0.800350
0.026400,0.012550,0.161250,0.799800
0.026100,0.012700,0.161800,0.799400
0.024500,0.012400,0.163350,0.799750
0.024650,0.011800,0.163750,0.799800
0.024900,0.011900,0.164950,0.798250
0.024600,0.011800,0.165950,0.797650
0.024900,0.012200,0.166600,0.796300
0.025450,0.012200,0.167550,0.794800
0.024950,0.011700,0.168000,0.795350
0.024900,0.010950,0.169300,0.794850
0.024350,0.010600,0.170150,0.794900
0.023750,0.010950,0.171000,0.794300
0.023900,0.009800,0.173000,0.793300
0.022750,0.011350,0.174250,0.791650
0.022350,0.010700,0.175400,0.791550
0.022350,0.010750,0.176850,0.790050
0.022400,0.011050,0.177800,0.788750
0.022200,0.011050,0.179450,0.787300
0.022950,0.010200,0.181900,0.784950
0.022700,0.010250,0.182900,0.784150
0.021900,0.010850,0.183650,0.783600
0.021800,0.011000,0.185300,0.781900
0.022300,0.010300,0.186950,0.780450
0.022850,0.009900,0.188350,0.778900
0.023200,0.009700,0.189900,0.777200
0.023000,0.009150,0.191600,0.776250
0.022550,0.009700,0.193100,0.774650
0.022650,0.010350,0.193900,0.773100
0.022400,0.011250,0.194650,0.771700
0.022350,0.011350,0.195400,0.770900
0.022550,0.010900,0.196950,0.769600
0.021950,0.011050,0.198200,0.768800
0.021500,0.011650,0.198550,0.768300
0.021950,0.011750,0.200400,0.765900
0.021800,0.012200,0.200550,0.765450
0.022350,0.012150,0.201250,0.764250
0.022250,0.012200,0.202800,0.762750
0.022750,0.011900,0.204750,0.760600
0.023300,0.011600,0.206050,0.759050
0.023550,0.012100,0.207050,0.757300
0.022750,0.013650,0.207250,0.756350
0.023750,0.013000,0.209200,0.754050
0.023750,0.013300,0.210150,0.752800
0.024050,0.012550,0.211600,0.751800
0.023700,0.012900,0.212050,0.751350
0.023750,0.014000,0.212550,0.749700
0.023450,0.014250,0.213250,0.749050
0.023950,0.014300,0.213150,0.748600
0.024650,0.014100,0.213600,0.747650
0.025200,0.013550,0.214150,0.747100
0.024750,0.014300,0.214850,0.746100
0.025000,0.014950,0.215300,0.744750
0.026200,0.015600,0.214000,0.744200
0.027250,0.016000,0.213400,0.743350
0.027450,0.016050,0.213100,0.743400
0.028750,0.016000,0.212950,0.742300
0.030100,0.015900,0.212650,0.741350
0.029700,0.016200,0.211950,0.742150
0.028950,0.016400,0.213300,0.741350
0.030350,0.016000,0.212500,0.741150
0.031400,0.016050,0.211950,0.740600
0.031750,0.016600,0.212500,0.739150
0.032700,0.016350,0.212700,0.738250
0.032650,0.016950,0.211850,0.738550
0.033250,0.017500,0.210000,0.739250
0.033150,0.017800,0.209550,0.739500
0.033400,0.017250,0.209450,0.739900
0.032950,0.017650,0.209450,0.739950
0.032850,0.017250,0.209050,0.740850
0.033350,0.017900,0.207600,0.741150
0.033850,0.017850,0.206700,0.741600
0.033450,0.019100,0.205000,0.742450
0.032700,0.019700,0.204300,0.743300
0.033850,0.020250,0.202050,0.743850
0.035000,0.020900,0.200800,0.743300
0.036400,0.019750,0.200150,0.743700
0.036400,0.020600,0.198200,0.744800
0.037200,0.019950,0.197650,0.745200
0.037100,0.020800,0.196250,0.745850
0.038000,0.020200,0.196150,0.745650
0.038250,0.019350,0.196700,0.745700
0.039500,0.018550,0.195800,0.746150
0.039350,0.019050,0.193750,0.747850
0.039400,0.019400,0.191700,0.749500
0.039600,0.019100,0.191400,0.749900
0.039950,0.019200,0.189600,0.751250
0.039000,0.019350,0.189250,0.752400
0.040200,0.018950,0.187350,0.753500
0.040650,0.019350,0.185200,0.754800
0.039800,0.018900,0.184700,0.756600
0.040100,0.020050,0.183600,0.756250
0.040300,0.019800,0.182800,0.757100
0.040150,0.019650,0.182000,0.758200
0.040100,0.020150,0.180900,0.758850
0.041400,0.019250,0.179350,0.760000
0.041300,0.019150,0.179100,0.760450
0.039150,0.020650,0.177550,0.762650
0.038500,0.019400,0.177550,0.764550
0.038700,0.019450,0.176350,0.765500
0.038500,0.019300,0.175950,0.766250
0.039100,0.019700,0.175500,0.765700
0.038500,0.020400,0.174750,0.766350
0.039500,0.019250,0.174650,0.766600
0.039650,0.018550,0.174400,0.767400
0.038950,0.018550,0.172950,0.769550
0.038500,0.018450,0.172700,0.770350
0.038300,0.017900,0.172550,0.771250
0.038800,0.017550,0.172000,0.771650
0.037350,0.018300,0.171600,0.772750
0.036750,0.017750,0.171800,0.773700
0.037350,0.017350,0.170850,0.774450
0.037400,0.017650,0.170400,0.774550
0.037550,0.018100,0.169800,0.774550
0.037400,0.017700,0.170800,0.774100
0.036300,0.018650,0.170850,0.774200
0.036200,0.018550,0.170850,0.774400
0.036100,0.018700,0.170600,0.774600
0.036400,0.018300,0.170700,0.774600
0.035950,0.018000,0.170550,0.775500
0.035300,0.017700,0.171700,0.775300
0.036900,0.016900,0.170700,0.775500
0.036500,0.017750,0.170350,0.775400
0.036850,0.016900,0.170450,0.775800
0.035350,0.017800,0.170600,0.776250
0.035750,0.016900,0.170150,0.777200
0.035700,0.016400,0.169250,0.778650
0.035900,0.016200,0.170900,0.777000
0.035900,0.017100,0.169900,0.777100
0.035700,0.017350,0.169100,0.777850
0.036050,0.016500,0.169150,0.778300
0.036100,0.015850,0.169450,0.778600
0.035750,0.015650,0.168900,0.779700
0.036650,0.015850,0.169550,0.777950
0.036700,0.015500,0.170550,0.777250
0.035750,0.015650,0.171250,0.777350
0.034650,0.015900,0.172250,0.777200
0.034100,0.016500,0.172900,0.776500
0.033900,0.015850,0.173550,0.776700
0.032600,0.016600,0.174350,0.776450
0.033050,0.015750,0.174500,0.776700
0.033250,0.015700,0.175150,0.775900
0.032650,0.016500,0.175700,0.775150
0.033600,0.015000,0.176700,0.774700
0.032650,0.016100,0.175950,0.775300
0.033000,0.014900,0.177250,0.774850
0.034000,0.014750,0.177250,0.774000
0.033800,0.014700,0.177850,0.773650
0.032500,0.016000,0.177600,0.773900
0.032550,0.016250,0.176750,0.774450
0.032900,0.017150,0.176100,0.773850
0.033100,0.016100,0.176950,0.773850
0.033650,0.016200,0.178400,0.771750
0.034250,0.015950,0.177950,0.771850
0.032750,0.015300,0.178450,0.773500
0.033300,0.014350,0.179950,0.772400
0.032450,0.015050,0.179550,0.772950
0.031650,0.014050,0.180300,0.774000
0.030750,0.013700,0.181150,0.774400
0.030050,0.014800,0.180500,0.774650
0.029700,0.014900,0.181050,0.774350
0.029950,0.014000,0.181900,0.774150
0.030550,0.013800,0.183350,0.772300
0.030800,0.013650,0.183450,0.772100
0.030250,0.014050,0.183250,0.772450
0.030650,0.014650,0.184000,0.770700
0.029900,0.015150,0.183750,0.771200
0.030400,0.014300,0.183300,0.772000
0.030550,0.013600,0.184000,0.771850
0.029200,0.014050,0.184750,0.772000
0.028900,0.014550,0.185450,0.771100
0.029800,0.015650,0.185700,0.768850
0.029850,0.015550,0.186000,0.768600
0.030950,0.015800,0.185900,0.767350
0.030000,0.015550,0.186350,0.768100
0.029750,0.016500,0.186700,0.767050
0.030250,0.016300,0.187000,0.766450
0.030250,0.016350,0.185850,0.767550
0.030400,0.016250,0.187150,0.766200
0.029800,0.016500,0.187900,0.765800
0.028650,0.016350,0.188200,0.766800
0.029100,0.016650,0.187350,0.766900
0.028850,0.015550,0.188450,0.767150
0.028950,0.015350,0.188850,0.766850
0.028200,0.014900,0.190400,0.766500
0.028050,0.014250,0.191650,0.766050
0.028350,0.014600,0.191450,0.765600
0.027900,0.013300,0.193350,0.765450
0.027800,0.013450,0.193800,0.764950
0.027850,0.014100,0.194800,0.763250
0.028050,0.014400,0.194850,0.762700
0.027950,0.014300,0.195050,0.762700
0.029150,0.014050,0.195000,0.761800
0.028300,0.014000,0.195500,0.762200
0.028000,0.015350,0.195350,0.761300
0.028750,0.014800,0.196150,0.760300
0.028900,0.015150,0.197000,0.758950
0.029250,0.015100,0.196700,0.758950
0.028800,0.015050,0.197400,0.758750
0.030300,0.014500,0.199300,0.755900
0.030150,0.016200,0.198300,0.755350
0.029800,0.017300,0.198150,0.754750
0.031350,0.016550,0.197550,0.754550
0.032000,0.016150,0.197400,0.754450
0.032650,0.016100,0.197500,0.753750
0.033200,0.016450,0.197750,0.752600
0.033800,0.017100,0.196600,0.752500
0.034750,0.016850,0.196200,0.752200
0.035150,0.017550,0.194550,0.752750
0.036000,0.017400,0.193500,0.753100
0.036600,0.018650,0.191450,0.753300
0.036400,0.019650,0.189400,0.754550
0.037200,0.019350,0.188900,0.754550
0.037150,0.019850,0.187350,0.755650
0.038200,0.020000,0.186050,0.755750
0.038850,0.019450,0.184700,0.757000
0.038450,0.019250,0.184350,0.757950
0.038750,0.019300,0.183850,0.758100
0.038100,0.019550,0.183550,0.758800
0.038350,0.019600,0.182600,0.759450
0.037950,0.020250,0.180700,0.761100
0.038150,0.019400,0.179700,0.762750
0.038950,0.019150,0.177300,0.764600
0.039150,0.017850,0.178850,0.764150
0.038200,0.017600,0.178250,0.765950
0.036600,0.017450,0.178350,0.767600
0.036050,0.017800,0.177950,0.768200
0.035700,0.017250,0.179100,0.767950
0.035600,0.017450,0.178850,0.768100
0.036100,0.017450,0.178800,0.767650
0.035050,0.017900,0.177350,0.769700
0.036150,0.017150,0.178000,0.768700
0.036050,0.017850,0.177700,0.768400
0.035350,0.019150,0.176700,0.768800
0.035900,0.017950,0.176200,0.769950
0.035850,0.017700,0.175500,0.770950
0.036200,0.017700,0.175000,0.771100
0.038200,0.015800,0.175700,0.770300
0.036850,0.017550,0.175050,0.770550
0.036200,0.017400,0.175250,0.771150
0.035900,0.017950,0.173600,0.772550
0.036800,0.017500,0.172850,0.772850
0.036950,0.018000,0.172850,0.772200
0.036250,0.017750,0.173450,0.772550
0.035450,0.018150,0.172550,0.773850
0.035250,0.018000,0.172150,0.774600
0.035250,0.017500,0.172500,0.774750
0.036000,0.016600,0.173450,0.773950
0.036600,0.016600,0.173050,0.773750
0.035750,0.017450,0.172150,0.774650
0.035600,0.016650,0.172500,0.775250
0.036150,0.015400,0.174400,0.774050
0.035450,0.015600,0.173450,0.775500
0.034350,0.015850,0.174000,0.775800
0.034000,0.015750,0.174450,0.775800
0.033750,0.015000,0.175450,0.775800
0.032950,0.015550,0.175650,0.775850
0.032400,0.015750,0.175850,0.776000
0.032250,0.015650,0.176700,0.775400
0.032300,0.016050,0.176800,0.774850
0.031850,0.016050,0.176550,0.775550
0.031800,0.016000,0.177250,0.774950
0.032400,0.015450,0.177450,0.774700
0.032800,0.015450,0.177750,0.774000
0.032550,0.015200,0.178750,0.773500
0.032850,0.016100,0.178650,0.772400
0.032050,0.016850,0.177750,0.773350
0.032700,0.017000,0.176500,0.773800
0.032450,0.016350,0.177400,0.773800
0.032000,0.016900,0.177350,0.773750
0.032550,0.016400,0.177000,0.774050
0.033900,0.015050,0.179300,0.771750
0.033100,0.015350,0.179800,0.771750
0.032800,0.014600,0.181000,0.771600
0.032100,0.014100,0.182200,0.771600
0.032050,0.014150,0.183650,0.770150
0.031700,0.015050,0.183450,0.769800
0.031000,0.015500,0.183300,0.770200
0.031450,0.015150,0.183950,0.769450
0.031150,0.015500,0.184950,0.768400
0.030750,0.015900,0.185500,0.767850
0.030900,0.016100,0.186200,0.766800
0.030750,0.016150,0.186650,0.766450
0.031200,0.015850,0.187450,0.765500
0.030200,0.016100,0.188100,0.765600
0.031050,0.014500,0.189000,0.765450
0.031000,0.014400,0.190500,0.764100
0.030500,0.015500,0.189600,0.764400
0.029950,0.015300,0.190750,0.764000
0.030550,0.014600,0.191400,0.763450
0.030500,0.015300,0.193050,0.761150
0.030450,0.015100,0.193600,0.760850
0.030050,0.015300,0.193850,0.760800
0.029550,0.016100,0.194200,0.760150
0.030750,0.015550,0.194600,0.759100
0.030750,0.015350,0.194750,0.759150
0.030900,0.016400,0.194600,0.758100
0.031100,0.016100,0.196350,0.756450
0.031100,0.016150,0.195000,0.757750
0.031250,0.016150,0.195700,0.756900
0.031150,0.015450,0.196700,0.756700
0.031150,0.016050,0.197050,0.755750
0.031650,0.016200,0.197050,0.755100
0.032200,0.015000,0.198350,0.754450
0.031800,0.015450,0.199450,0.753300
0.033150,0.015850,0.199100,0.751900
0.032900,0.017600,0.197800,0.751700
0.033700,0.017100,0.198500,0.750700
0.034650,0.017650,0.197350,0.750350
0.034850,0.017950,0.197100,0.750100
0.034950,0.018250,0.195200,0.751600
0.035100,0.018550,0.194600,0.751750
0.035100,0.018950,0.194300,0.751650
0.036700,0.018050,0.194500,0.750750
0.036850,0.018000,0.194450,0.750700
0.036050,0.019350,0.192550,0.752050
0.036600,0.018400,0.192650,0.752350
0.037300,0.019050,0.192250,0.751400
0.037350,0.017800,0.192850,0.752000
0.038100,0.018650,0.191700,0.751550
0.039350,0.019000,0.189650,0.752000
0.040200,0.019100,0.188850,0.751850
0.039300,0.019550,0.188500,0.752650
0.038900,0.020000,0.187450,0.753650
0.039500,0.019900,0.186500,0.754100
0.039250,0.019900,0.185800,0.755050
0.038600,0.020350,0.186000,0.755050
0.038800,0.019250,0.185750,0.756200
0.038350,0.019750,0.184950,0.756950
0.039500,0.019100,0.184300,0.757100
0.039800,0.019050,0.184150,0.757000
0.039050,0.020400,0.182700,0.757850
0.039100,0.019850,0.181850,0.759200
0.039150,0.019750,0.181100,0.760000
0.039800,0.019600,0.180650,0.759950
0.039450,0.020200,0.178800,0.761550
0.040150,0.019450,0.179150,0.761250
0.039550,0.019600,0.179200,0.761650
0.038550,0.020100,0.177800,0.763550
0.038950,0.019500,0.178150,0.763400
0.038950,0.018150,0.179000,0.763900
0.039050,0.018100,0.179000,0.763850
0.038400,0.017550,0.179000,0.765050
0.037600,0.018800,0.177750,0.765850
0.037250,0.019500,0.176750,0.766500
0.038100,0.019350,0.176050,0.766500
0.039300,0.018300,0.175400,0.767000
0.038000,0.019600,0.174150,0.768250
0.037750,0.020100,0.173200,0.768950
0.037400,0.020000,0.173250,0.769350
0.038500,0.018850,0.173150,0.769500
0.037550,0.019300,0.173100,0.770050
0.038700,0.018550,0.172350,0.770400
0.037750,0.018300,0.172400,0.771550
0.036550,0.018650,0.172550,0.772250
0.037900,0.017400,0.173350,0.771350
0.037650,0.017100,0.173250,0.772000
0.036200,0.018150,0.172950,0.772700
0.036450,0.017900,0.173400,0.772250
0.035650,0.017800,0.173950,0.772600
0.034800,0.018100,0.174750,0.772350
0.036150,0.017550,0.173400,0.772900
0.035750,0.017150,0.173300,0.773800
0.036050,0.017250,0.173650,0.773050
0.035500,0.017350,0.173850,0.773300
0.034750,0.017850,0.173500,0.773900
0.033750,0.017500,0.173350,0.775400
0.033550,0.017150,0.174100,0.775200
0.033750,0.015650,0.175600,0.775000
0.033000,0.015200,0.175700,0.776100
0.033200,0.015750,0.176350,0.774700
0.033400,0.015500,0.177300,0.773800
0.032700,0.015450,0.178350,0.773500
0.032000,0.016400,0.178200,0.773400
0.032950,0.015250,0.179050,0.772750
0.032400,0.016050,0.179950,0.771600
0.032950,0.015850,0.180500,0.770700
0.031050,0.016000,0.181000,0.771950
0.030300,0.016550,0.182500,0.770650
0.031800,0.015000,0.183600,0.769600
0.031050,0.015850,0.184000,0.769100
0.032100,0.015200,0.184700,0.768000
0.032500,0.014800,0.185200,0.767500
0.032250,0.014700,0.186000,0.767050
0.031100,0.015400,0.186200,0.767300
0.031650,0.014250,0.187700,0.766400
0.031200,0.014600,0.189000,0.765200
0.031450,0.015550,0.188800,0.764200
0.031800,0.015250,0.188700,0.764250
0.031950,0.015300,0.189850,0.762900
0.031800,0.015100,0.190900,0.762200
0.032150,0.015100,0.191250,0.761500
0.031150,0.015700,0.190650,0.762500
0.031700,0.015500,0.191000,0.761800
0.032400,0.015550,0.192900,0.759150
0.032900,0.014450,0.194200,0.758450
0.031950,0.015150,0.193700,0.759200
0.031350,0.015750,0.193950,0.758950
0.032700,0.016350,0.194550,0.756400
0.033300,0.016000,0.194800,0.755900
0.033550,0.015950,0.194200,0.756300
0.033200,0.017000,0.192950,0.756850
0.033050,0.017650,0.192450,0.756850
0.033100,0.016600,0.193150,0.757150
0.033950,0.017650,0.192500,0.755900
0.033850,0.018150,0.191500,0.756500
0.034550,0.017350,0.191400,0.756700
0.035150,0.017300,0.190650,0.756900
0.034550,0.017650,0.191000,0.756800
0.033200,0.017500,0.191200,0.758100
0.034800,0.017900,0.190050,0.757250
0.035300,0.018300,0.189000,0.757400
0.035300,0.018700,0.188450,0.757550
0.034650,0.019200,0.188050,0.758100
0.035600,0.019950,0.187650,0.756800
0.036800,0.019400,0.186900,0.756900
0.037800,0.019750,0.185350,0.757100
0.037450,0.020100,0.183350,0.759100
0.037900,0.019150,0.183300,0.759650
0.037600,0.018850,0.182800,0.760750
0.038400,0.018550,0.181450,0.761600
0.038000,0.019200,0.180600,0.762200
0.037100,0.019800,0.180550,0.762550
0.038450,0.017600,0.181850,0.762100
0.037350,0.018700,0.181000,0.762950
0.037600,0.018350,0.180750,0.763300
0.036800,0.018450,0.179750,0.765000
0.036950,0.018500,0.180300,0.764250
0.036250,0.018750,0.180550,0.764450
0.035800,0.018550,0.181050,0.764600
0.035950,0.018400,0.181800,0.763850
0.035500,0.017950,0.181500,0.765050
0.036000,0.017700,0.181250,0.765050
0.036850,0.018050,0.179850,0.765250
0.036950,0.017350,0.180350,0.765350
0.037800,0.017400,0.181000,0.763800
0.038650,0.017600,0.180100,0.763650
0.038650,0.017350,0.180600,0.763400
0.037850,0.018500,0.180100,0.763550
0.037350,0.018600,0.179650,0.764400
0.038300,0.016650,0.181650,0.763400
0.037600,0.017400,0.181050,0.763950
0.037750,0.017950,0.180550,0.763750
0.037300,0.018300,0.181450,0.762950
0.037700,0.018150,0.181450,0.762700
0.037000,0.017800,0.181600,0.763600
0.037250,0.017800,0.181500,0.763450
0.037250,0.018000,0.181150,0.763600
0.037250,0.017800,0.179900,0.765050
0.036050,0.017450,0.180300,0.766200
0.036950,0.016600,0.180550,0.765900
0.036100,0.016800,0.181300,0.765800
0.036050,0.017250,0.182600,0.764100
0.034550,0.017000,0.182600,0.765850
0.034250,0.017450,0.182300,0.766000
0.033650,0.018150,0.182300,0.765900
0.033900,0.018050,0.183300,0.764750
0.034850,0.018350,0.182850,0.763950
0.035850,0.017200,0.183200,0.763750
0.036000,0.016650,0.182800,0.764550
0.034650,0.016750,0.183400,0.765200
0.033500,0.017900,0.182700,0.765900
0.033850,0.017400,0.183450,0.765300
0.033150,0.017050,0.183200,0.766600
0.033100,0.016850,0.183800,0.766250
0.033750,0.016600,0.183850,0.765800
0.034750,0.017000,0.183900,0.764350
0.034800,0.017700,0.184150,0.763350
0.035250,0.017350,0.184850,0.762550
0.034700,0.016750,0.185750,0.762800
0.033550,0.016850,0.186050,0.763550
0.033900,0.016550,0.186100,0.763450
0.033200,0.016450,0.187150,0.763200
0.033500,0.016350,0.187600,0.762550
0.033600,0.016200,0.188250,0.761950
0.033050,0.016150,0.188300,0.762500
0.032500,0.015550,0.189450,0.762500
0.032050,0.016100,0.189600,0.762250
0.032450,0.015550,0.190550,0.761450
0.031800,0.016300,0.190650,0.761250
