I,E,S,R
0.001000,0.001150,0.997850,0.000000
0.001300,0.001800,0.996700,0.000200
0.001400,0.002150,0.995900,0.000550
0.001850,0.002700,0.994750,0.000700
0.002500,0.003250,0.993350,0.000900
0.002800,0.004650,0.991250,0.001300
0.004000,0.006250,0.988050,0.001700
0.005450,0.008250,0.984350,0.001950
0.007550,0.010150,0.979600,0.002700
0.009050,0.013650,0.973400,0.003900
0.011000,0.017950,0.965900,0.005150
0.014900,0.022750,0.955550,0.006800
0.018950,0.029650,0.942700,0.008700
0.024650,0.037600,0.926600,0.011150
0.031400,0.046850,0.907100,0.014650
0.040450,0.060500,0.880250,0.018800
0.052050,0.073350,0.850950,0.023650
0.066900,0.088150,0.814500,0.030450
0.082200,0.111250,0.767850,0.038700
0.103700,0.134200,0.713450,0.048650
0.127650,0.157550,0.652450,0.062350
0.155600,0.182400,0.583250,0.078750
0.185100,0.205050,0.510800,0.099050
0.220050,0.222300,0.433050,0.124600
0.252750,0.236000,0.358850,0.152400
0.287500,0.234650,0.291950,0.185900
0.316100,0.230200,0.230800,0.222900
0.338250,0.217650,0.178100,0.266000
0.355000,0.200450,0.134300,0.310250
0.367250,0.172950,0.103350,0.356450
0.365850,0.149000,0.079100,0.406050
0.357700,0.128650,0.059350,0.454300
0.344750,0.106850,0.046500,0.501900
0.326450,0.087900,0.037750,0.547900
0.304100,0.073700,0.030700,0.591500
0.283800,0.059250,0.026100,0.630850
0.264600,0.046500,0.023200,0.665700
0.245000,0.035100,0.021500,0.698400
0.222050,0.028850,0.019500,0.729600
0.199450,0.022800,0.019600,0.758150
0.179750,0.019250,0.019250,0.781750
0.159750,0.016700,0.019200,0.804350
0.142150,0.014250,0.019850,0.823750
0.128050,0.012150,0.021550,0.838250
0.112500,0.010100,0.023350,0.854050
0.100100,0.008900,0.023950,0.867050
0.089650,0.007650,0.025550,0.877150
0.078450,0.006900,0.027000,0.887650
0.069150,0.006650,0.028600,0.895600
0.063200,0.005800,0.030500,0.900500
0.055950,0.004500,0.033250,0.906300
0.049850,0.004500,0.035150,0.910500
0.044450,0.004300,0.037200,0.914050
0.039600,0.004400,0.039200,0.916800
0.034250,0.004200,0.041500,0.920050
0.030450,0.004050,0.044350,0.921150
0.027300,0.003850,0.046400,0.922450
0.024450,0.003250,0.049500,0.922800
0.021800,0.002700,0.051800,0.923700
0.018950,0.002750,0.053800,0.924500
0.016850,0.002350,0.056250,0.924550
0.014650,0.002350,0.058600,0.924400
0.014000,0.001950,0.061650,0.922400
0.012650,0.002100,0.064200,0.921050
0.011500,0.001850,0.067050,0.919600
0.010000,0.002200,0.069650,0.918150
0.009150,0.002100,0.072500,0.916250
0.008000,0.002600,0.075000,0.914400
0.007850,0.002150,0.077900,0.912100
0.007100,0.002200,0.080100,0.910600
0.006700,0.002000,0.083700,0.907600
0.006250,0.002200,0.086950,0.904600
0.005600,0.002400,0.090500,0.901500
0.005650,0.001750,0.093800,0.898800
0.005400,0.001600,0.096050,0.896950
0.005300,0.001600,0.098450,0.894650
0.005100,0.001650,0.102250,0.891000
0.004900,0.001600,0.105300,0.888200
0.004750,0.001500,0.108050,0.885700
0.004800,0.001450,0.110750,0.883000
0.004500,0.001350,0.113300,0.880850
0.004250,0.001600,0.115950,0.878200
0.004150,0.001400,0.117450,0.877000
0.003650,0.001650,0.119650,0.875050
0.003600,0.001550,0.122800,0.872050
0.003650,0.001450,0.125300,0.869600
0.003550,0.001150,0.127800,0.867500
0.003150,0.001550,0.130150,0.865150
0.003000,0.001500,0.132300,0.863200
0.003150,0.001350,0.134850,0.860650
0.003050,0.001200,0.137700,0.858050
0.002700,0.001150,0.139800,0.856350
0.003000,0.000800,0.142500,0.853700
0.002500,0.000950,0.144250,0.852300
0.002450,0.000900,0.146700,0.849950
0.002350,0.000750,0.149250,0.847650
0.002150,0.000500,0.151450,0.845900
0.001950,0.000700,0.153400,0.843950
0.001650,0.000950,0.155700,0.841700
0.001900,0.000700,0.157800,0.839600
0.001450,0.000800,0.160050,0.837700
0.001350,0.000700,0.162950,0.835000
0.001200,0.000700,0.165550,0.832550
0.001450,0.000500,0.168400,0.829650
0.001400,0.000400,0.169950,0.828250
0.001400,0.000500,0.172250,0.825850
0.001300,0.000600,0.174550,0.823550
0.001450,0.000600,0.176350,0.821600
0.001400,0.000700,0.178800,0.819100
0.001150,0.000900,0.180650,0.817300
0.001250,0.000900,0.182500,0.815350
0.001150,0.001000,0.184100,0.813750
0.001400,0.000850,0.185900,0.811850
0.001250,0.001000,0.187500,0.810250
0.001200,0.001100,0.190300,0.807400
0.001250,0.001200,0.192000,0.805550
0.001450,0.000850,0.195350,0.802350
0.001650,0.000550,0.197450,0.800350
0.001400,0.000850,0.199100,0.798650
0.001600,0.000550,0.201600,0.796250
0.001550,0.000750,0.203700,0.794000
0.001800,0.000800,0.205550,0.791850
0.001550,0.001300,0.207300,0.789850
0.002050,0.001000,0.209950,0.787000
0.001900,0.001000,0.212200,0.784900
0.001900,0.001050,0.214400,0.782650
0.001900,0.000900,0.216600,0.780600
0.002000,0.000900,0.218800,0.778300
0.001850,0.000850,0.221050,0.776250
0.001550,0.001100,0.222800,0.774550
0.001650,0.001150,0.224650,0.772550
0.001450,0.001250,0.226750,0.770550
0.001650,0.001150,0.228750,0.768450
0.001550,0.001350,0.230450,0.766650
0.001500,0.001550,0.231900,0.765050
0.001850,0.001350,0.233500,0.763300
0.001900,0.001400,0.234950,0.761750
0.002150,0.001200,0.237100,0.759550
0.002400,0.001250,0.239150,0.757200
0.002300,0.001500,0.241250,0.754950
0.002600,0.001450,0.243450,0.752500
0.002850,0.001200,0.245000,0.750950
0.002650,0.001150,0.246400,0.749800
0.002500,0.001650,0.248100,0.747750
0.002650,0.001500,0.249950,0.745900
0.002550,0.001400,0.251000,0.745050
0.002600,0.001750,0.252750,0.742900
0.002750,0.001900,0.254400,0.740950
0.003050,0.002050,0.256100,0.738800
0.003200,0.002050,0.257550,0.737200
0.003050,0.002450,0.258700,0.735800
0.003300,0.002750,0.260200,0.733750
0.003400,0.002950,0.261100,0.732550
0.003450,0.003100,0.261800,0.731650
0.004250,0.002350,0.263750,0.729650
0.004200,0.002900,0.264550,0.728350
0.004650,0.003050,0.265500,0.726800
0.004850,0.003100,0.266300,0.725750
0.005050,0.003150,0.267450,0.724350
0.005650,0.002950,0.268500,0.722900
0.005600,0.003350,0.270000,0.721050
0.005650,0.003650,0.270650,0.720050
0.005950,0.004000,0.271300,0.718750
0.006500,0.003750,0.272050,0.717700
0.006800,0.004250,0.272200,0.716750
0.007250,0.004450,0.272850,0.715450
0.007750,0.004400,0.273250,0.714600
0.008100,0.004950,0.274150,0.712800
0.008500,0.004850,0.274500,0.712150
0.008650,0.004650,0.276150,0.710550
0.008850,0.005200,0.276700,0.709250
0.009350,0.005250,0.277200,0.708200
0.009350,0.006350,0.276950,0.707350
0.010200,0.006350,0.276950,0.706500
0.010400,0.007300,0.276350,0.705950
0.010700,0.006850,0.276700,0.705750
0.011500,0.007300,0.276600,0.704600
0.011650,0.007750,0.276750,0.703850
0.012100,0.008450,0.275850,0.703600
0.013350,0.008050,0.275600,0.703000
0.014450,0.008650,0.274400,0.702500
0.014750,0.009100,0.273850,0.702300
0.015000,0.010300,0.272850,0.701850
0.015750,0.011350,0.271350,0.701550
0.016900,0.011250,0.269850,0.702000
0.017950,0.011950,0.268350,0.701750
0.018600,0.012700,0.266700,0.702000
0.019200,0.013850,0.264850,0.702100
0.020650,0.013550,0.263000,0.702800
0.021800,0.014650,0.260700,0.702850
0.023250,0.015500,0.258450,0.702800
0.024450,0.015450,0.256050,0.704050
0.025750,0.015550,0.253600,0.705100
0.026200,0.016300,0.251450,0.706050
0.027600,0.016850,0.247150,0.708400
0.028900,0.017000,0.244300,0.709800
0.029850,0.017700,0.240850,0.711600
0.030600,0.019100,0.237350,0.712950
0.033100,0.019650,0.233600,0.713650
0.034150,0.020450,0.230250,0.715150
0.034900,0.021100,0.226700,0.717300
0.035150,0.021900,0.223950,0.719000
0.036600,0.022350,0.219050,0.722000
0.036900,0.022400,0.216050,0.724650
0.038300,0.022500,0.212650,0.726550
0.040300,0.021850,0.209800,0.728050
0.041900,0.021350,0.205900,0.730850
0.042850,0.022050,0.202000,0.733100
0.043450,0.023800,0.196800,0.735950
0.043050,0.023450,0.193600,0.739900
0.043800,0.022100,0.191100,0.743000
0.044300,0.021750,0.188100,0.745850
0.044750,0.022350,0.183650,0.749250
0.044500,0.022750,0.179400,0.753350
0.044450,0.023150,0.176250,0.756150
0.044850,0.022850,0.172750,0.759550
0.045350,0.022650,0.169250,0.762750
0.045450,0.021850,0.166650,0.766050
0.045050,0.021750,0.163950,0.769250
0.044900,0.021700,0.161500,0.771900
0.046600,0.021600,0.158100,0.773700
0.046050,0.021950,0.155050,0.776950
0.045550,0.020900,0.152650,0.780900
0.045550,0.018950,0.151150,0.784350
0.044500,0.018950,0.149200,0.787350
0.042400,0.018900,0.148450,0.790250
0.042250,0.017200,0.148800,0.791750
0.040050,0.016550,0.148100,0.795300
0.038850,0.016700,0.146950,0.797500
0.038050,0.016700,0.145550,0.799700
0.038050,0.016350,0.144250,0.801350
0.036450,0.016300,0.143950,0.803300
0.035000,0.015850,0.144200,0.804950
0.034400,0.015500,0.144250,0.805850
0.033250,0.015100,0.144150,0.807500
0.032850,0.014300,0.144050,0.808800
0.032800,0.012650,0.146250,0.808300
0.031750,0.013100,0.147100,0.808050
0.030800,0.013450,0.146900,0.808850
0.030600,0.013400,0.147000,0.809000
0.029450,0.013050,0.148350,0.809150
0.028700,0.012400,0.149300,0.809600
0.028550,0.011700,0.150400,0.809350
0.028500,0.011650,0.150500,0.809350
0.027100,0.011500,0.151450,0.809950
0.027900,0.011250,0.152450,0.808400
0.027750,0.011400,0.152400,0.808450
0.027550,0.011550,0.154250,0.806650
0.026950,0.011100,0.155750,0.806200
0.025600,0.011100,0.158100,0.805200
0.025550,0.010350,0.160550,0.803550
0.025150,0.009750,0.162750,0.802350
0.023450,0.011050,0.162600,0.802900
0.023450,0.009950,0.163850,0.802750
0.023800,0.009500,0.165800,0.800900
0.023100,0.010150,0.166100,0.800650
0.023250,0.009800,0.167650,0.799300
0.021550,0.009600,0.169700,0.799150
0.022150,0.009700,0.171850,0.796300
0.021500,0.009300,0.173400,0.795800
0.020700,0.009300,0.174750,0.795250
0.020950,0.009900,0.175900,0.793250
0.021150,0.009400,0.176800,0.792650
0.021300,0.009050,0.178850,0.790800
0.020850,0.009500,0.179450,0.790200
0.020850,0.009600,0.180750,0.788800
0.020850,0.010150,0.182100,0.786900
0.021200,0.009950,0.183900,0.784950
0.021000,0.009800,0.185350,0.783850
0.020250,0.011000,0.185850,0.782900
0.019900,0.010550,0.187650,0.781900
0.020100,0.009800,0.188950,0.781150
0.020300,0.010450,0.188800,0.780450
0.020600,0.010300,0.190200,0.778900
0.020250,0.010050,0.191150,0.778550
0.020100,0.010350,0.193100,0.776450
0.020850,0.010700,0.194500,0.773950
0.020750,0.011000,0.195050,0.773200
0.020850,0.011050,0.195850,0.772250
0.021900,0.010450,0.196200,0.771450
0.021950,0.010500,0.197200,0.770350
0.022050,0.010200,0.198600,0.769150
0.022000,0.010450,0.199650,0.767900
0.021050,0.010400,0.201300,0.767250
0.020700,0.010400,0.202500,0.766400
0.020400,0.011000,0.204200,0.764400
0.021500,0.010050,0.205250,0.763200
0.021250,0.010100,0.206150,0.762500
0.021600,0.010200,0.207250,0.760950
0.022050,0.011150,0.207700,0.759100
0.022050,0.011400,0.208600,0.757950
0.022450,0.011650,0.208700,0.757200
0.023150,0.010650,0.210400,0.755800
0.023200,0.011800,0.210750,0.754250
0.022750,0.012850,0.210250,0.754150
0.022950,0.013150,0.211450,0.752450
0.023600,0.013200,0.210950,0.752250
0.024050,0.013150,0.211800,0.751000
0.024200,0.013200,0.213100,0.749500
0.024450,0.014000,0.211850,0.749700
0.025700,0.014050,0.211650,0.748600
0.027050,0.014450,0.211800,0.746700
0.026850,0.014650,0.212300,0.746200
0.028150,0.014500,0.212600,0.744750
0.028450,0.015150,0.211500,0.744900
0.029000,0.014900,0.212100,0.744000
0.029150,0.015950,0.212200,0.742700
0.029000,0.016200,0.211900,0.742900
0.030050,0.017350,0.210600,0.742000
0.030950,0.017150,0.209800,0.742100
0.031900,0.017600,0.208050,0.742450
0.032450,0.018100,0.207100,0.742350
0.032850,0.019400,0.205700,0.742050
0.032200,0.019250,0.205100,0.743450
0.033500,0.018550,0.203950,0.744000
0.034550,0.018850,0.203350,0.743250
0.036100,0.018400,0.203050,0.742450
0.035750,0.019150,0.201350,0.743750
0.035450,0.020250,0.199350,0.744950
0.035850,0.019100,0.199600,0.745450
0.035950,0.019100,0.198500,0.746450
0.037400,0.018300,0.197500,0.746800
0.037300,0.019150,0.196400,0.747150
0.036700,0.019500,0.196550,0.747250
0.037450,0.019000,0.195600,0.747950
0.037950,0.020100,0.193650,0.748300
0.039050,0.020000,0.193300,0.747650
0.041000,0.019600,0.191300,0.748100
0.042800,0.018550,0.189850,0.748800
0.042400,0.019250,0.188500,0.749850
0.042650,0.020100,0.186400,0.750850
0.041650,0.020950,0.183850,0.753550
0.041000,0.020350,0.183950,0.754700
0.040400,0.020100,0.183100,0.756400
0.040350,0.020300,0.181800,0.757550
0.039500,0.019950,0.181800,0.758750
0.040300,0.020000,0.181250,0.758450
0.040100,0.019350,0.180700,0.759850
0.040800,0.018700,0.179900,0.760600
0.040500,0.018300,0.179950,0.761250
0.039200,0.018900,0.179900,0.762000
0.037800,0.018850,0.179350,0.764000
0.037500,0.018900,0.178950,0.764650
0.037800,0.019250,0.177600,0.765350
0.038650,0.018750,0.177650,0.764950
0.039100,0.018800,0.177300,0.764800
0.039300,0.019150,0.176200,0.765350
0.039750,0.018850,0.174400,0.767000
0.040450,0.018350,0.174250,0.766950
0.040500,0.018500,0.174050,0.766950
0.039950,0.018950,0.173550,0.767550
0.039350,0.018400,0.175100,0.767150
0.039200,0.018700,0.174000,0.768100
0.038650,0.019200,0.173100,0.769050
0.038900,0.019050,0.172850,0.769200
0.037700,0.019400,0.171900,0.771000
0.037900,0.019300,0.171650,0.771150
0.038350,0.018700,0.171150,0.771800
0.038350,0.018300,0.170600,0.772750
0.037800,0.018950,0.170050,0.773200
0.037200,0.019450,0.170150,0.773200
0.036800,0.019350,0.169050,0.774800
0.038500,0.017700,0.168850,0.774950
0.038500,0.017850,0.167800,0.775850
0.038250,0.016900,0.167000,0.777850
0.037050,0.017800,0.166650,0.778500
0.037450,0.016750,0.166850,0.778950
0.037200,0.018050,0.166950,0.777800
0.036850,0.018250,0.166350,0.778550
0.037000,0.017000,0.166900,0.779100
0.037000,0.016050,0.167950,0.779000
0.037000,0.016450,0.167900,0.778650
0.037050,0.016250,0.167350,0.779350
0.036700,0.015650,0.168450,0.779200
0.035350,0.016600,0.167250,0.780800
0.035150,0.016350,0.168050,0.780450
0.035200,0.016000,0.168750,0.780050
0.035350,0.015600,0.169550,0.779500
0.034950,0.015550,0.171650,0.777850
0.035350,0.015200,0.171400,0.778050
0.034650,0.015600,0.171400,0.778350
0.033950,0.015600,0.172450,0.778000
0.033050,0.015650,0.172350,0.778950
0.032300,0.016650,0.172800,0.778250
0.031350,0.017700,0.173800,0.777150
0.031250,0.017050,0.175450,0.776250
0.030850,0.016900,0.176750,0.775500
0.031550,0.016300,0.177950,0.774200
0.031250,0.015200,0.180150,0.773400
0.031400,0.014150,0.181050,0.773400
0.031350,0.015200,0.180800,0.772650
0.031100,0.015550,0.180950,0.772400
0.032400,0.015600,0.180600,0.771400
0.032150,0.016700,0.179850,0.771300
0.032800,0.016250,0.179450,0.771500
0.032950,0.015600,0.180150,0.771300
0.032650,0.016100,0.180700,0.770550
0.033500,0.015900,0.181500,0.769100
0.033250,0.016800,0.180850,0.769100
0.034050,0.016700,0.181800,0.767450
0.033150,0.017350,0.182100,0.767400
0.032850,0.017150,0.182050,0.767950
0.033550,0.017550,0.182050,0.766850
0.032950,0.017900,0.182650,0.766500
0.033200,0.017400,0.182750,0.766650
0.033450,0.016850,0.183800,0.765900
0.033500,0.017250,0.183700,0.765550
0.032800,0.017450,0.183850,0.765900
0.032500,0.017550,0.183800,0.766150
0.033450,0.016800,0.185250,0.764500
0.033950,0.016250,0.185750,0.764050
0.033250,0.016800,0.185150,0.764800
0.033700,0.016750,0.184700,0.764850
0.033750,0.016750,0.185250,0.764250
0.033900,0.017300,0.185400,0.763400
0.035650,0.016350,0.185000,0.763000
0.034400,0.017400,0.184200,0.764000
0.034050,0.018200,0.183950,0.763800
0.034900,0.017400,0.183450,0.764250
0.034900,0.016250,0.184050,0.764800
0.034250,0.016500,0.183650,0.765600
0.034600,0.016450,0.182750,0.766200
0.034050,0.017700,0.182400,0.765850
0.035300,0.017050,0.182650,0.765000
0.035450,0.016850,0.183000,0.764700
0.036300,0.016700,0.182950,0.764050
0.037600,0.016600,0.182100,0.763700
0.036950,0.017600,0.181100,0.764350
0.037650,0.017400,0.180950,0.764000
0.037150,0.018450,0.179600,0.764800
0.036200,0.019750,0.178150,0.765900
0.037750,0.019700,0.177100,0.765450
0.038550,0.019350,0.177000,0.765100
0.039450,0.017900,0.176750,0.765900
0.038850,0.018800,0.174850,0.767500
0.038750,0.017750,0.174400,0.769100
0.038600,0.017650,0.174300,0.769450
0.038500,0.017600,0.174200,0.769700
0.037700,0.017950,0.173200,0.771150
0.038000,0.018350,0.172800,0.770850
0.036650,0.018150,0.171900,0.773300
0.036450,0.017550,0.172350,0.773650
0.037050,0.017050,0.171650,0.774250
0.036400,0.016600,0.171950,0.775050
0.036500,0.016950,0.171050,0.775500
0.036750,0.016100,0.171100,0.776050
0.036900,0.016250,0.170500,0.776350
0.037750,0.016650,0.169150,0.776450
0.036900,0.015800,0.170650,0.776650
0.035850,0.016150,0.171450,0.776550
0.036350,0.015800,0.172050,0.775800
0.035250,0.016150,0.172900,0.775700
0.035550,0.015400,0.173600,0.775450
0.034100,0.016500,0.173750,0.775650
0.033500,0.017450,0.173750,0.775300
0.034200,0.017550,0.172950,0.775300
0.034350,0.017050,0.173550,0.775050
0.034700,0.015900,0.174650,0.774750
0.034350,0.017350,0.173750,0.774550
0.032850,0.017900,0.172900,0.776350
0.032600,0.017400,0.173900,0.776100
0.033000,0.016350,0.174500,0.776150
0.032600,0.015900,0.173750,0.777750
0.033000,0.015050,0.174950,0.777000
0.032450,0.015400,0.175650,0.776500
0.032450,0.015000,0.175950,0.776600
0.031650,0.015150,0.175550,0.777650
0.032400,0.014150,0.176650,0.776800
0.032700,0.013950,0.177800,0.775550
0.032200,0.014850,0.176950,0.776000
0.031650,0.015100,0.177950,0.775300
0.031500,0.015150,0.177850,0.775500
0.031250,0.013950,0.179500,0.775300
0.030350,0.014800,0.179250,0.775600
0.030850,0.015150,0.178800,0.775200
0.031500,0.014950,0.179550,0.774000
0.030850,0.015400,0.179000,0.774750
0.031600,0.014400,0.179300,0.774700
0.031050,0.015450,0.179350,0.774150
0.030350,0.015450,0.179900,0.774300
0.030700,0.015550,0.179450,0.774300
0.031650,0.015600,0.179050,0.773700
0.031450,0.016400,0.179150,0.773000
0.031200,0.016900,0.179000,0.772900
0.030800,0.017000,0.178750,0.773450
0.032050,0.016800,0.179250,0.771900
0.032700,0.016000,0.180550,0.770750
0.033850,0.014600,0.181250,0.770300
0.033000,0.015650,0.181300,0.770050
0.032350,0.015800,0.181350,0.770500
0.032500,0.014400,0.183000,0.770100
0.032600,0.015200,0.182700,0.769500
0.032150,0.015250,0.182300,0.770300
0.032600,0.015200,0.183350,0.768850
0.032200,0.014700,0.184500,0.768600
0.031850,0.015850,0.184100,0.768200
0.032150,0.014950,0.184850,0.768050
0.031250,0.015250,0.185050,0.768450
0.030750,0.015550,0.185550,0.768150
0.030400,0.015550,0.185450,0.768600
0.029850,0.016400,0.184450,0.769300
0.031350,0.016300,0.183600,0.768750
0.031700,0.015650,0.184500,0.768150
0.031750,0.014450,0.186200,0.767600
0.030700,0.014200,0.187300,0.767800
0.030300,0.013250,0.189400,0.767050
0.030100,0.013350,0.190100,0.766450
0.029350,0.014200,0.190100,0.766350
0.028900,0.014050,0.192050,0.765000
0.028650,0.015550,0.191700,0.764100
0.028500,0.016800,0.192050,0.762650
0.030050,0.015200,0.192750,0.762000
0.030100,0.016450,0.193350,0.760100
0.030900,0.015850,0.194000,0.759250
0.031900,0.015300,0.194100,0.758700
0.031950,0.015650,0.193350,0.759050
0.031300,0.015950,0.194100,0.758650
0.031300,0.015700,0.194850,0.758150
0.031000,0.016150,0.195300,0.757550
0.031300,0.016400,0.194450,0.757850
0.031200,0.016700,0.195450,0.756650
0.032300,0.017300,0.194850,0.755550
0.031150,0.018100,0.194500,0.756250
0.032000,0.017650,0.194400,0.755950
0.033700,0.016850,0.194250,0.755200
0.033850,0.016950,0.193650,0.755550
0.033500,0.018250,0.191750,0.756500
0.033550,0.018700,0.191600,0.756150
0.033300,0.019150,0.191250,0.756300
0.034650,0.019550,0.191250,0.754550
0.035250,0.019100,0.190950,0.754700
0.035750,0.019100,0.190400,0.754750
0.036250,0.019100,0.189350,0.755300
0.035750,0.020700,0.187100,0.756450
0.036400,0.019900,0.186000,0.757700
0.037250,0.020850,0.183700,0.758200
0.036600,0.019850,0.184650,0.758900
0.036800,0.019300,0.184550,0.759350
0.037800,0.019100,0.183950,0.759150
0.037400,0.018550,0.183700,0.760350
0.038000,0.018500,0.183300,0.760200
0.038300,0.017950,0.183350,0.760400
0.037950,0.017750,0.183100,0.761200
0.038100,0.017400,0.182350,0.762150
0.038600,0.018700,0.180550,0.762150
0.039150,0.018650,0.180450,0.761750
0.037000,0.019850,0.180750,0.762400
0.037050,0.019050,0.181000,0.762900
0.037100,0.018550,0.181150,0.763200
0.037250,0.017800,0.181750,0.763200
0.036700,0.018450,0.180750,0.764100
0.037150,0.018950,0.180150,0.763750
0.037500,0.018150,0.180700,0.763650
0.037800,0.017600,0.179450,0.765150
0.037550,0.017650,0.179350,0.765450
0.037050,0.018050,0.179300,0.765600
0.037150,0.018250,0.178700,0.765900
0.037200,0.018300,0.179000,0.765500
0.036550,0.018700,0.179550,0.765200
0.035800,0.019000,0.178500,0.766700
0.037950,0.018200,0.177500,0.766350
0.038050,0.018300,0.177400,0.766250
0.037750,0.018350,0.177200,0.766700
0.037950,0.018400,0.176450,0.767200
0.038350,0.018500,0.175200,0.767950
0.037950,0.017200,0.175500,0.769350
0.037000,0.018400,0.173750,0.770850
0.037450,0.018200,0.174350,0.770000
0.037800,0.018350,0.173300,0.770550
0.037550,0.017700,0.173600,0.771150
0.035950,0.018150,0.173100,0.772800
0.035600,0.016950,0.173550,0.773900
0.035150,0.016450,0.174800,0.773600
0.034650,0.015950,0.175900,0.773500
0.035050,0.016300,0.175950,0.772700
0.035150,0.016300,0.176250,0.772300
0.034800,0.016650,0.176950,0.771600
0.034450,0.016750,0.177700,0.771100
0.034350,0.017350,0.178350,0.769950
0.034450,0.016250,0.179450,0.769850
0.033850,0.016050,0.179500,0.770600
0.035450,0.016000,0.180350,0.768200
0.034650,0.016000,0.180650,0.768700
0.035050,0.016200,0.180900,0.767850
0.034700,0.016750,0.181400,0.767150
0.035000,0.016000,0.182350,0.766650
0.034250,0.017000,0.182500,0.766250
0.033300,0.017600,0.183100,0.766000
0.033650,0.016650,0.183450,0.766250
0.032850,0.016800,0.184300,0.766050
0.033100,0.017150,0.183600,0.766150
0.034350,0.016350,0.183800,0.765500
0.034800,0.016250,0.184150,0.764800
0.035400,0.016450,0.184850,0.763300
0.035450,0.017100,0.184350,0.763100
0.034700,0.017150,0.184550,0.763600
0.034600,0.016350,0.185700,0.763350
0.035050,0.017050,0.184250,0.763650
0.035050,0.017250,0.183750,0.763950
0.035100,0.018200,0.183150,0.763550
0.035800,0.017050,0.183650,0.763500
0.035600,0.017200,0.183650,0.763550
0.036850,0.016000,0.184250,0.762900
0.035350,0.017750,0.182750,0.764150
0.035100,0.018350,0.183350,0.763200
0.035700,0.017850,0.183900,0.762550
0.036300,0.017100,0.185000,0.761600
0.035650,0.018700,0.184800,0.760850
0.036550,0.017550,0.184800,0.761100
0.037300,0.016550,0.184950,0.761200
0.038000,0.015700,0.185750,0.760550
0.037450,0.017100,0.185100,0.760350
0.036700,0.016550,0.186150,0.760600
0.036100,0.016550,0.187000,0.760350
0.036900,0.017300,0.185300,0.760500
0.037250,0.018250,0.184050,0.760450
0.036650,0.018200,0.184250,0.760900
0.037200,0.017600,0.184000,0.761200
0.038000,0.016600,0.184550,0.760850
0.037550,0.016750,0.183700,0.762000
0.037050,0.017400,0.182550,0.763000
0.037050,0.016800,0.183150,0.763000
0.037450,0.016850,0.182600,0.763100
0.037050,0.017100,0.182450,0.763400
0.036200,0.018400,0.182850,0.762550
0.035500,0.019000,0.183350,0.762150
0.034700,0.019100,0.182800,0.763400
0.035450,0.018650,0.183500,0.762400
0.036050,0.018250,0.184000,0.761700
0.036050,0.018550,0.183750,0.761650
0.035500,0.018750,0.183250,0.762500
0.034250,0.018800,0.183850,0.763100
0.032800,0.019000,0.183150,0.765050
0.034700,0.017050,0.183100,0.765150
0.035050,0.017200,0.182800,0.764950
0.035550,0.017100,0.182550,0.764800
0.036300,0.016850,0.182050,0.764800
0.036400,0.017050,0.180750,0.765800
0.037350,0.016450,0.181450,0.764750
0.036200,0.017700,0.181200,0.764900
0.036550,0.018000,0.180950,0.764500
0.036500,0.017200,0.180850,0.765450
0.036550,0.016800,0.180900,0.765750
0.036650,0.017000,0.180100,0.766250
0.036150,0.017100,0.180350,0.766400
0.036050,0.016600,0.180850,0.766500
0.036400,0.016750,0.180650,0.766200
0.036100,0.017900,0.179550,0.766450
0.036550,0.017700,0.179950,0.765800
0.036550,0.016800,0.180350,0.766300
0.036600,0.017900,0.179550,0.765950
0.035900,0.018700,0.179450,0.765950
0.036050,0.018750,0.179050,0.766150
0.036450,0.019050,0.178500,0.766000
0.035100,0.019300,0.178150,0.767450
0.035100,0.018650,0.177300,0.768950
0.036450,0.017700,0.177300,0.768550
0.035800,0.017900,0.177250,0.769050
0.036200,0.017800,0.177200,0.768800
0.035850,0.017950,0.177450,0.768750
0.036200,0.017150,0.177950,0.768700
0.034950,0.017950,0.178250,0.768850
0.035350,0.016950,0.178650,0.769050
0.036500,0.017550,0.178050,0.767900
0.036800,0.018500,0.177550,0.767150
0.036900,0.017950,0.178550,0.766600
0.037500,0.016850,0.177800,0.767850
0.036950,0.018000,0.176850,0.768200
0.036550,0.017550,0.177250,0.768650
0.036800,0.017500,0.176700,0.769000
0.037050,0.016950,0.177050,0.768950
0.036400,0.017850,0.176850,0.768900
0.036200,0.018250,0.176950,0.768600
0.035850,0.018450,0.176450,0.769250
0.036050,0.017750,0.176350,0.769850
0.036150,0.017300,0.176400,0.770150
0.036000,0.017100,0.176600,0.770300
0.035400,0.017450,0.177600,0.769550
0.034600,0.017400,0.178250,0.769750
0.034600,0.017450,0.177700,0.770250
0.035150,0.017600,0.176800,0.770450
0.036150,0.017150,0.177000,0.769700
0.036150,0.017400,0.176400,0.770050
0.037800,0.017250,0.176500,0.768450
0.037900,0.017550,0.176550,0.768000
0.037550,0.017400,0.176400,0.768650
0.036550,0.017400,0.176400,0.769650
0.038100,0.016050,0.176650,0.769200
0.037500,0.015650,0.178750,0.768100
0.037350,0.016000,0.178550,0.768100
0.036100,0.017200,0.178650,0.768050
0.036100,0.016800,0.178950,0.768150
0.035350,0.016200,0.179750,0.768700
0.034500,0.015450,0.179200,0.770850
0.033900,0.015650,0.179100,0.771350
0.034100,0.016150,0.179550,0.770200
0.034600,0.016050,0.180150,0.769200
0.033950,0.016900,0.179600,0.769550
0.034500,0.016950,0.179700,0.768850
0.033700,0.018250,0.179700,0.768350
0.033850,0.017650,0.180850,0.767650
0.034750,0.017050,0.181450,0.766750
0.035300,0.017200,0.180050,0.767450
0.034700,0.017000,0.180750,0.767550
0.033650,0.017800,0.181500,0.767050
0.033700,0.017200,0.182200,0.766900
0.034100,0.017050,0.182500,0.766350
0.034150,0.017050,0.181700,0.767100
0.035050,0.017950,0.180700,0.766300
0.034600,0.018200,0.180500,0.766700
0.034400,0.019250,0.180100,0.766250
0.034800,0.019400,0.178900,0.766900
0.035000,0.018950,0.179250,0.766800
0.034150,0.018300,0.179600,0.767950
0.034350,0.017850,0.178450,0.769350
0.035250,0.018000,0.177950,0.768800
0.035350,0.016950,0.178450,0.769250
0.035150,0.017300,0.178050,0.769500
0.036350,0.018150,0.177650,0.767850
0.035800,0.017600,0.176900,0.769700
0.036450,0.017550,0.176700,0.769300
0.035050,0.017300,0.176850,0.770800
0.035900,0.016450,0.176350,0.771300
0.035550,0.017300,0.176500,0.770650
0.036450,0.015700,0.177000,0.770850
0.035000,0.016250,0.176300,0.772450
0.034450,0.018000,0.174750,0.772800
0.034800,0.018250,0.173650,0.773300
0.034000,0.017950,0.175100,0.772950
0.034300,0.018150,0.175450,0.772100
