
real	0m9,908s
user	0m9,755s
sys	0m0,152s

real	0m9,904s
user	0m9,752s
sys	0m0,152s

real	0m9,911s
user	0m9,715s
sys	0m0,196s

real	0m10,027s
user	0m9,910s
sys	0m0,116s

real	0m10,018s
user	0m9,845s
sys	0m0,172s

real	0m9,913s
user	0m9,808s
sys	0m0,104s

real	0m9,912s
user	0m9,763s
sys	0m0,148s

real	0m9,903s
user	0m9,746s
sys	0m0,156s

real	0m9,893s
user	0m9,765s
sys	0m0,128s

real	0m10,010s
user	0m9,849s
sys	0m0,161s
