I,E,S,R
0.001,0.001,0.998,0
0.00135,0.00165,0.99695,5E-05
0.0016,0.0017,0.99645,0.00025
0.0018,0.0031,0.99465,0.00045
0.00275,0.00425,0.9925,0.0005
0.00365,0.00485,0.9906,0.0009
0.00435,0.00665,0.98755,0.00145
0.0051,0.0088,0.98385,0.00225
0.00695,0.0107,0.97915,0.0032
0.00955,0.01405,0.97235,0.00405
0.01235,0.0182,0.96395,0.0055
0.01515,0.0233,0.9542,0.00735
0.0202,0.02825,0.94205,0.0095
0.0253,0.0368,0.92585,0.01205
0.03255,0.04765,0.9043,0.0155
0.04085,0.05975,0.87965,0.01975
0.053,0.07405,0.8482,0.02475
0.06615,0.09355,0.8087,0.0316
0.0844,0.1111,0.7646,0.0399
0.10355,0.13105,0.71435,0.05105
0.1255,0.1542,0.6547,0.0656
0.1521,0.17995,0.5869,0.08105
0.1813,0.2013,0.51605,0.10135
0.2149,0.2194,0.44185,0.12385
0.2489,0.2293,0.36865,0.15315
0.2813,0.2337,0.29885,0.18615
0.308,0.23105,0.2368,0.22415
0.32955,0.22145,0.1841,0.2649
0.34875,0.20205,0.14175,0.30745
0.36175,0.17985,0.10805,0.35035
0.36205,0.1554,0.0817,0.40085
0.35835,0.1308,0.0625,0.44835
0.3475,0.1089,0.04905,0.49455
0.3321,0.0889,0.04015,0.53885
0.31485,0.0732,0.0324,0.57955
0.2923,0.0583,0.0267,0.6227
0.2705,0.0462,0.024,0.6593
0.2473,0.03685,0.0214,0.69445
0.2248,0.0295,0.0203,0.7254
0.20475,0.02255,0.0198,0.7529
0.1857,0.01975,0.0187,0.77585
0.166,0.01605,0.01855,0.7994
0.1481,0.0135,0.019,0.8194
0.1302,0.01185,0.0202,0.83775
0.1161,0.01045,0.02135,0.8521
0.1029,0.00905,0.0227,0.86535
0.09115,0.0082,0.02365,0.877
0.07995,0.00685,0.02545,0.88775
0.07055,0.00635,0.0273,0.8958
0.0624,0.00645,0.02885,0.9023
0.0552,0.0056,0.03055,0.90865
0.0488,0.00505,0.0327,0.91345
0.04425,0.00435,0.03535,0.91605
0.03975,0.00365,0.03695,0.91965
0.0358,0.0032,0.03945,0.92155
0.03135,0.00365,0.04215,0.92285
0.02725,0.0031,0.0451,0.92455
0.02445,0.00305,0.0472,0.9253
0.0225,0.00265,0.049,0.92585
0.02005,0.00255,0.0515,0.9259
0.0181,0.00225,0.05465,0.925
0.01615,0.0021,0.05735,0.9244
0.01425,0.00195,0.0598,0.924
0.01325,0.00185,0.0624,0.9225
0.012,0.00215,0.0645,0.92135
0.01055,0.0023,0.06665,0.9205
0.00985,0.0019,0.06975,0.9185
0.0091,0.002,0.07215,0.91675
0.00845,0.0021,0.07545,0.914
0.0074,0.0021,0.0787,0.9118
0.0071,0.00195,0.0815,0.90945
0.00695,0.0017,0.08385,0.9075
0.00675,0.0017,0.0866,0.90495
0.0062,0.00135,0.08895,0.9035
0.00585,0.00105,0.09195,0.90115
0.00515,0.00115,0.09425,0.89945
0.00475,0.001,0.0974,0.89685
0.00445,0.00115,0.1,0.8944
0.00395,0.0012,0.1032,0.89165
0.00345,0.0012,0.1055,0.88985
0.0035,0.00115,0.10875,0.8866
0.00325,0.0012,0.11085,0.8847
0.0032,0.00115,0.11305,0.8826
0.0031,0.0008,0.1155,0.8806
0.00265,0.00095,0.11815,0.87825
0.00245,0.001,0.12105,0.8755
0.00195,0.001,0.1239,0.87315
0.00205,0.0007,0.1265,0.87075
0.0022,0.0006,0.1294,0.8678
0.00215,0.0006,0.1315,0.86575
0.00185,0.00065,0.13425,0.86325
0.00195,0.0006,0.13685,0.8606
0.0017,0.00065,0.1398,0.85785
0.0019,0.00065,0.14225,0.8552
0.00165,0.00065,0.1446,0.8531
0.00175,0.0006,0.14735,0.8503
0.00155,0.0007,0.14975,0.848
0.00135,0.0007,0.1519,0.84605
0.0013,0.00075,0.1544,0.84355
0.0012,0.0009,0.15665,0.84125
0.00115,0.0007,0.15915,0.839
0.00115,0.00055,0.16155,0.83675
0.0011,0.0005,0.16375,0.83465
0.00095,0.00045,0.16585,0.83275
0.00095,0.0003,0.16885,0.8299
0.00095,0.0003,0.1714,0.82735
0.001,0.00025,0.1737,0.82505
0.00085,0.0003,0.17635,0.8225
0.0008,0.00035,0.17825,0.8206
0.00075,0.00035,0.18075,0.81815
0.0008,0.00035,0.1833,0.81555
0.0007,0.00045,0.18585,0.813
0.0007,0.0005,0.1885,0.8103
0.00065,0.0005,0.1903,0.80855
0.0006,0.00045,0.1929,0.80605
0.0006,0.0005,0.19545,0.80345
0.0007,0.0004,0.1975,0.8014
0.0006,0.0003,0.19965,0.79945
0.00065,0.0004,0.20135,0.7976
0.0006,0.0004,0.20445,0.79455
0.0007,0.0004,0.2062,0.7927
0.0006,0.0004,0.2091,0.7899
0.0006,0.00035,0.21155,0.7875
0.00055,0.0005,0.2135,0.78545
0.00055,0.00045,0.21615,0.78285
0.0006,0.0004,0.2181,0.7809
0.0005,0.0004,0.2207,0.7784
0.0004,0.0005,0.2232,0.7759
0.0004,0.00045,0.2257,0.77345
0.0004,0.0004,0.22815,0.77105
0.0004,0.00045,0.23085,0.7683
0.00045,0.00045,0.23255,0.76655
0.0006,0.0003,0.2347,0.7644
0.00065,0.00025,0.2373,0.7618
0.0006,0.00025,0.2395,0.75965
0.0006,0.0003,0.24145,0.75765
0.00065,0.00035,0.2435,0.7555
0.0006,0.00035,0.2454,0.75365
0.00075,0.00025,0.248,0.751
0.00065,0.00035,0.25045,0.74855
0.0007,0.00045,0.2525,0.74635
0.00085,0.00045,0.25425,0.74445
0.00085,0.00055,0.25535,0.74325
0.0007,0.0007,0.2578,0.7408
0.0009,0.00045,0.25995,0.7387
0.0009,0.00055,0.262,0.73655
0.00085,0.00055,0.26395,0.73465
0.001,0.00065,0.2661,0.73225
0.00095,0.00055,0.26805,0.73045
0.00095,0.00035,0.2702,0.7285
0.001,0.0004,0.2721,0.7265
0.0011,0.0005,0.274,0.7244
0.00105,0.0007,0.27565,0.7226
0.00095,0.00075,0.27705,0.72125
0.00095,0.00085,0.27865,0.71955
0.00125,0.00045,0.2803,0.718
0.00135,0.00025,0.28265,0.71575
0.00115,0.0004,0.2844,0.71405
0.0013,0.0005,0.28615,0.71205
0.0012,0.00065,0.2884,0.70975
0.0012,0.0006,0.2903,0.7079
0.00115,0.00065,0.2919,0.7063
0.00115,0.0008,0.2937,0.70435
0.0011,0.0009,0.2956,0.7024
0.00105,0.001,0.29735,0.7006
0.00095,0.00105,0.29875,0.69925
0.00095,0.00125,0.30025,0.69755
0.0011,0.00115,0.3021,0.69565
0.00115,0.001,0.3042,0.69365
0.00125,0.00085,0.3061,0.6918
0.0013,0.001,0.3079,0.6898
0.00145,0.001,0.31005,0.6875
0.0015,0.0011,0.3113,0.6861
0.0017,0.00115,0.31255,0.6846
0.00195,0.0009,0.31445,0.6827
0.00195,0.00145,0.31525,0.68135
0.0019,0.0019,0.31605,0.68015
0.0021,0.0018,0.31735,0.67875
0.00225,0.002,0.31865,0.6771
0.0027,0.00155,0.3202,0.67555
0.0028,0.00185,0.3214,0.67395
0.0028,0.00195,0.3233,0.67195
0.0032,0.00165,0.3247,0.67045
0.00315,0.00225,0.3259,0.6687
0.00345,0.00205,0.3272,0.6673
0.00345,0.0021,0.32835,0.6661
0.00355,0.0027,0.32855,0.6652
0.00385,0.0028,0.3289,0.66445
0.0043,0.00305,0.3295,0.66315
0.0048,0.00345,0.32975,0.662
0.00505,0.00395,0.3305,0.6605
0.0053,0.004,0.3317,0.659
0.0058,0.0043,0.33185,0.65805
0.0061,0.00515,0.33195,0.6568
0.00655,0.00495,0.33285,0.65565
0.00745,0.00535,0.3329,0.6543
0.00845,0.0055,0.3327,0.65335
0.0089,0.00655,0.3316,0.65295
0.0096,0.00675,0.33065,0.653
0.01035,0.0072,0.32975,0.6527
0.01095,0.00845,0.32835,0.65225
0.01095,0.0097,0.32795,0.6514
0.0123,0.00915,0.3279,0.65065
0.01295,0.0105,0.32575,0.6508
0.01395,0.01045,0.3247,0.6509
0.01485,0.01085,0.3229,0.6514
0.01695,0.01085,0.3215,0.6507
0.01775,0.01235,0.3186,0.6513
0.0181,0.0135,0.31595,0.65245
0.019,0.01425,0.314,0.65275
0.0198,0.0152,0.31115,0.65385
0.0224,0.01545,0.3076,0.65455
0.0243,0.01595,0.30375,0.656
0.02475,0.0176,0.30025,0.6574
0.02705,0.0176,0.2968,0.65855
0.02855,0.01925,0.2917,0.6605
0.031,0.021,0.2869,0.6611
0.0321,0.02245,0.2823,0.66315
0.03445,0.0237,0.27665,0.6652
0.03665,0.02375,0.27225,0.66735
0.0391,0.02445,0.26675,0.6697
0.0412,0.0253,0.26125,0.67225
0.04295,0.02745,0.2546,0.675
0.04605,0.0275,0.24755,0.6789
0.0467,0.0298,0.2406,0.6829
0.04815,0.03045,0.2343,0.6871
0.05025,0.03165,0.2273,0.6908
0.05115,0.0324,0.22035,0.6961
0.053,0.03325,0.2133,0.70045
0.05475,0.03315,0.20645,0.70565
0.057,0.03185,0.2004,0.71075
0.05885,0.0317,0.19355,0.7159
0.05915,0.03075,0.1885,0.7216
0.0596,0.0305,0.1822,0.7277
0.05985,0.0299,0.1773,0.73295
0.0586,0.0308,0.1717,0.7389
0.0591,0.03055,0.1662,0.74415
0.06015,0.0295,0.1619,0.74845
0.0592,0.0302,0.1566,0.754
0.05855,0.03,0.1515,0.75995
0.05915,0.02725,0.14795,0.76565
0.0598,0.02575,0.1436,0.77085
0.0596,0.0251,0.1395,0.7758
0.06005,0.02325,0.1362,0.7805
0.0582,0.02335,0.1325,0.78595
0.0568,0.0226,0.1302,0.7904
0.0554,0.02225,0.12845,0.7939
0.0533,0.02185,0.12595,0.7989
0.0536,0.02045,0.1236,0.80235
0.05175,0.01985,0.12195,0.80645
0.0495,0.01955,0.12045,0.8105
0.04805,0.01855,0.11965,0.81375
0.0453,0.01885,0.1196,0.81625
0.0444,0.0177,0.11925,0.81865
0.04365,0.01555,0.11965,0.82115
0.0413,0.01505,0.1203,0.82335
0.0397,0.0141,0.12115,0.82505
0.038,0.0132,0.1212,0.8276
0.0353,0.01265,0.12165,0.8304
0.03555,0.0123,0.1219,0.83025
0.0338,0.0126,0.12265,0.83095
0.0314,0.0127,0.12335,0.83255
0.02985,0.01265,0.12475,0.83275
0.0292,0.01235,0.125,0.83345
0.02865,0.01105,0.1271,0.8332
0.0273,0.0107,0.12795,0.83405
0.0264,0.0102,0.1291,0.8343
0.02545,0.0092,0.1316,0.83375
0.0249,0.00905,0.13265,0.8334
0.0241,0.009,0.1347,0.8322
0.02405,0.0088,0.1366,0.83055
0.0235,0.00805,0.139,0.82945
0.0228,0.0075,0.1407,0.829
0.02175,0.00865,0.1419,0.8277
0.021,0.0094,0.14275,0.82685
0.02115,0.009,0.14455,0.8253
0.02025,0.0085,0.14775,0.8235
0.0196,0.00805,0.1501,0.82225
0.01865,0.00845,0.152,0.8209
0.01795,0.0087,0.1534,0.81995
0.01645,0.00905,0.15555,0.81895
0.0164,0.00845,0.158,0.81715
0.01665,0.00845,0.1596,0.8153
0.0163,0.0086,0.1619,0.8132
0.01645,0.00815,0.16415,0.81125
0.01675,0.0077,0.165,0.81055
0.0171,0.0078,0.1673,0.8078
0.01755,0.00775,0.1699,0.8048
0.0176,0.00765,0.1714,0.80335
0.01675,0.008,0.17345,0.8018
0.01605,0.00815,0.17555,0.80025
0.01645,0.00805,0.1773,0.7982
0.0158,0.00915,0.17885,0.7962
0.01635,0.0091,0.1807,0.79385
0.01675,0.00875,0.1833,0.7912
0.01705,0.0088,0.1841,0.79005
0.01715,0.0087,0.18565,0.7885
0.018,0.0077,0.18825,0.78605
0.0182,0.0082,0.1894,0.7842
0.01825,0.00785,0.1921,0.7818
0.018,0.0079,0.19385,0.78025
0.0177,0.0085,0.19555,0.77825
0.0178,0.00885,0.19695,0.7764
0.01725,0.0097,0.19855,0.7745
0.01835,0.009,0.2014,0.77125
0.01745,0.00955,0.2032,0.7698
0.01775,0.00945,0.2045,0.7683
0.01785,0.0096,0.2055,0.76705
0.0187,0.01025,0.2064,0.76465
0.01895,0.0106,0.20755,0.7629
0.0193,0.01,0.21015,0.76055
0.0186,0.0111,0.2116,0.7587
0.01925,0.01055,0.2132,0.757
0.0198,0.0102,0.21405,0.75595
0.02,0.0103,0.2154,0.7543
0.0204,0.0102,0.2165,0.7529
0.02095,0.0097,0.21755,0.7518
0.02025,0.0112,0.21745,0.7511
0.02115,0.01125,0.2195,0.7481
0.0221,0.0118,0.21985,0.74625
0.02215,0.01285,0.22135,0.74365
0.02275,0.0138,0.2211,0.74235
0.0227,0.01415,0.22135,0.7418
0.0236,0.0132,0.22285,0.74035
0.02285,0.01355,0.22315,0.74045
0.02485,0.01405,0.2232,0.7379
0.0258,0.0142,0.22295,0.73705
0.0261,0.01485,0.22185,0.7372
0.02635,0.0141,0.22165,0.7379
0.02765,0.0133,0.2226,0.73645
0.0268,0.01385,0.2219,0.73745
0.02665,0.015,0.22095,0.7374
0.02785,0.01505,0.22005,0.73705
0.0287,0.01565,0.2195,0.73615
0.02935,0.0155,0.21915,0.736
0.0294,0.0165,0.2178,0.7363
0.0298,0.01645,0.21805,0.7357
0.02985,0.01745,0.21715,0.73555
0.0312,0.0183,0.2163,0.7342
0.0319,0.0187,0.21505,0.73435
0.03385,0.0192,0.2133,0.73365
0.035,0.02065,0.21165,0.7327
0.03515,0.02055,0.2102,0.7341
0.0359,0.0206,0.20885,0.73465
0.03765,0.01945,0.20805,0.73485
0.03715,0.0198,0.2071,0.73595
0.03685,0.0205,0.2055,0.73715
0.0376,0.0214,0.20275,0.73825
0.03815,0.0209,0.20215,0.7388
0.03775,0.0204,0.20105,0.7408
0.03805,0.0215,0.19925,0.7412
0.039,0.02045,0.1984,0.74215
0.03965,0.02065,0.1964,0.7433
0.0404,0.0194,0.19645,0.74375
0.0398,0.01995,0.19375,0.7465
0.03975,0.02075,0.19205,0.74745
0.03925,0.0211,0.1903,0.74935
0.04025,0.02045,0.1902,0.7491
0.0412,0.0211,0.1883,0.7494
0.04205,0.0208,0.187,0.75015
0.04265,0.02155,0.18565,0.75015
0.0428,0.0208,0.18425,0.75215
0.0423,0.0211,0.18335,0.75325
0.04215,0.01995,0.1819,0.756
0.04245,0.0191,0.18115,0.7573
0.042,0.01905,0.1807,0.75825
0.04105,0.01925,0.18045,0.75925
0.04055,0.01935,0.18,0.7601
0.04235,0.0181,0.18015,0.7594
0.04175,0.0191,0.1794,0.75975
0.0409,0.0208,0.1772,0.7611
0.04135,0.0203,0.1771,0.76125
0.04205,0.01995,0.1762,0.7618
0.0415,0.01935,0.1762,0.76295
0.041,0.0202,0.17555,0.76325
0.04055,0.0193,0.17575,0.7644
0.04015,0.01855,0.1757,0.7656
0.0409,0.01885,0.17425,0.766
0.04135,0.01875,0.1741,0.7658
0.04085,0.01945,0.17325,0.76645
0.0405,0.0182,0.17355,0.76775
0.03945,0.01955,0.1713,0.7697
0.0395,0.01955,0.1707,0.77025
0.03895,0.0185,0.17115,0.7714
0.03955,0.0179,0.17075,0.7718
0.03925,0.0182,0.1704,0.77215
0.04015,0.01815,0.16955,0.77215
0.03945,0.01795,0.17005,0.77255
0.0377,0.01925,0.1692,0.77385
0.0376,0.01895,0.16975,0.7737
0.0393,0.0173,0.1703,0.7731
0.0392,0.01785,0.16955,0.7734
0.0385,0.01725,0.17015,0.7741
0.0379,0.01755,0.1694,0.77515
0.03855,0.0171,0.1696,0.77475
0.0388,0.01705,0.1696,0.77455
0.0384,0.0182,0.16885,0.77455
0.03855,0.01815,0.1696,0.7737
0.03845,0.0172,0.16975,0.7746
0.0376,0.0181,0.16905,0.77525
0.0378,0.0173,0.16945,0.77545
0.0376,0.0173,0.16895,0.77615
0.0372,0.017,0.1695,0.7763
0.03625,0.01675,0.16965,0.77735
0.0353,0.0162,0.1702,0.7783
0.03515,0.0171,0.16985,0.7779
0.0362,0.01635,0.16945,0.778
0.03605,0.0156,0.17075,0.7776
0.035,0.0159,0.1712,0.7779
0.03525,0.01525,0.172,0.7775
0.0349,0.0148,0.1722,0.7781
0.03435,0.01545,0.1748,0.7754
0.0337,0.01565,0.1754,0.77525
0.03345,0.0155,0.17615,0.7749
0.034,0.0156,0.1769,0.7735
0.03375,0.0149,0.17855,0.7728
0.033,0.01555,0.17915,0.7723
0.0325,0.0155,0.18005,0.77195
0.03155,0.01645,0.1814,0.7706
0.03045,0.01575,0.18285,0.77095
0.0295,0.0152,0.18505,0.77025
0.02965,0.01615,0.1853,0.7689
0.0302,0.01575,0.18555,0.7685
0.03055,0.0152,0.18655,0.7677
0.03025,0.0147,0.18815,0.7669
0.0308,0.0146,0.18885,0.76575
0.02985,0.0147,0.1902,0.76525
0.02895,0.01465,0.1917,0.7647
0.02845,0.01515,0.1924,0.764
0.0288,0.01415,0.1945,0.76255
0.02795,0.0145,0.196,0.76155
0.02825,0.01385,0.19745,0.76045
0.02835,0.01325,0.19915,0.75925
0.0282,0.0143,0.20045,0.75705
0.02805,0.0148,0.20035,0.7568
0.02915,0.01475,0.2005,0.7556
0.02945,0.01555,0.2012,0.7538
0.02885,0.0168,0.20065,0.7537
0.02935,0.0168,0.20115,0.7527
0.0295,0.01655,0.20345,0.7505
0.02945,0.0166,0.20335,0.7506
0.0302,0.01635,0.20375,0.7497
0.0306,0.01715,0.20365,0.7486
0.0322,0.01685,0.2035,0.74745
0.0322,0.0163,0.20385,0.74765
0.0322,0.01735,0.20245,0.748
0.0331,0.01705,0.2024,0.74745
0.03465,0.0161,0.2036,0.74565
0.03445,0.0168,0.20285,0.7459
0.03405,0.0158,0.20265,0.7475
0.03405,0.0164,0.20215,0.7474
0.03425,0.01545,0.20205,0.74825
0.03485,0.01575,0.2013,0.7481
0.0344,0.01595,0.2016,0.74805
0.0352,0.0159,0.2013,0.7476
0.0341,0.01715,0.20065,0.7481
0.03525,0.0183,0.19935,0.7471
0.0346,0.0201,0.19885,0.74645
0.03515,0.0191,0.1982,0.74755
0.03515,0.0199,0.19805,0.7469
0.0359,0.0205,0.19585,0.74775
0.0366,0.0208,0.19475,0.74785
0.03745,0.02065,0.1941,0.7478
0.0377,0.02165,0.19215,0.7485
0.03735,0.02075,0.1926,0.7493
0.03815,0.0216,0.19045,0.7498
0.03835,0.02145,0.1888,0.7514
0.0396,0.02165,0.187,0.75175
0.0412,0.0206,0.18585,0.75235
0.04265,0.02035,0.1838,0.7532
0.04155,0.02055,0.1825,0.7554
0.04225,0.01995,0.1821,0.7557
0.04125,0.0204,0.18095,0.7574
0.0421,0.0216,0.178,0.7583
0.0426,0.0204,0.1781,0.7589
0.04155,0.02095,0.17675,0.76075
0.04205,0.0203,0.17595,0.7617
0.04105,0.0203,0.175,0.76365
0.04065,0.0198,0.17435,0.7652
0.04,0.01925,0.17415,0.7666
0.0401,0.0202,0.1723,0.7674
0.039,0.01945,0.1722,0.76935
0.038,0.019,0.17235,0.77065
0.03875,0.0186,0.1722,0.77045
0.03795,0.01865,0.17115,0.77225
0.03815,0.01925,0.17,0.7726
0.03825,0.01895,0.16985,0.77295
0.03765,0.0193,0.1693,0.77375
0.0371,0.01895,0.16915,0.7748
0.0377,0.0186,0.16835,0.77535
0.0383,0.01905,0.16715,0.7755
0.03875,0.01855,0.1674,0.7753
0.03975,0.01805,0.1669,0.7753
0.0398,0.0182,0.1652,0.7768
0.0393,0.0179,0.1656,0.7772
0.03995,0.01745,0.16615,0.77645
0.0387,0.01805,0.1653,0.77795
0.03885,0.01725,0.1639,0.78
0.03755,0.0171,0.1632,0.78215
0.03705,0.01715,0.163,0.7828
0.03665,0.0173,0.1631,0.78295
0.036,0.01625,0.1637,0.78405
0.0353,0.016,0.16245,0.78625
0.03535,0.0149,0.16235,0.7874
0.0351,0.0156,0.1624,0.7869
0.0355,0.01525,0.16285,0.7864
0.03515,0.01645,0.1625,0.7859
0.03555,0.0164,0.1625,0.78555
0.0358,0.01615,0.16355,0.7845
0.0343,0.01625,0.1639,0.78555
0.03345,0.01535,0.16485,0.78635
0.03345,0.0154,0.1653,0.78585
0.03305,0.01635,0.165,0.7856
0.03275,0.0161,0.16575,0.7854
0.0322,0.0153,0.16755,0.78495
0.0322,0.01505,0.1688,0.78395
0.03255,0.0156,0.1694,0.78245
0.03235,0.0153,0.1694,0.78295
0.032,0.01525,0.17045,0.7823
0.03245,0.0144,0.1708,0.78235
0.0324,0.01385,0.17175,0.782
0.03205,0.014,0.1721,0.78185
0.03285,0.01385,0.17205,0.78125
0.03205,0.01485,0.1718,0.7813
0.0335,0.01385,0.1711,0.78155
0.0325,0.014,0.1719,0.7816
0.0311,0.0146,0.172,0.7823
0.03105,0.01595,0.1726,0.7804
0.03075,0.01565,0.17275,0.78085
0.03175,0.0149,0.17375,0.7796
0.0321,0.0155,0.1733,0.7791
0.03275,0.0137,0.1752,0.77835
0.0319,0.0138,0.1755,0.7788
0.0311,0.0145,0.17505,0.77935
0.03105,0.0157,0.1747,0.77855
0.0312,0.0161,0.1748,0.7779
0.03125,0.01545,0.1753,0.778
0.0311,0.0156,0.17545,0.77785
0.0322,0.01605,0.17495,0.7768
0.03275,0.01615,0.17515,0.77595
0.03255,0.0161,0.1753,0.77605
0.0322,0.01655,0.1752,0.77605
0.03185,0.0157,0.1759,0.77655
0.03135,0.01535,0.17745,0.77585
0.0317,0.0168,0.17755,0.77395
0.03205,0.0165,0.17725,0.7742
0.03195,0.0169,0.17735,0.7738
0.0326,0.01565,0.1783,0.77345
0.03315,0.0157,0.17775,0.7734
0.0328,0.01635,0.17705,0.7738
0.0325,0.01615,0.1775,0.77385
0.0319,0.01615,0.178,0.77395
0.0327,0.0154,0.17895,0.77295
0.03175,0.01585,0.17985,0.77255
0.03175,0.0152,0.18015,0.7729
0.03105,0.0156,0.1819,0.77145
0.0308,0.01575,0.1812,0.77225
0.0301,0.01605,0.18045,0.7734
0.0302,0.0154,0.1819,0.7725
0.03045,0.0155,0.18205,0.772
0.0304,0.015,0.1829,0.7717
0.03095,0.01425,0.1836,0.7712
0.03025,0.01425,0.18445,0.77105
0.0305,0.0144,0.1849,0.7702
0.03095,0.0144,0.18575,0.7689
0.03015,0.0154,0.18465,0.7698
0.03045,0.01445,0.18535,0.76975
0.0311,0.01365,0.18645,0.7688
0.03025,0.01335,0.18805,0.76835
0.03125,0.01315,0.1886,0.767
0.0304,0.0143,0.1888,0.7665
0.03015,0.01465,0.18875,0.76645
0.0299,0.01505,0.18905,0.766
0.02975,0.0159,0.1885,0.76585
0.0302,0.01605,0.18855,0.7652
0.0308,0.01495,0.1896,0.76465
0.0309,0.01515,0.1896,0.76435
0.02985,0.01465,0.1898,0.7657
0.0305,0.01495,0.19075,0.7638
0.02985,0.0151,0.19095,0.7641
0.0297,0.0147,0.19115,0.76445
0.0304,0.0146,0.1917,0.7633
0.0301,0.01415,0.1937,0.76205
0.0295,0.01535,0.19405,0.7611
0.03005,0.01575,0.1945,0.7597
0.03005,0.0157,0.19465,0.7596
0.03035,0.01535,0.19455,0.75975
0.03,0.0151,0.19455,0.76035
0.0293,0.01475,0.195,0.76095
0.0287,0.01515,0.19585,0.7603
0.0281,0.015,0.1977,0.7592
0.0284,0.0152,0.19805,0.75835
0.0297,0.01545,0.19775,0.7571
0.03085,0.01515,0.1988,0.7552
0.03155,0.0155,0.1981,0.75485
0.0315,0.0161,0.1982,0.7542
0.03315,0.01585,0.19805,0.75295
0.03395,0.0157,0.19865,0.7517
0.03315,0.01665,0.19925,0.75095
0.03405,0.01675,0.1997,0.7495
0.0352,0.01745,0.1983,0.74905
0.03485,0.01765,0.19835,0.74915
0.03575,0.01655,0.19845,0.74925
0.03505,0.01785,0.19785,0.74925
0.0356,0.0177,0.19735,0.74935
0.0356,0.0188,0.19635,0.74925
0.03715,0.0179,0.1954,0.74955
0.03735,0.0175,0.19525,0.7499
0.037,0.0188,0.19355,0.75065
0.03715,0.01885,0.19275,0.75125
0.0382,0.0193,0.1918,0.7507
0.03795,0.02005,0.19205,0.74995
0.0393,0.01975,0.1913,0.74965
0.03955,0.01935,0.19055,0.75055
0.03825,0.02,0.19075,0.751
0.0391,0.01985,0.1904,0.75065
0.039,0.0193,0.19045,0.75125
0.0392,0.0189,0.19055,0.75135
0.0392,0.0183,0.19105,0.75145
0.0392,0.01905,0.18985,0.7519
0.039,0.02045,0.1889,0.75165
0.04045,0.02015,0.1887,0.7507
0.04125,0.0197,0.1887,0.75035
0.04095,0.0212,0.1866,0.75125
0.0405,0.02195,0.18515,0.7524
0.0409,0.02085,0.18425,0.754
0.04105,0.02005,0.1839,0.755
0.0412,0.01885,0.18465,0.7553
0.04085,0.01965,0.1839,0.7556
0.0431,0.01905,0.18425,0.7536
0.042,0.01995,0.1841,0.75395
0.0409,0.0213,0.18305,0.75475
0.04165,0.01995,0.1824,0.756
0.0416,0.02015,0.18145,0.7568
0.0425,0.0199,0.18095,0.75665
0.04215,0.01915,0.18085,0.75785
0.04155,0.01985,0.18015,0.75845
0.0408,0.02115,0.17785,0.7602
0.0411,0.01995,0.1779,0.76105
0.0414,0.02115,0.17535,0.7621
0.04075,0.02005,0.17515,0.76405
0.0408,0.0187,0.17535,0.76515
0.0402,0.01865,0.17645,0.7647
0.03865,0.01915,0.1767,0.7655
0.039,0.0189,0.17675,0.76535
0.03885,0.01855,0.1765,0.7661
0.0394,0.01885,0.17515,0.7666
0.04025,0.01705,0.17575,0.76695
0.03865,0.0175,0.17575,0.7681
0.0384,0.01765,0.17595,0.768
0.0386,0.01735,0.17595,0.7681
0.03835,0.0175,0.17645,0.7677
0.03765,0.01725,0.1766,0.7685
0.0373,0.0181,0.1771,0.7675
0.03785,0.01715,0.17765,0.76735
0.03635,0.01725,0.17835,0.76805
0.0354,0.01665,0.17935,0.7686
0.03595,0.01605,0.1793,0.7687
0.0352,0.01745,0.17935,0.768
0.0347,0.01795,0.1796,0.76775
0.0353,0.0182,0.1795,0.767
0.03515,0.01725,0.181,0.7666
0.03485,0.01755,0.18155,0.76605
0.03425,0.0181,0.18195,0.7657
0.03435,0.0175,0.18185,0.7663
0.0345,0.018,0.18255,0.76495
0.0353,0.0166,0.18415,0.76395
0.03535,0.01785,0.1834,0.7634
0.035,0.0185,0.1825,0.764
0.0358,0.01765,0.18305,0.7635
0.03565,0.01685,0.1843,0.7632
0.0351,0.0169,0.18545,0.76255
0.03525,0.01605,0.18495,0.76375
0.03385,0.01625,0.18555,0.76435
0.03415,0.0161,0.1853,0.76445
0.0346,0.0163,0.18595,0.76315
0.0341,0.0177,0.1856,0.7626
0.0358,0.01645,0.18605,0.7617
0.0361,0.01665,0.1869,0.76035
0.0359,0.017,0.187,0.7601
0.03585,0.0175,0.1865,0.76015
0.0354,0.017,0.18665,0.76095
0.03615,0.01735,0.18695,0.75955
0.0359,0.0182,0.1861,0.7598
0.0361,0.01895,0.18515,0.7598
0.03735,0.0178,0.18585,0.759
0.03655,0.01825,0.1852,0.76
0.0368,0.0189,0.1845,0.7598
0.0363,0.01995,0.18345,0.7603
0.03695,0.01905,0.18335,0.76065
0.03805,0.01865,0.1838,0.7595
0.0382,0.0175,0.1845,0.7598
0.03835,0.01775,0.18415,0.75975
0.0383,0.01795,0.1838,0.75995
0.0377,0.0184,0.18295,0.76095
0.03665,0.01935,0.18175,0.76225
0.0382,0.01895,0.18135,0.7615
0.038,0.01875,0.18015,0.7631
0.037,0.01855,0.18,0.76445
0.03665,0.0197,0.179,0.76465
0.03605,0.019,0.1792,0.76575
0.03565,0.0187,0.17885,0.7668
0.0363,0.01875,0.17795,0.767
0.0363,0.01905,0.17685,0.7678
0.03555,0.01975,0.1763,0.7684
0.0362,0.01905,0.17645,0.7683
0.03625,0.01775,0.177,0.769
0.03675,0.0171,0.17695,0.7692
0.0367,0.0174,0.17685,0.76905
0.03665,0.01755,0.17645,0.76935
0.03655,0.01675,0.1773,0.7694
0.03645,0.0172,0.17775,0.7686
0.03595,0.0172,0.17805,0.7688
0.03725,0.01615,0.17895,0.76765
0.03685,0.0167,0.17865,0.7678
0.03655,0.017,0.17765,0.7688
0.0362,0.0175,0.1774,0.7689
0.03675,0.01765,0.17715,0.76845
0.03675,0.0188,0.17475,0.7697
0.03715,0.0179,0.17505,0.7699
0.0386,0.01725,0.1754,0.76875
0.0372,0.01795,0.1749,0.76995
0.03725,0.01725,0.17435,0.77115
0.0374,0.01755,0.17395,0.7711
0.0376,0.01735,0.1746,0.77045
0.0371,0.01795,0.17335,0.7716
0.0369,0.0179,0.17425,0.77095
0.03735,0.01845,0.17355,0.77065
0.03645,0.02,0.17215,0.7714
0.03825,0.019,0.17115,0.7716
