
--------------------------
Total energy: 325.99 Joules, including:
	CPU energy: 325.99 Joules
	GPU energy: 0.00 Joules
--------------------------

--------------------------
Total energy: 326.46 Joules, including:
	CPU energy: 326.46 Joules
	GPU energy: 0.00 Joules
--------------------------

--------------------------
Total energy: 360.81 Joules, including:
	CPU energy: 360.81 Joules
	GPU energy: 0.00 Joules
--------------------------

--------------------------
Total energy: 408.91 Joules, including:
	CPU energy: 408.91 Joules
	GPU energy: 0.00 Joules
--------------------------

--------------------------
Total energy: 408.40 Joules, including:
	CPU energy: 408.40 Joules
	GPU energy: 0.00 Joules
--------------------------

--------------------------
Total energy: 385.30 Joules, including:
	CPU energy: 385.30 Joules
	GPU energy: 0.00 Joules
--------------------------

--------------------------
Total energy: 326.42 Joules, including:
	CPU energy: 326.42 Joules
	GPU energy: 0.00 Joules
--------------------------

--------------------------
Total energy: 325.62 Joules, including:
	CPU energy: 325.62 Joules
	GPU energy: 0.00 Joules
--------------------------

--------------------------
Total energy: 326.12 Joules, including:
	CPU energy: 326.12 Joules
	GPU energy: 0.00 Joules
--------------------------

--------------------------
Total energy: 323.50 Joules, including:
	CPU energy: 323.50 Joules
	GPU energy: 0.00 Joules
--------------------------
