
real	0m16,402s
user	0m16,372s
sys	0m0,028s

real	0m16,398s
user	0m16,365s
sys	0m0,032s

real	0m16,394s
user	0m16,349s
sys	0m0,044s

real	0m16,396s
user	0m16,354s
sys	0m0,040s

real	0m16,393s
user	0m16,336s
sys	0m0,056s

real	0m16,380s
user	0m16,335s
sys	0m0,044s
