I,E,S,R
0.001000,0.000650,0.998350,0.000000
0.000950,0.001100,0.997700,0.000250
0.001150,0.001500,0.996950,0.000400
0.001350,0.002150,0.996000,0.000500
0.002000,0.002400,0.995000,0.000600
0.002450,0.003600,0.993000,0.000950
0.002750,0.005050,0.990800,0.001400
0.004050,0.006000,0.988300,0.001650
0.005100,0.008250,0.984100,0.002550
0.006550,0.010650,0.979800,0.003000
0.008950,0.013600,0.973700,0.003750
0.012450,0.017100,0.965850,0.004600
0.016600,0.022350,0.954800,0.006250
0.021200,0.027750,0.943150,0.007900
0.026600,0.036450,0.926300,0.010650
0.033300,0.049200,0.903000,0.014500
0.043250,0.061050,0.876950,0.018750
0.054050,0.076150,0.845100,0.024700
0.069600,0.090500,0.807800,0.032100
0.086650,0.109150,0.762750,0.041450
0.106300,0.133950,0.706300,0.053450
0.127850,0.160500,0.643050,0.068600
0.156200,0.182400,0.574700,0.086700
0.185350,0.202700,0.504500,0.107450
0.220050,0.218850,0.429300,0.131800
0.255000,0.230700,0.355100,0.159200
0.284350,0.237800,0.284200,0.193650
0.314600,0.231450,0.224050,0.229900
0.339950,0.220450,0.170950,0.268650
0.363250,0.195750,0.129950,0.311050
0.370300,0.173500,0.097650,0.358550
0.369450,0.148400,0.072950,0.409200
0.358600,0.126400,0.055650,0.459350
0.348000,0.102600,0.043200,0.506200
0.329400,0.083950,0.034100,0.552550
0.308750,0.067650,0.027700,0.595900
0.284550,0.055200,0.023700,0.636550
0.266400,0.043550,0.021750,0.668300
0.241900,0.035500,0.020200,0.702400
0.219550,0.029250,0.018400,0.732800
0.199750,0.024550,0.018750,0.756950
0.183150,0.018800,0.018050,0.780000
0.164950,0.015450,0.018300,0.801300
0.148950,0.013100,0.018700,0.819250
0.130300,0.011400,0.019550,0.838750
0.117550,0.009400,0.020750,0.852300
0.103650,0.008250,0.021550,0.866550
0.093000,0.006900,0.023800,0.876300
0.082850,0.005750,0.025450,0.885950
0.073950,0.005250,0.027300,0.893500
0.065100,0.005250,0.028650,0.901000
0.057950,0.005800,0.029950,0.906300
0.051450,0.004700,0.031450,0.912400
0.046350,0.003600,0.034250,0.915800
0.040950,0.003550,0.036400,0.919100
0.036650,0.003550,0.038600,0.921200
0.032750,0.003600,0.040150,0.923500
0.028500,0.003200,0.042400,0.925900
0.024950,0.002800,0.045150,0.927100
0.021700,0.002200,0.048150,0.927950
0.019950,0.002150,0.051100,0.926800
0.018550,0.001800,0.054350,0.925300
0.015750,0.002150,0.056400,0.925700
0.013950,0.002200,0.059000,0.924850
0.012350,0.002300,0.061600,0.923750
0.011700,0.001850,0.064400,0.922050
0.011050,0.001750,0.067200,0.920000
0.009950,0.001400,0.069700,0.918950
0.009200,0.001800,0.072350,0.916650
0.008600,0.001750,0.075550,0.914100
0.007750,0.001500,0.078650,0.912100
0.007050,0.001650,0.081550,0.909750
0.006250,0.001650,0.083850,0.908250
0.005800,0.001750,0.086400,0.906050
0.005150,0.001600,0.089100,0.904150
0.004850,0.001600,0.092100,0.901450
0.004350,0.001550,0.094600,0.899500
0.004300,0.001200,0.098200,0.896300
0.004100,0.001250,0.100900,0.893750
0.003850,0.001200,0.102850,0.892100
0.003500,0.001350,0.104850,0.890300
0.003300,0.001200,0.108100,0.887400
0.003100,0.001100,0.109900,0.885900
0.002800,0.001000,0.112600,0.883600
0.002650,0.000950,0.114800,0.881600
0.002200,0.001050,0.117950,0.878800
0.002300,0.000750,0.120450,0.876500
0.002100,0.000900,0.123200,0.873800
0.001900,0.000950,0.126050,0.871100
0.001750,0.001150,0.127700,0.869400
0.001850,0.001000,0.130600,0.866550
0.001750,0.000900,0.132700,0.864650
0.001700,0.000750,0.134900,0.862650
0.001850,0.000700,0.138350,0.859100
0.001850,0.000600,0.141050,0.856500
0.001650,0.000650,0.143450,0.854250
0.001600,0.000500,0.146200,0.851700
0.001700,0.000350,0.148900,0.849050
0.001550,0.000450,0.151350,0.846650
0.001600,0.000300,0.154050,0.844050
0.001350,0.000650,0.156600,0.841400
0.001400,0.000650,0.159250,0.838700
0.001450,0.000600,0.162300,0.835650
0.001400,0.000500,0.164700,0.833400
0.001250,0.000650,0.167050,0.831050
0.001200,0.000500,0.170150,0.828150
0.001100,0.000450,0.173100,0.825350
0.000950,0.000450,0.175350,0.823250
0.000850,0.000550,0.178300,0.820300
0.000800,0.000650,0.180850,0.817700
0.000750,0.000600,0.183500,0.815150
0.000900,0.000500,0.185950,0.812650
0.001050,0.000250,0.188100,0.810600
0.001100,0.000300,0.190600,0.808000
0.001000,0.000500,0.193400,0.805100
0.001050,0.000600,0.195550,0.802800
0.001100,0.000700,0.197750,0.800450
0.001250,0.000700,0.199300,0.798750
0.001300,0.000550,0.201700,0.796450
0.001450,0.000550,0.203950,0.794050
0.001450,0.000600,0.206350,0.791600
0.001300,0.000550,0.208400,0.789750
0.001400,0.000650,0.210450,0.787500
0.001350,0.000600,0.212750,0.785300
0.001350,0.000600,0.214950,0.783100
0.001500,0.000700,0.217100,0.780700
0.001550,0.000600,0.220600,0.777250
0.001400,0.000900,0.222400,0.775300
0.001650,0.000800,0.224450,0.773100
0.001650,0.000850,0.226950,0.770550
0.001650,0.000800,0.229000,0.768550
0.001650,0.000850,0.231150,0.766350
0.001750,0.000650,0.233950,0.763650
0.001750,0.001100,0.234700,0.762450
0.002000,0.001300,0.235850,0.760850
0.002400,0.001300,0.237700,0.758600
0.002550,0.001200,0.239750,0.756500
0.002650,0.001450,0.241350,0.754550
0.002850,0.001750,0.242400,0.753000
0.003150,0.001550,0.244050,0.751250
0.003050,0.001650,0.245900,0.749400
0.002900,0.001850,0.247100,0.748150
0.003350,0.001750,0.248900,0.746000
0.003500,0.001950,0.249750,0.744800
0.003750,0.001950,0.250550,0.743750
0.003550,0.002000,0.251700,0.742750
0.003650,0.001800,0.253650,0.740900
0.003850,0.002000,0.254750,0.739400
0.004350,0.002050,0.255900,0.737700
0.004500,0.002200,0.257500,0.735800
0.004400,0.002450,0.258900,0.734250
0.004250,0.002400,0.260500,0.732850
0.004400,0.002300,0.262300,0.731000
0.004300,0.002100,0.263550,0.730050
0.004300,0.002300,0.265200,0.728200
0.004500,0.002550,0.265850,0.727100
0.004500,0.003600,0.265800,0.726100
0.004450,0.003550,0.267400,0.724600
0.004850,0.003850,0.268050,0.723250
0.005300,0.003900,0.269250,0.721550
0.005300,0.004100,0.270250,0.720350
0.005800,0.003600,0.271550,0.719050
0.005850,0.003950,0.272500,0.717700
0.006400,0.004050,0.272900,0.716650
0.006700,0.004700,0.273600,0.715000
0.007250,0.005200,0.274000,0.713550
0.008200,0.005000,0.274150,0.712650
0.008500,0.005150,0.274750,0.711600
0.009200,0.005500,0.274650,0.710650
0.009300,0.005950,0.274650,0.710100
0.009300,0.006550,0.274350,0.709800
0.010050,0.006800,0.274650,0.708500
0.010450,0.006350,0.275350,0.707850
0.010900,0.006600,0.275350,0.707150
0.011400,0.007100,0.275150,0.706350
0.012150,0.007350,0.274750,0.705750
0.012250,0.008000,0.274350,0.705400
0.013300,0.009100,0.273100,0.704500
0.014400,0.008150,0.272850,0.704600
0.014650,0.009150,0.271200,0.705000
0.014950,0.010300,0.269700,0.705050
0.015800,0.010350,0.268950,0.704900
0.016950,0.011250,0.267100,0.704700
0.018400,0.012000,0.265400,0.704200
0.019450,0.012400,0.263450,0.704700
0.020800,0.012750,0.261800,0.704650
0.022200,0.013600,0.259000,0.705200
0.023550,0.013850,0.256400,0.706200
0.025050,0.013900,0.253900,0.707150
0.025400,0.014000,0.252450,0.708150
0.026750,0.013650,0.250300,0.709300
0.027100,0.015000,0.247400,0.710500
0.026750,0.016750,0.244800,0.711700
0.028700,0.017150,0.242600,0.711550
0.028950,0.018700,0.239100,0.713250
0.030050,0.018500,0.236700,0.714750
0.031200,0.018500,0.234100,0.716200
0.033150,0.018600,0.230600,0.717650
0.033100,0.021200,0.225400,0.720300
0.035500,0.020600,0.221700,0.722200
0.036400,0.019750,0.219450,0.724400
0.037350,0.021150,0.214900,0.726600
0.038200,0.022000,0.211150,0.728650
0.039400,0.022200,0.207400,0.731000
0.040650,0.022550,0.203400,0.733400
0.041050,0.022550,0.200050,0.736350
0.043300,0.022850,0.195550,0.738300
0.042550,0.024100,0.191500,0.741850
0.043100,0.022000,0.190200,0.744700
0.043100,0.022800,0.186400,0.747700
0.043450,0.023350,0.181900,0.751300
0.045150,0.022250,0.178050,0.754550
0.047200,0.021050,0.175400,0.756350
0.045750,0.021850,0.171450,0.760950
0.047000,0.021450,0.168250,0.763300
0.046750,0.022800,0.163900,0.766550
0.047100,0.021850,0.161100,0.769950
0.047300,0.022000,0.157700,0.773000
0.047000,0.021550,0.155200,0.776250
0.046500,0.022100,0.152750,0.778650
0.045700,0.021250,0.150250,0.782800
0.045100,0.020700,0.147900,0.786300
0.045750,0.018850,0.146700,0.788700
0.044250,0.019650,0.144450,0.791650
0.043150,0.020050,0.142250,0.794550
0.043250,0.018900,0.140450,0.797400
0.042850,0.017650,0.140950,0.798550
0.043000,0.016950,0.141050,0.799000
0.041750,0.016750,0.139400,0.802100
0.041350,0.015700,0.140050,0.802900
0.040650,0.015050,0.139300,0.805000
0.039050,0.015850,0.138250,0.806850
0.037650,0.014650,0.139450,0.808250
0.037350,0.013350,0.141050,0.808250
0.036400,0.013200,0.140900,0.809500
0.035400,0.013650,0.140850,0.810100
0.034800,0.012450,0.141000,0.811750
0.033250,0.012650,0.141100,0.813000
0.032650,0.011700,0.142100,0.813550
0.032450,0.010500,0.143450,0.813600
0.031050,0.011100,0.145000,0.812850
0.030200,0.010800,0.145900,0.813100
0.029700,0.011600,0.145850,0.812850
0.028750,0.012100,0.146950,0.812200
0.027400,0.012300,0.148650,0.811650
0.027850,0.011800,0.149100,0.811250
0.028150,0.011350,0.149500,0.811000
0.027650,0.012000,0.150100,0.810250
0.028400,0.011500,0.150700,0.809400
0.028000,0.011500,0.152000,0.808500
0.027050,0.012100,0.152600,0.808250
0.026750,0.012300,0.153450,0.807500
0.027050,0.011400,0.155350,0.806200
0.027000,0.011500,0.156250,0.805250
0.026050,0.011800,0.156500,0.805650
0.026600,0.010950,0.158700,0.803750
0.025700,0.010950,0.160000,0.803350
0.025050,0.010650,0.161950,0.802350
0.025200,0.009800,0.162850,0.802150
0.023550,0.010800,0.164950,0.800700
0.023900,0.010650,0.166350,0.799100
0.022850,0.011550,0.167650,0.797950
0.021800,0.011200,0.169750,0.797250
0.022500,0.011250,0.169850,0.796400
0.023200,0.010900,0.171200,0.794700
0.023350,0.011000,0.172950,0.792700
0.022600,0.011600,0.174700,0.791100
0.023150,0.011700,0.175700,0.789450
0.023100,0.011450,0.177000,0.788450
0.023650,0.011050,0.179300,0.786000
0.023550,0.011600,0.180250,0.784600
0.022800,0.012050,0.181200,0.783950
0.022100,0.011250,0.183350,0.783300
0.022850,0.010750,0.184900,0.781500
0.023250,0.011550,0.185550,0.779650
0.023750,0.010950,0.187700,0.777600
0.023350,0.010850,0.189250,0.776550
0.023600,0.011600,0.189550,0.775250
0.022800,0.011350,0.190850,0.775000
0.021550,0.011800,0.192000,0.774650
0.022200,0.011950,0.192050,0.773800
0.022550,0.011400,0.192700,0.773350
0.023850,0.011000,0.192500,0.772650
0.024250,0.011300,0.192900,0.771550
0.024450,0.011600,0.193950,0.770000
0.024900,0.011550,0.194500,0.769050
0.024050,0.012050,0.195500,0.768400
0.024050,0.012500,0.196150,0.767300
0.024350,0.012850,0.196200,0.766600
0.025400,0.012500,0.197000,0.765100
0.026850,0.012200,0.197950,0.763000
0.026250,0.012550,0.199100,0.762100
0.025650,0.013200,0.200150,0.761000
0.025500,0.013800,0.200950,0.759750
0.025850,0.014150,0.200600,0.759400
0.026500,0.013750,0.200600,0.759150
0.027150,0.013800,0.200800,0.758250
0.027800,0.013850,0.201550,0.756800
0.027950,0.014950,0.200450,0.756650
0.029300,0.014550,0.200550,0.755600
0.029000,0.013150,0.201250,0.756600
0.029800,0.014150,0.200100,0.755950
0.028500,0.015500,0.199900,0.756100
0.028600,0.015800,0.200000,0.755600
0.029000,0.015000,0.200900,0.755100
0.029050,0.015450,0.200000,0.755500
0.029250,0.014400,0.201750,0.754600
0.029850,0.014050,0.201550,0.754550
0.029300,0.015250,0.201150,0.754300
0.028700,0.015500,0.200350,0.755450
0.029450,0.015500,0.199300,0.755750
0.028900,0.015800,0.198800,0.756500
0.029450,0.016000,0.199200,0.755350
0.030000,0.016350,0.198900,0.754750
0.030950,0.016800,0.198300,0.753950
0.032150,0.016500,0.197350,0.754000
0.032450,0.017400,0.195800,0.754350
0.033050,0.016550,0.195700,0.754700
0.033450,0.017000,0.195150,0.754400
0.033800,0.016900,0.195300,0.754000
0.034450,0.017950,0.194750,0.752850
0.034700,0.018150,0.193900,0.753250
0.035300,0.018650,0.192900,0.753150
0.036050,0.018000,0.192550,0.753400
0.036900,0.017550,0.193150,0.752400
0.036600,0.018900,0.191300,0.753200
0.035850,0.019450,0.190700,0.754000
0.037300,0.019700,0.188500,0.754500
0.037000,0.019350,0.187600,0.756050
0.037600,0.018450,0.187850,0.756100
0.038500,0.016500,0.188500,0.756500
0.038450,0.018150,0.186750,0.756650
0.039050,0.017700,0.186200,0.757050
0.038450,0.018300,0.185400,0.757850
0.038350,0.018750,0.184000,0.758900
0.037550,0.018950,0.183600,0.759900
0.036750,0.019500,0.183250,0.760500
0.037200,0.018750,0.183300,0.760750
0.038050,0.018150,0.182600,0.761200
0.037750,0.019300,0.181850,0.761100
0.038850,0.017200,0.183050,0.760900
0.036800,0.018050,0.181950,0.763200
0.037500,0.018000,0.181900,0.762600
0.036500,0.018500,0.182000,0.763000
0.036800,0.017900,0.181100,0.764200
0.037050,0.017550,0.180350,0.765050
0.037900,0.017350,0.179250,0.765500
0.037700,0.017350,0.179800,0.765150
0.038000,0.017750,0.178400,0.765850
0.038000,0.017450,0.178950,0.765600
0.038350,0.018000,0.177900,0.765750
0.037700,0.019200,0.177200,0.765900
0.038600,0.018750,0.176650,0.766000
0.038200,0.020050,0.175250,0.766500
0.038350,0.019200,0.175800,0.766650
0.039350,0.018900,0.174700,0.767050
0.038950,0.019200,0.174000,0.767850
0.038750,0.018300,0.173600,0.769350
0.038650,0.018450,0.172650,0.770250
0.038650,0.018350,0.172350,0.770650
0.038050,0.018000,0.172400,0.771550
0.039450,0.017050,0.172300,0.771200
0.038550,0.017800,0.171100,0.772550
0.038100,0.017900,0.170950,0.773050
0.038100,0.018200,0.170450,0.773250
0.038150,0.017550,0.171650,0.772650
0.038650,0.018150,0.171100,0.772100
0.037300,0.018000,0.171450,0.773250
0.037950,0.017950,0.172100,0.772000
0.038450,0.017650,0.171900,0.772000
0.038800,0.017600,0.171450,0.772150
0.038500,0.017600,0.170900,0.773000
0.037150,0.018250,0.171450,0.773150
0.037650,0.017400,0.172000,0.772950
0.038250,0.016700,0.171900,0.773150
0.037850,0.016900,0.172400,0.772850
0.036900,0.017450,0.172850,0.772800
0.036950,0.017050,0.173050,0.772950
0.036300,0.016750,0.173700,0.773250
0.036500,0.017100,0.173550,0.772850
0.036950,0.017300,0.173150,0.772600
0.036600,0.016050,0.174350,0.773000
0.036150,0.015850,0.174700,0.773300
0.034850,0.016800,0.174400,0.773950
0.034500,0.016850,0.174450,0.774200
0.035100,0.016700,0.174200,0.774000
0.034750,0.016450,0.174750,0.774050
0.034850,0.016400,0.174750,0.774000
0.034250,0.016200,0.174800,0.774750
0.033650,0.016150,0.175250,0.774950
0.033500,0.015900,0.175500,0.775100
0.034050,0.014550,0.176900,0.774500
0.032950,0.015200,0.176200,0.775650
0.032750,0.015500,0.176200,0.775550
0.032950,0.015300,0.176400,0.775350
0.031450,0.016300,0.176350,0.775900
0.031900,0.016000,0.176400,0.775700
0.031850,0.015500,0.177300,0.775350
0.032100,0.015200,0.177800,0.774900
0.031400,0.015500,0.179500,0.773600
0.031200,0.015700,0.180150,0.772950
0.031100,0.016100,0.180550,0.772250
0.032300,0.016100,0.180750,0.770850
0.032100,0.015200,0.181900,0.770800
0.032200,0.014000,0.183100,0.770700
0.031600,0.015650,0.183500,0.769250
0.032800,0.015750,0.183050,0.768400
0.033700,0.015100,0.183650,0.767550
0.033550,0.015000,0.183800,0.767650
0.032650,0.015350,0.184000,0.768000
0.031950,0.015850,0.184100,0.768100
0.032350,0.016100,0.183950,0.767600
0.032750,0.016300,0.182950,0.768000
0.034100,0.015450,0.182950,0.767500
0.034350,0.015750,0.182250,0.767650
0.034150,0.016300,0.182350,0.767200
0.034300,0.015050,0.183950,0.766700
0.033650,0.017250,0.183800,0.765300
0.034950,0.016200,0.183500,0.765350
0.034400,0.017300,0.183550,0.764750
0.034800,0.017150,0.183300,0.764750
0.035700,0.017150,0.183300,0.763850
0.035500,0.016900,0.182800,0.764800
0.035800,0.017300,0.182550,0.764350
0.035250,0.016700,0.182850,0.765200
0.034050,0.017350,0.182650,0.765950
0.034050,0.018350,0.182250,0.765350
0.035800,0.016950,0.183250,0.764000
0.035200,0.017350,0.183000,0.764450
0.035200,0.017450,0.182250,0.765100
0.035600,0.017350,0.182400,0.764650
0.036150,0.016600,0.182350,0.764900
0.036250,0.016650,0.181950,0.765150
0.036100,0.017050,0.181900,0.764950
0.036150,0.017600,0.181700,0.764550
0.035850,0.018200,0.181400,0.764550
0.036000,0.018150,0.180450,0.765400
0.036850,0.017800,0.180100,0.765250
0.038100,0.016950,0.180200,0.764750
0.038550,0.018100,0.179400,0.763950
0.038550,0.018700,0.178750,0.764000
0.038750,0.018400,0.177350,0.765500
0.038600,0.019250,0.176700,0.765450
0.039700,0.018650,0.176300,0.765350
0.039200,0.018750,0.176550,0.765500
0.040200,0.018250,0.174950,0.766600
0.040400,0.017850,0.174850,0.766900
0.039250,0.017750,0.174700,0.768300
0.038750,0.018200,0.174900,0.768150
0.038250,0.018050,0.174900,0.768800
0.038150,0.018350,0.173950,0.769550
0.037050,0.018550,0.173150,0.771250
0.037800,0.018000,0.173050,0.771150
0.038950,0.017900,0.172300,0.770850
0.038850,0.016950,0.172950,0.771250
0.039700,0.016550,0.172250,0.771500
0.039150,0.016800,0.171850,0.772200
0.037900,0.017900,0.170750,0.773450
0.038100,0.017050,0.171850,0.773000
0.037800,0.017500,0.171950,0.772750
0.037650,0.016900,0.171200,0.774250
0.037750,0.018000,0.169600,0.774650
0.037850,0.016600,0.169600,0.775950
0.036600,0.016250,0.170200,0.776950
0.037750,0.014900,0.171050,0.776300
0.036350,0.014350,0.172650,0.776650
0.034900,0.015200,0.173300,0.776600
0.034350,0.014750,0.174700,0.776200
0.034050,0.015150,0.174750,0.776050
0.033350,0.015250,0.175700,0.775700
0.033050,0.015500,0.175000,0.776450
0.033100,0.016700,0.174350,0.775850
0.033600,0.015050,0.175550,0.775800
0.033450,0.014250,0.175900,0.776400
0.033650,0.013700,0.175700,0.776950
0.033200,0.014200,0.176500,0.776100
0.033600,0.014750,0.176650,0.775000
0.033450,0.015500,0.176550,0.774500
0.033650,0.016450,0.176800,0.773100
0.033150,0.016300,0.176400,0.774150
0.033550,0.015200,0.178050,0.773200
0.033100,0.015150,0.177800,0.773950
0.033550,0.015150,0.177000,0.774300
0.032400,0.015300,0.178050,0.774250
0.032300,0.014500,0.179150,0.774050
0.031600,0.014800,0.179650,0.773950
0.030700,0.015000,0.179050,0.775250
0.030100,0.014500,0.181100,0.774300
0.030000,0.014700,0.182150,0.773150
0.029950,0.015450,0.183350,0.771250
0.030650,0.015200,0.184350,0.769800
0.030600,0.014800,0.184500,0.770100
0.031550,0.014600,0.185250,0.768600
0.031500,0.015050,0.185650,0.767800
0.031600,0.015000,0.185550,0.767850
0.031100,0.015950,0.185450,0.767500
0.031950,0.015500,0.185850,0.766700
0.032350,0.015900,0.186050,0.765700
0.032450,0.015450,0.185850,0.766250
0.033350,0.014800,0.187200,0.764650
0.033450,0.015500,0.186500,0.764550
0.033350,0.014650,0.187000,0.765000
0.033900,0.015050,0.186050,0.765000
0.033200,0.016050,0.186250,0.764500
0.033700,0.016150,0.186200,0.763950
0.033750,0.015600,0.187450,0.763200
0.033700,0.015650,0.186750,0.763900
0.033950,0.014800,0.186600,0.764650
0.034150,0.014950,0.186000,0.764900
0.033550,0.014900,0.186350,0.765200
0.032200,0.016150,0.185900,0.765750
0.032250,0.016350,0.186300,0.765100
0.032350,0.016500,0.187100,0.764050
0.033100,0.016000,0.186950,0.763950
0.033050,0.015200,0.187450,0.764300
0.032000,0.015950,0.188000,0.764050
0.032650,0.015600,0.188450,0.763300
0.032400,0.016200,0.188000,0.763400
0.032900,0.016000,0.188050,0.763050
0.032350,0.016500,0.188400,0.762750
0.032900,0.016350,0.188750,0.762000
0.032350,0.015350,0.190350,0.761950
0.032700,0.015900,0.190150,0.761250
0.032350,0.016200,0.191250,0.760200
0.032850,0.016250,0.191900,0.759000
0.033400,0.017150,0.190450,0.759000
0.034650,0.016200,0.192350,0.756800
0.034250,0.017650,0.191400,0.756700
0.034100,0.017150,0.191600,0.757150
0.034450,0.016950,0.190300,0.758300
0.034400,0.017550,0.189650,0.758400
0.034650,0.017100,0.190000,0.758250
0.035150,0.016900,0.190100,0.757850
0.034700,0.017800,0.189200,0.758300
0.036350,0.018400,0.188650,0.756600
0.035100,0.019700,0.188000,0.757200
0.036950,0.019500,0.186600,0.756950
0.038200,0.018550,0.186450,0.756800
0.038300,0.017900,0.186000,0.757800
0.037000,0.019100,0.184900,0.759000
0.037100,0.018600,0.183950,0.760350
0.037550,0.018500,0.182850,0.761100
0.038400,0.018450,0.182000,0.761150
0.039150,0.018100,0.180750,0.762000
0.039500,0.018700,0.179550,0.762250
0.040900,0.018550,0.177200,0.763350
0.040200,0.018150,0.176250,0.765400
0.039700,0.019400,0.175900,0.765000
0.039600,0.018050,0.177400,0.764950
0.039650,0.018600,0.176450,0.765300
0.039800,0.018250,0.177350,0.764600
0.039050,0.018100,0.177050,0.765800
0.039250,0.018000,0.177500,0.765250
0.038300,0.018800,0.177000,0.765900
0.038900,0.018150,0.177000,0.765950
0.039050,0.017650,0.177050,0.766250
0.038550,0.017700,0.177200,0.766550
0.038900,0.017050,0.176900,0.767150
0.039000,0.017250,0.176050,0.767700
0.037800,0.018500,0.175750,0.767950
0.037750,0.018850,0.175150,0.768250
0.037750,0.018700,0.173850,0.769700
0.038450,0.018050,0.174350,0.769150
0.038400,0.017750,0.174350,0.769500
0.038450,0.018150,0.172950,0.770450
0.037750,0.017900,0.172700,0.771650
0.037950,0.017250,0.173250,0.771550
0.038300,0.016550,0.174500,0.770650
0.037200,0.017200,0.174700,0.770900
0.036650,0.017100,0.176000,0.770250
0.035400,0.015850,0.178100,0.770650
0.034000,0.015600,0.178100,0.772300
0.033900,0.015850,0.178900,0.771350
0.034400,0.015650,0.179100,0.770850
0.034000,0.016400,0.179300,0.770300
0.034400,0.015900,0.179650,0.770050
0.035600,0.015000,0.179850,0.769550
0.035100,0.015250,0.180000,0.769650
0.034900,0.014550,0.180600,0.769950
0.035050,0.014450,0.181500,0.769000
0.034950,0.014450,0.182500,0.768100
0.034700,0.015350,0.182750,0.767200
0.035250,0.016050,0.183200,0.765500
0.034200,0.015950,0.183800,0.766050
0.034300,0.016200,0.183500,0.766000
0.034000,0.016450,0.183350,0.766200
0.035000,0.016450,0.183700,0.764850
0.035350,0.017000,0.183050,0.764600
0.036000,0.016800,0.182250,0.764950
0.036350,0.016250,0.183950,0.763450
0.035300,0.016500,0.184600,0.763600
0.035550,0.016700,0.184550,0.763200
0.036550,0.016150,0.185300,0.762000
0.036600,0.016250,0.185750,0.761400
0.036900,0.016300,0.184950,0.761850
0.036100,0.017200,0.184550,0.762150
0.035200,0.017350,0.184750,0.762700
0.035650,0.017050,0.184750,0.762550
0.035650,0.018000,0.183850,0.762500
0.035400,0.018050,0.183300,0.763250
0.035300,0.016900,0.183850,0.763950
0.035350,0.017500,0.183500,0.763650
0.035400,0.017700,0.183750,0.763150
0.035500,0.017250,0.183800,0.763450
0.036200,0.017700,0.183500,0.762600
0.036750,0.017800,0.182950,0.762500
0.037500,0.017450,0.183150,0.761900
0.037450,0.018300,0.182000,0.762250
0.037000,0.018550,0.181950,0.762500
0.037350,0.019200,0.181100,0.762350
0.037350,0.018750,0.181100,0.762800
0.038300,0.017850,0.180650,0.763200
0.039100,0.017250,0.181050,0.762600
0.038700,0.016750,0.181750,0.762800
0.039000,0.017400,0.180900,0.762700
0.039550,0.016250,0.180150,0.764050
0.039250,0.015600,0.181150,0.764000
0.038150,0.017100,0.180900,0.763850
0.037600,0.017900,0.180700,0.763800
0.037850,0.017450,0.180500,0.764200
0.037950,0.017750,0.180100,0.764200
0.037750,0.018300,0.179350,0.764600
0.038400,0.017100,0.180000,0.764500
0.038200,0.017350,0.180300,0.764150
0.037650,0.017650,0.179750,0.764950
0.037500,0.017600,0.179250,0.765650
0.036850,0.017950,0.177850,0.767350
0.037400,0.017500,0.178100,0.767000
0.035950,0.018250,0.178200,0.767600
0.035300,0.018900,0.177600,0.768200
0.036050,0.018600,0.177400,0.767950
0.036750,0.016700,0.178050,0.768500
0.036650,0.016350,0.178550,0.768450
0.035400,0.016550,0.178950,0.769100
0.035250,0.016150,0.179600,0.769000
0.035350,0.016150,0.179700,0.768800
0.036000,0.016150,0.179900,0.767950
0.035900,0.016450,0.178500,0.769150
0.035100,0.016950,0.178200,0.769750
0.035050,0.016300,0.178150,0.770500
0.034700,0.016500,0.178350,0.770450
0.035450,0.016150,0.179100,0.769300
0.036350,0.016150,0.178600,0.768900
0.036200,0.016350,0.178450,0.769000
0.034500,0.017450,0.178300,0.769750
0.033400,0.017750,0.177950,0.770900
0.034700,0.016700,0.178100,0.770500
0.033850,0.017550,0.177250,0.771350
0.034000,0.017900,0.177000,0.771100
0.034450,0.016900,0.178050,0.770600
0.034650,0.017700,0.176500,0.771150
0.034850,0.017050,0.177100,0.771000
0.034300,0.016700,0.177500,0.771500
0.033850,0.015550,0.178800,0.771800
0.035200,0.014900,0.178650,0.771250
0.035450,0.014650,0.179100,0.770800
0.035100,0.014750,0.180100,0.770050
0.034350,0.015400,0.181050,0.769200
0.034050,0.015150,0.181800,0.769000
0.034000,0.014900,0.182500,0.768600
0.034800,0.013900,0.183900,0.767400
0.034200,0.015150,0.183350,0.767300
0.034000,0.014550,0.183250,0.768200
0.032900,0.016100,0.183150,0.767850
0.033100,0.016250,0.183600,0.767050
0.033150,0.016750,0.183300,0.766800
0.033950,0.016300,0.183250,0.766500
0.033850,0.016150,0.183650,0.766350
0.034700,0.015250,0.185450,0.764600
0.034500,0.015250,0.185650,0.764600
0.033650,0.015200,0.187100,0.764050
0.033450,0.015250,0.186400,0.764900
0.033600,0.015100,0.186150,0.765150
0.032900,0.015400,0.186250,0.765450
0.032750,0.015300,0.187650,0.764300
0.032650,0.015600,0.188150,0.763600
0.032950,0.016700,0.188050,0.762300
0.033150,0.016250,0.189550,0.761050
0.033950,0.015600,0.190400,0.760050
0.034500,0.016600,0.190250,0.758650
0.035300,0.016400,0.189850,0.758450
0.035150,0.016000,0.190200,0.758650
0.033400,0.017000,0.190100,0.759500
0.033100,0.016750,0.189350,0.760800
0.033550,0.015900,0.189250,0.761300
0.033000,0.014700,0.190600,0.761700
0.033100,0.014500,0.191600,0.760800
0.032000,0.015950,0.191400,0.760650
0.034050,0.015950,0.190100,0.759900
0.033600,0.015300,0.191750,0.759350
0.033300,0.015900,0.191650,0.759150
0.034050,0.016350,0.191500,0.758100
0.034350,0.016200,0.190800,0.758650
0.034550,0.016450,0.191250,0.757750
0.034100,0.016800,0.191650,0.757450
0.034450,0.015950,0.192900,0.756700
0.033450,0.016400,0.193200,0.756950
0.033900,0.015650,0.193900,0.756550
0.034650,0.016000,0.193650,0.755700
0.034300,0.016600,0.193600,0.755500
0.033750,0.017850,0.192000,0.756400
0.034450,0.018200,0.190450,0.756900
0.035550,0.018050,0.190600,0.755800
0.036000,0.017100,0.191100,0.755800
0.036050,0.017650,0.190550,0.755750
0.035500,0.018550,0.189800,0.756150
0.034850,0.018700,0.188550,0.757900
0.034700,0.019400,0.189000,0.756900
0.035300,0.018350,0.189150,0.757200
0.034900,0.018350,0.189050,0.757700
0.035700,0.018250,0.189000,0.757050
0.036700,0.018550,0.187450,0.757300
0.038050,0.018350,0.185900,0.757700
0.037000,0.019150,0.184700,0.759150
0.037600,0.019500,0.183600,0.759300
0.037900,0.019150,0.182400,0.760550
0.038250,0.019300,0.181700,0.760750
0.038950,0.019150,0.181350,0.760550
0.039000,0.019150,0.180650,0.761200
0.039250,0.019900,0.178850,0.762000
0.038700,0.019050,0.178500,0.763750
0.038800,0.020250,0.177750,0.763200
0.038850,0.020250,0.176950,0.763950
0.038850,0.019500,0.176450,0.765200
0.040400,0.018000,0.177450,0.764150
0.039900,0.018150,0.177850,0.764100
0.039850,0.018550,0.177600,0.764000
0.040300,0.019000,0.177200,0.763500
0.039200,0.019500,0.176550,0.764750
0.039500,0.018400,0.176650,0.765450
