
real	2m9,713s
user	2m12,904s
sys	0m1,578s

real	2m8,736s
user	2m9,670s
sys	0m1,800s

real	2m10,132s
user	2m11,278s
sys	0m1,434s

real	2m8,510s
user	2m9,449s
sys	0m1,680s

real	2m10,957s
user	2m12,164s
sys	0m1,415s

real	2m9,548s
user	2m10,754s
sys	0m1,390s

real	2m11,360s
user	2m12,720s
sys	0m1,161s

real	2m10,624s
user	2m11,849s
sys	0m1,415s

real	2m8,246s
user	2m9,642s
sys	0m1,294s

real	2m9,297s
user	2m10,004s
sys	0m1,967s
