I,E,S,R
0.001000,0.000700,0.998300,0.000000
0.001250,0.001450,0.997250,0.000050
0.001450,0.002350,0.996000,0.000200
0.001700,0.003450,0.994450,0.000400
0.002000,0.004200,0.992950,0.000850
0.002650,0.004700,0.991450,0.001200
0.003700,0.005100,0.989600,0.001600
0.004400,0.007650,0.985950,0.002000
0.005300,0.008950,0.982800,0.002950
0.007200,0.010650,0.978650,0.003500
0.009650,0.012800,0.973050,0.004500
0.011400,0.017600,0.965300,0.005700
0.014350,0.024150,0.954250,0.007250
0.019200,0.027650,0.943950,0.009200
0.025150,0.034600,0.928400,0.011850
0.031150,0.046850,0.906600,0.015400
0.040000,0.058050,0.881700,0.020250
0.050750,0.075000,0.848800,0.025450
0.064300,0.092450,0.810950,0.032300
0.082800,0.112850,0.763300,0.041050
0.104600,0.134650,0.707800,0.052950
0.128950,0.158150,0.645850,0.067050
0.156800,0.180700,0.578700,0.083800
0.189750,0.201000,0.505450,0.103800
0.221850,0.219050,0.431300,0.127800
0.257000,0.226050,0.360300,0.156650
0.286900,0.233650,0.289750,0.189700
0.320200,0.227300,0.228200,0.224300
0.343400,0.216350,0.174400,0.265850
0.361000,0.194800,0.134450,0.309750
0.369350,0.170350,0.103200,0.357100
0.367350,0.150650,0.077000,0.405000
0.360350,0.127200,0.059700,0.452750
0.347550,0.105100,0.047500,0.499850
0.333050,0.083600,0.038650,0.544700
0.312150,0.067450,0.033000,0.587400
0.288950,0.056700,0.026950,0.627400
0.268700,0.044500,0.023850,0.662950
0.245250,0.034650,0.022350,0.697750
0.222750,0.027550,0.021500,0.728200
0.200350,0.023300,0.020650,0.755700
0.179750,0.019800,0.020250,0.780200
0.160300,0.016400,0.020900,0.802400
0.144300,0.013400,0.021400,0.820900
0.128100,0.011900,0.022000,0.838000
0.114400,0.009750,0.023050,0.852800
0.102050,0.008850,0.024050,0.865050
0.091150,0.007700,0.025450,0.875700
0.081800,0.006250,0.027850,0.884100
0.072150,0.006200,0.029300,0.892350
0.064550,0.005150,0.031050,0.899250
0.057000,0.005500,0.032300,0.905200
0.050150,0.004850,0.035550,0.909450
0.044000,0.004450,0.037650,0.913900
0.039000,0.003800,0.040650,0.916550
0.034850,0.003650,0.042600,0.918900
0.030700,0.003000,0.046000,0.920300
0.027150,0.003550,0.048150,0.921150
0.024300,0.003050,0.050550,0.922100
0.021300,0.003250,0.053100,0.922350
0.019100,0.002650,0.056050,0.922200
0.017250,0.002700,0.057950,0.922100
0.016000,0.002450,0.060050,0.921500
0.014500,0.002500,0.063150,0.919850
0.012800,0.002650,0.066550,0.918000
0.011600,0.002450,0.069300,0.916650
0.010150,0.002350,0.072100,0.915400
0.009450,0.002350,0.074550,0.913650
0.008850,0.002300,0.077400,0.911450
0.008050,0.002300,0.080000,0.909650
0.006750,0.002200,0.083050,0.908000
0.006500,0.001650,0.086250,0.905600
0.006050,0.001200,0.088050,0.904700
0.005300,0.001350,0.091100,0.902250
0.004750,0.001400,0.093500,0.900350
0.004600,0.001200,0.095950,0.898250
0.004350,0.001300,0.098500,0.895850
0.004500,0.000900,0.101700,0.892900
0.003950,0.000600,0.104300,0.891150
0.003650,0.001000,0.106750,0.888600
0.003100,0.001000,0.109450,0.886450
0.003200,0.000900,0.111900,0.884000
0.002550,0.000900,0.114700,0.881850
0.002500,0.000600,0.117400,0.879500
0.002050,0.000700,0.120250,0.877000
0.001850,0.000800,0.122750,0.874600
0.001600,0.000850,0.125400,0.872150
0.001500,0.000800,0.128550,0.869150
0.001550,0.000650,0.131200,0.866600
0.001450,0.000700,0.134000,0.863850
0.001200,0.000500,0.136350,0.861950
0.001250,0.000450,0.138900,0.859400
0.001150,0.000450,0.141750,0.856650
0.001050,0.000350,0.144500,0.854100
0.001000,0.000350,0.146700,0.851950
0.001100,0.000100,0.149450,0.849350
0.001050,0.000150,0.151550,0.847250
0.001050,0.000150,0.154400,0.844400
0.000850,0.000250,0.156450,0.842450
0.000850,0.000250,0.158900,0.840000
0.000750,0.000300,0.161550,0.837400
0.000650,0.000350,0.164250,0.834750
0.000650,0.000400,0.166200,0.832750
0.000750,0.000400,0.168400,0.830450
0.000750,0.000500,0.170600,0.828150
0.000700,0.000450,0.172850,0.826000
0.000650,0.000500,0.175500,0.823350
0.000650,0.000450,0.177450,0.821450
0.000700,0.000350,0.180500,0.818450
0.000650,0.000350,0.182700,0.816300
0.000700,0.000300,0.185400,0.813600
0.000650,0.000450,0.187450,0.811450
0.000700,0.000400,0.189300,0.809600
0.000700,0.000300,0.191550,0.807450
0.000450,0.000200,0.193400,0.805950
0.000400,0.000150,0.195750,0.803700
0.000350,0.000200,0.198300,0.801150
0.000450,0.000150,0.200150,0.799250
0.000400,0.000300,0.201900,0.797400
0.000400,0.000350,0.203700,0.795550
0.000400,0.000350,0.206300,0.792950
0.000350,0.000450,0.208300,0.790900
0.000450,0.000400,0.210100,0.789050
0.000450,0.000400,0.212650,0.786500
0.000400,0.000450,0.214250,0.784900
0.000550,0.000550,0.216400,0.782500
0.000500,0.000600,0.217900,0.781000
0.000750,0.000350,0.220100,0.778800
0.000850,0.000250,0.222300,0.776600
0.000850,0.000350,0.224250,0.774550
0.001000,0.000300,0.225750,0.772950
0.000800,0.000400,0.227850,0.770950
0.000850,0.000450,0.229550,0.769150
0.000850,0.000400,0.231950,0.766800
0.000900,0.000300,0.234350,0.764450
0.000950,0.000300,0.236250,0.762500
0.000900,0.000400,0.238400,0.760300
0.000850,0.000600,0.241100,0.757450
0.000950,0.000550,0.242550,0.755950
0.000900,0.000750,0.244850,0.753500
0.001050,0.000750,0.246300,0.751900
0.001050,0.000650,0.248650,0.749650
0.001000,0.000500,0.251000,0.747500
0.000850,0.000600,0.253100,0.745450
0.000950,0.000600,0.255200,0.743250
0.000900,0.000700,0.256850,0.741550
0.000950,0.000700,0.258650,0.739700
0.000900,0.000600,0.261100,0.737400
0.000900,0.000450,0.263050,0.735600
0.000750,0.000600,0.264600,0.734050
0.000750,0.000450,0.266950,0.731850
0.000750,0.000550,0.268850,0.729850
0.000750,0.000450,0.271350,0.727450
0.000800,0.000400,0.274000,0.724800
0.000850,0.000400,0.275900,0.722850
0.000800,0.000450,0.278000,0.720750
0.000700,0.000400,0.279450,0.719450
0.000650,0.000400,0.281700,0.717250
0.000600,0.000500,0.283600,0.715300
0.000550,0.000450,0.285450,0.713550
0.000800,0.000250,0.287300,0.711650
0.000750,0.000350,0.289350,0.709550
0.000800,0.000400,0.291300,0.707500
0.000750,0.000450,0.293050,0.705750
0.000800,0.000750,0.295150,0.703300
0.000850,0.000750,0.296300,0.702100
0.000850,0.000850,0.297600,0.700700
0.001000,0.000700,0.299150,0.699150
0.001200,0.000850,0.300950,0.697000
0.001200,0.001300,0.302450,0.695050
0.001200,0.001350,0.304150,0.693300
0.001500,0.001400,0.305450,0.691650
0.001700,0.001650,0.306800,0.689850
0.001850,0.001900,0.309000,0.687250
0.002150,0.002100,0.310100,0.685650
0.002300,0.001950,0.311300,0.684450
0.002700,0.001700,0.312950,0.682650
0.002800,0.002050,0.314100,0.681050
0.002850,0.002000,0.315700,0.679450
0.002700,0.002200,0.316900,0.678200
0.003050,0.002450,0.317700,0.676800
0.003350,0.002600,0.319100,0.674950
0.003100,0.003100,0.319950,0.673850
0.003600,0.002800,0.321300,0.672300
0.003950,0.002850,0.322150,0.671050
0.004500,0.003250,0.322550,0.669700
0.004550,0.003450,0.323200,0.668800
0.004900,0.003500,0.324150,0.667450
0.005350,0.003650,0.324750,0.666250
0.006000,0.003700,0.325750,0.664550
0.005800,0.004300,0.326100,0.663800
0.006300,0.004700,0.326100,0.662900
0.006850,0.005800,0.325200,0.662150
0.007650,0.006150,0.325350,0.660850
0.007900,0.006400,0.325650,0.660050
0.008550,0.006700,0.326300,0.658450
0.009450,0.006850,0.325300,0.658400
0.010250,0.007500,0.324650,0.657600
0.011000,0.008250,0.323750,0.657000
0.011700,0.009100,0.322950,0.656250
0.012600,0.009250,0.321500,0.656650
0.013300,0.010200,0.320400,0.656100
0.015400,0.010250,0.318850,0.655500
0.016800,0.010350,0.316550,0.656300
0.017250,0.012150,0.313450,0.657150
0.018200,0.012900,0.310250,0.658650
0.019650,0.014450,0.307100,0.658800
0.021500,0.015900,0.303450,0.659150
0.023150,0.016750,0.300650,0.659450
0.026350,0.017350,0.296100,0.660200
0.026950,0.019200,0.291700,0.662150
0.029550,0.019200,0.287800,0.663450
0.031050,0.019700,0.283800,0.665450
0.032500,0.020550,0.279100,0.667850
0.033900,0.022700,0.272650,0.670750
0.036400,0.021800,0.268000,0.673800
0.036500,0.023400,0.263050,0.677050
0.038000,0.024550,0.257500,0.679950
0.041050,0.025600,0.252100,0.681250
0.042400,0.026250,0.246400,0.684950
0.043450,0.025500,0.241750,0.689300
0.044600,0.026100,0.235650,0.693650
0.045900,0.026900,0.230700,0.696500
0.046650,0.027250,0.226000,0.700100
0.047900,0.028050,0.220050,0.704000
0.049350,0.028150,0.215200,0.707300
0.049900,0.029200,0.208850,0.712050
0.050350,0.029450,0.203850,0.716350
0.053300,0.028250,0.198800,0.719650
0.052950,0.028700,0.193700,0.724650
0.055300,0.028700,0.187500,0.728500
0.055000,0.029650,0.181650,0.733700
0.055850,0.028750,0.176400,0.739000
0.058150,0.027550,0.171250,0.743050
0.058150,0.027950,0.166400,0.747500
0.058050,0.029500,0.160750,0.751700
0.058050,0.027550,0.157000,0.757400
0.058300,0.026200,0.153000,0.762500
0.058100,0.025750,0.150050,0.766100
0.058450,0.024100,0.146250,0.771200
0.057250,0.023050,0.143650,0.776050
0.055800,0.023100,0.140900,0.780200
0.054050,0.023250,0.137950,0.784750
0.053900,0.022150,0.136100,0.787850
0.052750,0.020900,0.133650,0.792700
0.051450,0.020650,0.131000,0.796900
0.050050,0.019500,0.130000,0.800450
0.049150,0.018950,0.128400,0.803500
0.047500,0.018200,0.128000,0.806300
0.045000,0.018200,0.127250,0.809550
0.045300,0.016950,0.126600,0.811150
0.044700,0.016050,0.125400,0.813850
0.042400,0.015200,0.125750,0.816650
0.040700,0.014500,0.126550,0.818250
0.038700,0.014200,0.127150,0.819950
0.037250,0.014900,0.126950,0.820900
0.037100,0.013600,0.128050,0.821250
0.035800,0.012900,0.129150,0.822150
0.033400,0.013000,0.130000,0.823600
0.031100,0.012800,0.131350,0.824750
0.031650,0.011700,0.132450,0.824200
0.031150,0.011050,0.134000,0.823800
0.031000,0.010350,0.135150,0.823500
0.029700,0.010050,0.136300,0.823950
0.028950,0.010800,0.137000,0.823250
0.027400,0.010850,0.138200,0.823550
0.025850,0.010850,0.139200,0.824100
0.024850,0.011200,0.140550,0.823400
0.025800,0.009400,0.141650,0.823150
0.024700,0.010550,0.142050,0.822700
0.024350,0.010000,0.143950,0.821700
0.023550,0.010400,0.145200,0.820850
0.022250,0.010450,0.146600,0.820700
0.022900,0.009600,0.147950,0.819550
0.022250,0.009450,0.149150,0.819150
0.020950,0.009600,0.151750,0.817700
0.020700,0.009400,0.153500,0.816400
0.020750,0.009650,0.154950,0.814650
0.020600,0.009600,0.156750,0.813050
0.020050,0.009300,0.158700,0.811950
0.019250,0.009500,0.160400,0.810850
0.019900,0.009800,0.161300,0.809000
0.020450,0.009100,0.162750,0.807700
0.020850,0.008550,0.165500,0.805100
0.019500,0.009700,0.166850,0.803950
0.019450,0.009450,0.167900,0.803200
0.019700,0.010000,0.168900,0.801400
0.020200,0.009600,0.171900,0.798300
0.019450,0.010200,0.172300,0.798050
0.019500,0.010350,0.174500,0.795650
0.019900,0.010050,0.175850,0.794200
0.020650,0.010100,0.178800,0.790450
0.021250,0.009750,0.180350,0.788650
0.020600,0.009550,0.181700,0.788150
0.019900,0.010100,0.183350,0.786650
0.019700,0.009650,0.185100,0.785550
0.019950,0.009600,0.186850,0.783600
0.020450,0.008950,0.189300,0.781300
0.020300,0.009000,0.190450,0.780250
0.019650,0.010250,0.191000,0.779100
0.019700,0.010600,0.192650,0.777050
0.020250,0.010800,0.193850,0.775100
0.020750,0.010250,0.195150,0.773850
0.020650,0.010650,0.195600,0.773100
0.020700,0.011050,0.197050,0.771200
0.022150,0.010300,0.199300,0.768250
0.022900,0.010700,0.200300,0.766100
0.022600,0.011300,0.201500,0.764600
0.023600,0.011050,0.202500,0.762850
0.023400,0.011700,0.202350,0.762550
0.023250,0.011450,0.203750,0.761550
0.023400,0.011100,0.205000,0.760500
0.022750,0.012100,0.205450,0.759700
0.023500,0.012400,0.205150,0.758950
0.023600,0.012350,0.205550,0.758500
0.024100,0.012600,0.205800,0.757500
0.023550,0.012650,0.206450,0.757350
0.024350,0.012650,0.206300,0.756700
0.024450,0.013650,0.205400,0.756500
0.024950,0.013350,0.206100,0.755600
0.025550,0.013100,0.206700,0.754650
0.025900,0.013000,0.207300,0.753800
0.026300,0.012350,0.207500,0.753850
0.026500,0.013000,0.207300,0.753200
0.026300,0.013600,0.207850,0.752250
0.025900,0.013950,0.208400,0.751750
0.026450,0.014400,0.208350,0.750800
0.026500,0.015750,0.207250,0.750500
0.026250,0.016200,0.207100,0.750450
0.026950,0.016450,0.206400,0.750200
0.027850,0.015700,0.206800,0.749650
0.028200,0.015450,0.207000,0.749350
0.029250,0.015350,0.207300,0.748100
0.029750,0.016150,0.207000,0.747100
0.030050,0.015750,0.206550,0.747650
0.030350,0.016250,0.205750,0.747650
0.030450,0.016150,0.206500,0.746900
0.030650,0.016600,0.205950,0.746800
0.029850,0.018300,0.204950,0.746900
0.030750,0.017800,0.205550,0.745900
0.031800,0.017450,0.205750,0.745000
0.032750,0.016700,0.205100,0.745450
0.032350,0.017250,0.205550,0.744850
0.033050,0.016600,0.205900,0.744450
0.033400,0.015950,0.205450,0.745200
0.032700,0.016450,0.205600,0.745250
0.032650,0.017250,0.204600,0.745500
0.033350,0.017600,0.203600,0.745450
0.034650,0.016700,0.203450,0.745200
0.034600,0.017650,0.202050,0.745700
0.034850,0.018400,0.200950,0.745800
0.036400,0.018250,0.200300,0.745050
0.036550,0.019950,0.198150,0.745350
0.037300,0.020200,0.195650,0.746850
0.038400,0.020200,0.193600,0.747800
0.040550,0.019900,0.192250,0.747300
0.040000,0.019850,0.191000,0.749150
0.040900,0.019450,0.190400,0.749250
0.040550,0.019750,0.188850,0.750850
0.041000,0.020150,0.187500,0.751350
0.041000,0.020500,0.186000,0.752500
0.041750,0.019150,0.185450,0.753650
0.041800,0.019400,0.184150,0.754650
0.041150,0.020500,0.181650,0.756700
0.043550,0.020600,0.180100,0.755750
0.043900,0.020350,0.180000,0.755750
0.044600,0.020550,0.177900,0.756950
0.044000,0.020900,0.175950,0.759150
0.043750,0.021100,0.175400,0.759750
0.042800,0.020900,0.174650,0.761650
0.041200,0.021300,0.173850,0.763650
0.041650,0.020100,0.173600,0.764650
0.041400,0.019850,0.173850,0.764900
0.040150,0.019750,0.173150,0.766950
0.040100,0.018950,0.174400,0.766550
0.039450,0.019100,0.173800,0.767650
0.039400,0.019150,0.173800,0.767650
0.039650,0.018500,0.173500,0.768350
0.038200,0.019450,0.173350,0.769000
0.038250,0.019050,0.174000,0.768700
0.038300,0.018650,0.173050,0.770000
0.037000,0.019650,0.172850,0.770500
0.037450,0.018800,0.173150,0.770600
0.037900,0.017150,0.173700,0.771250
0.038000,0.017000,0.173950,0.771050
0.037050,0.018500,0.172850,0.771600
0.037000,0.018850,0.173100,0.771050
0.036900,0.018050,0.174900,0.770150
0.036650,0.018100,0.174350,0.770900
0.036650,0.017500,0.173450,0.772400
0.037400,0.017350,0.173650,0.771600
0.037400,0.016950,0.174700,0.770950
0.037150,0.016800,0.174650,0.771400
0.036050,0.017500,0.174400,0.772050
0.035550,0.016750,0.174900,0.772800
0.035300,0.016550,0.175450,0.772700
0.035450,0.015700,0.176700,0.772150
0.035600,0.016800,0.176400,0.771200
0.035400,0.016900,0.176700,0.771000
0.035900,0.016350,0.176800,0.770950
0.035600,0.015350,0.178400,0.770650
0.035100,0.015600,0.178150,0.771150
0.035200,0.015200,0.178950,0.770650
0.034050,0.016550,0.179200,0.770200
0.034950,0.016050,0.179450,0.769550
0.035500,0.015950,0.180150,0.768400
0.035050,0.015900,0.180000,0.769050
0.035100,0.016000,0.180000,0.768900
0.035100,0.016450,0.179750,0.768700
0.035650,0.015900,0.180250,0.768200
0.035300,0.015500,0.181000,0.768200
0.035550,0.015050,0.181800,0.767600
0.035550,0.014850,0.181950,0.767650
0.034350,0.015550,0.182300,0.767800
0.033950,0.016950,0.182650,0.766450
0.034200,0.017450,0.181500,0.766850
0.034200,0.016700,0.183150,0.765950
0.033400,0.015850,0.183900,0.766850
0.033450,0.015450,0.184900,0.766200
0.033500,0.016150,0.185350,0.765000
0.034300,0.015250,0.186150,0.764300
0.034700,0.015900,0.185650,0.763750
0.034400,0.016000,0.184900,0.764700
0.033450,0.015900,0.185250,0.765400
0.034350,0.016050,0.185600,0.764000
0.034050,0.016750,0.185600,0.763600
0.034150,0.016500,0.186300,0.763050
0.035500,0.015800,0.186350,0.762350
0.035650,0.015600,0.185600,0.763150
0.035750,0.017800,0.184100,0.762350
0.035800,0.017750,0.184050,0.762400
0.035450,0.018000,0.183000,0.763550
0.036050,0.017150,0.182950,0.763850
0.035850,0.018050,0.182150,0.763950
0.035700,0.018650,0.181650,0.764000
0.036850,0.018750,0.180650,0.763750
0.036950,0.017750,0.181600,0.763700
0.036700,0.017900,0.182000,0.763400
0.037400,0.017750,0.181400,0.763450
0.037400,0.018400,0.181050,0.763150
0.037750,0.018250,0.180500,0.763500
0.037650,0.019000,0.179950,0.763400
0.037700,0.018850,0.179800,0.763650
0.038600,0.018150,0.180150,0.763100
0.038650,0.017800,0.179300,0.764250
0.038450,0.017950,0.178500,0.765100
0.038200,0.017350,0.177600,0.766850
0.038100,0.017050,0.178200,0.766650
0.036750,0.018300,0.177050,0.767900
0.036250,0.019450,0.175150,0.769150
0.036250,0.020100,0.174250,0.769400
0.036450,0.019500,0.174350,0.769700
0.036700,0.019300,0.173800,0.770200
0.037700,0.018550,0.173550,0.770200
0.037950,0.018950,0.173300,0.769800
0.038050,0.018250,0.173350,0.770350
0.038250,0.017350,0.174350,0.770050
0.038950,0.016500,0.175600,0.768950
0.037350,0.017400,0.175400,0.769850
0.038200,0.017350,0.175850,0.768600
0.037050,0.017150,0.175600,0.770200
0.036350,0.018200,0.176050,0.769400
0.034900,0.018700,0.176900,0.769500
0.036250,0.018550,0.175750,0.769450
0.036650,0.018400,0.175200,0.769750
0.037600,0.018300,0.174850,0.769250
0.037700,0.017650,0.174800,0.769850
0.037750,0.016900,0.175350,0.770000
0.036600,0.016250,0.175850,0.771300
0.037000,0.016500,0.175150,0.771350
0.036350,0.016600,0.175950,0.771100
0.036800,0.016800,0.176000,0.770400
0.036700,0.015850,0.177450,0.770000
0.036400,0.015700,0.178100,0.769800
0.035550,0.015400,0.177700,0.771350
0.035750,0.014450,0.178800,0.771000
0.035750,0.013750,0.179300,0.771200
0.034150,0.014650,0.179400,0.771800
0.033550,0.014650,0.181000,0.770800
0.032600,0.015550,0.180400,0.771450
0.031150,0.015600,0.181450,0.771800
0.030950,0.014650,0.182400,0.772000
0.030750,0.015300,0.182900,0.771050
0.030850,0.015400,0.183000,0.770750
0.031650,0.015450,0.182650,0.770250
0.032200,0.015000,0.183300,0.769500
0.030400,0.015100,0.183800,0.770700
0.029650,0.014800,0.184700,0.770850
0.029950,0.013400,0.186200,0.770450
0.030050,0.013400,0.187250,0.769300
0.029900,0.013550,0.188250,0.768300
0.028300,0.014900,0.188300,0.768500
0.028500,0.015800,0.187100,0.768600
0.029450,0.014950,0.188000,0.767600
0.030150,0.014250,0.188650,0.766950
0.029650,0.014400,0.189650,0.766300
0.030150,0.014450,0.189400,0.766000
0.030600,0.014550,0.189500,0.765350
0.031500,0.014250,0.189300,0.764950
0.030900,0.015750,0.188250,0.765100
0.030650,0.016150,0.189050,0.764150
0.031450,0.015750,0.189000,0.763800
0.031500,0.015150,0.189850,0.763500
0.032700,0.014900,0.190000,0.762400
0.032800,0.015900,0.188900,0.762400
0.033200,0.015750,0.188850,0.762200
0.033550,0.015100,0.188750,0.762600
0.032350,0.014650,0.189050,0.763950
0.031800,0.015500,0.188600,0.764100
0.032850,0.014950,0.189950,0.762250
0.033600,0.014250,0.190750,0.761400
0.033150,0.014350,0.191450,0.761050
0.032650,0.015250,0.190400,0.761700
0.031900,0.016350,0.190400,0.761350
0.031300,0.016150,0.190850,0.761700
0.031900,0.016400,0.191650,0.760050
0.032650,0.015650,0.191700,0.760000
0.032700,0.014400,0.191900,0.761000
0.032400,0.015500,0.192150,0.759950
0.031750,0.016850,0.191600,0.759800
0.031550,0.016550,0.191600,0.760300
0.031750,0.016450,0.191650,0.760150
0.032150,0.017400,0.191700,0.758750
0.032900,0.016900,0.191400,0.758800
0.033100,0.016400,0.191300,0.759200
0.033750,0.016300,0.191750,0.758200
0.033000,0.017200,0.190650,0.759150
0.033100,0.017050,0.189650,0.760200
0.034500,0.017250,0.188900,0.759350
0.034850,0.016350,0.189150,0.759650
0.033750,0.017450,0.188800,0.760000
0.032800,0.017550,0.188350,0.761300
0.033550,0.018050,0.188300,0.760100
0.034450,0.017850,0.186900,0.760800
0.034650,0.017550,0.187000,0.760800
0.034550,0.016300,0.187650,0.761500
0.034850,0.016250,0.187350,0.761550
0.034450,0.016700,0.188100,0.760750
0.035050,0.017250,0.186400,0.761300
0.034550,0.018100,0.185450,0.761900
0.035550,0.017000,0.185300,0.762150
0.035700,0.017650,0.184150,0.762500
0.035700,0.016400,0.184800,0.763100
0.035250,0.016900,0.184250,0.763600
0.035050,0.017350,0.184400,0.763200
0.035750,0.016150,0.184550,0.763550
0.035200,0.015900,0.184300,0.764600
0.034950,0.016600,0.183200,0.765250
0.035450,0.016100,0.182250,0.766200
0.035050,0.015900,0.183750,0.765300
0.035250,0.015550,0.184850,0.764350
0.036050,0.016100,0.183850,0.764000
0.035750,0.017300,0.183450,0.763500
0.036450,0.016900,0.183400,0.763250
0.036350,0.016000,0.182750,0.764900
0.034950,0.016450,0.182800,0.765800
0.035300,0.015550,0.182650,0.766500
0.034950,0.017200,0.181500,0.766350
0.034050,0.017700,0.181300,0.766950
0.035000,0.016950,0.181450,0.766600
0.035000,0.017850,0.180850,0.766300
0.035200,0.016600,0.182800,0.765400
0.035100,0.016800,0.183200,0.764900
0.034650,0.017350,0.183100,0.764900
0.034650,0.017300,0.183450,0.764600
0.034850,0.016750,0.183800,0.764600
0.034550,0.016450,0.184400,0.764600
0.035250,0.016600,0.183850,0.764300
0.035550,0.016000,0.183300,0.765150
0.035800,0.017450,0.182450,0.764300
0.037750,0.017350,0.182450,0.762450
0.036950,0.017450,0.183100,0.762500
0.037300,0.017600,0.181950,0.763150
0.037800,0.017700,0.181200,0.763300
0.037400,0.018150,0.180700,0.763750
0.037150,0.018250,0.180900,0.763700
0.036850,0.018200,0.180650,0.764300
0.037700,0.018600,0.179700,0.764000
0.038200,0.018200,0.180200,0.763400
0.038900,0.018600,0.179900,0.762600
0.038800,0.020000,0.178100,0.763100
0.039500,0.019450,0.177150,0.763900
0.039850,0.018500,0.177400,0.764250
0.040150,0.018250,0.177150,0.764450
0.040800,0.017100,0.176350,0.765750
0.040700,0.017550,0.175650,0.766100
0.039100,0.018200,0.175950,0.766750
0.039400,0.017500,0.175800,0.767300
0.039150,0.017450,0.175600,0.767800
0.039050,0.017800,0.176050,0.767100
0.039350,0.017000,0.176250,0.767400
0.037350,0.017550,0.175900,0.769200
0.037150,0.016750,0.177050,0.769050
0.037150,0.017200,0.177000,0.768650
0.036350,0.017700,0.176300,0.769650
0.036900,0.018050,0.176650,0.768400
0.036750,0.017550,0.177750,0.767950
0.037050,0.016650,0.178050,0.768250
0.036500,0.016700,0.178900,0.767900
0.035600,0.017700,0.178350,0.768350
0.036500,0.017800,0.177700,0.768000
0.036700,0.018100,0.177750,0.767450
0.036750,0.018350,0.177600,0.767300
0.037150,0.017550,0.177850,0.767450
0.037400,0.017600,0.177650,0.767350
0.037050,0.017250,0.177750,0.767950
0.037450,0.017000,0.177200,0.768350
0.035650,0.017050,0.177500,0.769800
0.035650,0.016600,0.177700,0.770050
0.036000,0.017100,0.177200,0.769700
0.034350,0.016850,0.177650,0.771150
0.034800,0.016250,0.178050,0.770900
0.034600,0.015800,0.179650,0.769950
0.035150,0.015650,0.180300,0.768900
0.034650,0.016800,0.179300,0.769250
0.034250,0.016850,0.178750,0.770150
0.034100,0.016750,0.179400,0.769750
0.033400,0.016050,0.181400,0.769150
0.033900,0.015500,0.182650,0.767950
0.035100,0.015100,0.182600,0.767200
0.034650,0.015650,0.183650,0.766050
0.035400,0.015800,0.184250,0.764550
0.034550,0.016150,0.184250,0.765050
0.034350,0.016000,0.184750,0.764900
0.033950,0.015550,0.185050,0.765450
0.035450,0.015750,0.185350,0.763450
0.035950,0.016600,0.184150,0.763300
0.035650,0.015600,0.184550,0.764200
0.035650,0.015600,0.184500,0.764250
0.035150,0.016350,0.184950,0.763550
0.035200,0.016850,0.184500,0.763450
0.035650,0.016750,0.184400,0.763200
0.035350,0.016550,0.185000,0.763100
0.035850,0.016500,0.185500,0.762150
0.036050,0.016400,0.186050,0.761500
0.035550,0.017450,0.186350,0.760650
0.035850,0.016700,0.186950,0.760500
0.034950,0.017750,0.186300,0.761000
0.034800,0.016350,0.187050,0.761800
0.034100,0.016450,0.188200,0.761250
0.034150,0.016500,0.188800,0.760550
0.033600,0.017050,0.189050,0.760300
0.035350,0.017250,0.188550,0.758850
0.035850,0.018050,0.187450,0.758650
0.036450,0.016950,0.188700,0.757900
0.034900,0.018800,0.187850,0.758450
0.035300,0.019300,0.186700,0.758700
0.035700,0.019900,0.186250,0.758150
0.036600,0.018550,0.186300,0.758550
0.036800,0.017750,0.185700,0.759750
0.037650,0.018150,0.184900,0.759300
0.038250,0.019100,0.183500,0.759150
0.038600,0.018750,0.183300,0.759350
0.038700,0.019200,0.183050,0.759050
0.037950,0.018850,0.183150,0.760050
0.038050,0.020150,0.181950,0.759850
0.038950,0.018500,0.182100,0.760450
0.038250,0.019350,0.181750,0.760650
0.038900,0.018950,0.180500,0.761650
0.039350,0.019950,0.178600,0.762100
0.040400,0.019350,0.178800,0.761450
0.040600,0.019100,0.178250,0.762050
0.040650,0.018600,0.177950,0.762800
0.039500,0.019500,0.177050,0.763950
0.038150,0.020500,0.176450,0.764900
0.038700,0.020550,0.175250,0.765500
0.039250,0.020350,0.175150,0.765250
0.039250,0.019350,0.176150,0.765250
0.038600,0.018850,0.175450,0.767100
0.037750,0.019600,0.175150,0.767500
0.039050,0.018900,0.175450,0.766600
0.038400,0.018000,0.175650,0.767950
0.039350,0.017850,0.175750,0.767050
0.039300,0.018350,0.174800,0.767550
0.039150,0.017350,0.174400,0.769100
0.039500,0.017550,0.174500,0.768450
0.038750,0.017900,0.173450,0.769900
0.039400,0.017250,0.173000,0.770350
0.039550,0.017650,0.172200,0.770600
0.039000,0.016850,0.172800,0.771350
0.038650,0.016900,0.172600,0.771850
0.038500,0.017550,0.172750,0.771200
0.039250,0.016100,0.173150,0.771500
0.039100,0.016350,0.172500,0.772050
0.038500,0.016200,0.172850,0.772450
0.038100,0.016100,0.173700,0.772100
0.037700,0.017250,0.173350,0.771700
0.036700,0.016400,0.174600,0.772300
0.035300,0.016150,0.175600,0.772950
0.035600,0.015850,0.176600,0.771950
0.034700,0.015900,0.177300,0.772100
0.035750,0.015800,0.177300,0.771150
0.035550,0.017000,0.177050,0.770400
0.035300,0.017850,0.176300,0.770550
0.034800,0.017950,0.176500,0.770750
0.035850,0.017750,0.175500,0.770900
0.036500,0.017150,0.175400,0.770950
0.036350,0.016550,0.175300,0.771800
0.036000,0.016200,0.175350,0.772450
0.034950,0.016200,0.175600,0.773250
0.035600,0.015500,0.176100,0.772800
0.034600,0.016300,0.175550,0.773550
0.034150,0.015700,0.177050,0.773100
0.034050,0.015950,0.177500,0.772500
0.034600,0.015850,0.177150,0.772400
0.034000,0.016400,0.178050,0.771550
0.034100,0.016750,0.177950,0.771200
0.034850,0.015750,0.178000,0.771400
0.034550,0.015700,0.179000,0.770750
0.034000,0.016700,0.178850,0.770450
0.033600,0.016650,0.179950,0.769800
0.033250,0.017300,0.179900,0.769550
0.034500,0.016950,0.180300,0.768250
0.034100,0.017100,0.179600,0.769200
0.033500,0.016900,0.180300,0.769300
0.034200,0.016350,0.180800,0.768650
0.033700,0.015300,0.181800,0.769200
0.033800,0.015950,0.182800,0.767450
0.033450,0.015400,0.183650,0.767500
0.033200,0.015550,0.183850,0.767400
0.033750,0.015650,0.184550,0.766050
0.033450,0.016200,0.184200,0.766150
0.033750,0.016600,0.183600,0.766050
0.033700,0.016600,0.184300,0.765400
0.034800,0.015150,0.185300,0.764750
0.034800,0.015050,0.184850,0.765300
0.034650,0.016250,0.185100,0.764000
0.034400,0.016300,0.185600,0.763700
0.033400,0.016450,0.186450,0.763700
0.031900,0.016950,0.186950,0.764200
