I,E,S,R
0.001000,0.001100,0.997900,0.000000
0.001100,0.001550,0.997100,0.000250
0.001600,0.001700,0.996400,0.000300
0.001800,0.002600,0.995050,0.000550
0.002500,0.003300,0.993450,0.000750
0.003050,0.005000,0.990950,0.001000
0.004650,0.006450,0.987550,0.001350
0.005800,0.008150,0.984100,0.001950
0.008050,0.010550,0.978850,0.002550
0.010400,0.013150,0.973000,0.003450
0.012600,0.017500,0.964850,0.005050
0.016100,0.024000,0.953550,0.006350
0.020000,0.030800,0.940900,0.008300
0.027050,0.041300,0.921600,0.010050
0.035750,0.049950,0.900400,0.013900
0.046450,0.064050,0.871250,0.018250
0.057600,0.082450,0.836600,0.023350
0.073250,0.102850,0.793950,0.029950
0.092050,0.125450,0.742000,0.040500
0.116400,0.146850,0.682400,0.054350
0.143550,0.166850,0.620650,0.068950
0.173400,0.187950,0.550650,0.088000
0.199500,0.211100,0.477450,0.111950
0.233250,0.226750,0.402700,0.137300
0.265300,0.231600,0.333800,0.169300
0.296650,0.230600,0.270300,0.202450
0.324750,0.220150,0.213000,0.242100
0.346350,0.205300,0.165750,0.282600
0.359800,0.187200,0.128650,0.324350
0.362850,0.167150,0.097350,0.372650
0.362250,0.143800,0.073800,0.420150
0.350800,0.125700,0.055450,0.468050
0.341800,0.102600,0.044050,0.511550
0.327100,0.083550,0.034750,0.554600
0.306150,0.068000,0.029600,0.596250
0.284700,0.054800,0.025750,0.634750
0.259550,0.045650,0.022400,0.672400
0.239100,0.035550,0.020850,0.704500
0.214500,0.028950,0.020700,0.735850
0.192200,0.024150,0.020100,0.763550
0.172750,0.019400,0.020000,0.787850
0.156950,0.014750,0.019900,0.808400
0.141550,0.011900,0.020850,0.825700
0.125150,0.010350,0.022300,0.842200
0.111750,0.009700,0.023400,0.855150
0.098800,0.009200,0.024350,0.867650
0.086100,0.008300,0.025400,0.880200
0.076300,0.006550,0.028150,0.889000
0.067300,0.006500,0.030300,0.895900
0.059550,0.005400,0.032700,0.902350
0.052650,0.004700,0.035650,0.907000
0.045850,0.005550,0.036900,0.911700
0.042150,0.004750,0.038850,0.914250
0.037500,0.004200,0.041700,0.916600
0.034000,0.004150,0.044050,0.917800
0.030800,0.003500,0.045900,0.919800
0.027350,0.003200,0.047950,0.921500
0.024850,0.003350,0.049600,0.922200
0.021600,0.003650,0.052600,0.922150
0.019100,0.003750,0.055750,0.921400
0.017450,0.003450,0.058350,0.920750
0.015500,0.003400,0.061300,0.919800
0.014250,0.002900,0.065000,0.917850
0.012400,0.002650,0.067950,0.917000
0.012000,0.002200,0.070800,0.915000
0.010700,0.002000,0.073600,0.913700
0.009950,0.001950,0.076300,0.911800
0.008850,0.001700,0.078800,0.910650
0.008000,0.001950,0.080950,0.909100
0.007050,0.002100,0.084250,0.906600
0.006550,0.001800,0.087250,0.904400
0.005650,0.002050,0.089650,0.902650
0.005400,0.001950,0.092500,0.900150
0.005250,0.001450,0.095450,0.897850
0.004850,0.001550,0.097950,0.895650
0.004500,0.001350,0.100500,0.893650
0.004150,0.001200,0.103100,0.891550
0.003550,0.001200,0.105500,0.889750
0.003550,0.001050,0.108050,0.887350
0.003400,0.001000,0.110950,0.884650
0.003300,0.001100,0.114350,0.881250
0.003250,0.000950,0.117000,0.878800
0.003150,0.000700,0.120350,0.875800
0.002800,0.000850,0.122600,0.873750
0.002400,0.000950,0.125100,0.871550
0.002150,0.000900,0.127950,0.869000
0.002000,0.000700,0.131400,0.865900
0.002050,0.000500,0.134000,0.863450
0.002050,0.000600,0.136750,0.860600
0.002050,0.000500,0.139350,0.858100
0.001750,0.000700,0.141450,0.856100
0.001750,0.000800,0.144250,0.853200
0.001700,0.000700,0.147100,0.850500
0.001650,0.000550,0.149650,0.848150
0.001600,0.000550,0.152050,0.845800
0.001450,0.000700,0.154150,0.843700
0.001550,0.000650,0.156250,0.841550
0.001550,0.000450,0.159150,0.838850
0.001500,0.000400,0.162050,0.836050
0.001400,0.000600,0.164500,0.833500
0.001450,0.000700,0.167150,0.830700
0.001300,0.000700,0.169050,0.828950
0.001200,0.000600,0.171250,0.826950
0.001300,0.000600,0.173800,0.824300
0.001200,0.000450,0.176350,0.822000
0.001250,0.000550,0.178500,0.819700
0.001200,0.000500,0.181100,0.817200
0.001300,0.000400,0.183250,0.815050
0.001300,0.000450,0.185750,0.812500
0.001150,0.000450,0.187750,0.810650
0.001100,0.000450,0.189700,0.808750
0.000900,0.000500,0.191450,0.807150
0.000900,0.000400,0.194150,0.804550
0.000750,0.000550,0.196700,0.802000
0.000950,0.000600,0.199150,0.799300
0.001000,0.000650,0.201050,0.797300
0.001150,0.000400,0.203600,0.794850
0.001250,0.000300,0.206150,0.792300
0.001150,0.000400,0.207850,0.790600
0.000750,0.000450,0.210750,0.788050
0.000750,0.000600,0.213000,0.785650
0.000950,0.000600,0.214850,0.783600
0.000950,0.000600,0.216600,0.781850
0.000950,0.000650,0.218500,0.779900
0.000950,0.000600,0.221250,0.777200
0.001000,0.000650,0.223450,0.774900
0.001100,0.000450,0.226050,0.772400
0.001000,0.000550,0.228600,0.769850
0.001000,0.000800,0.230500,0.767700
0.001100,0.000700,0.232700,0.765500
0.001300,0.000650,0.234900,0.763150
0.001350,0.000650,0.237300,0.760700
0.001450,0.000950,0.239650,0.757950
0.001550,0.000950,0.241050,0.756450
0.001550,0.001100,0.242650,0.754700
0.001500,0.000950,0.244800,0.752750
0.001350,0.001100,0.247150,0.750400
0.001350,0.001100,0.249100,0.748450
0.001600,0.001000,0.251350,0.746050
0.001750,0.001100,0.252850,0.744300
0.001800,0.001250,0.254750,0.742200
0.001900,0.001100,0.256350,0.740650
0.001850,0.001300,0.257800,0.739050
0.001900,0.001100,0.259700,0.737300
0.001900,0.001300,0.261900,0.734900
0.001950,0.001400,0.263350,0.733300
0.002150,0.001350,0.264750,0.731750
0.002400,0.001650,0.266150,0.729800
0.002500,0.001750,0.268050,0.727700
0.002800,0.001600,0.269700,0.725900
0.002850,0.001950,0.271400,0.723800
0.002900,0.002050,0.272850,0.722200
0.003200,0.002000,0.274700,0.720100
0.003550,0.001850,0.275500,0.719100
0.003750,0.001650,0.277400,0.717200
0.003750,0.001750,0.279450,0.715050
0.003900,0.002000,0.280850,0.713250
0.004000,0.001850,0.282350,0.711800
0.003950,0.002100,0.283800,0.710150
0.004000,0.002250,0.284750,0.709000
0.004250,0.002650,0.285450,0.707650
0.004300,0.003100,0.286400,0.706200
0.004350,0.003750,0.287400,0.704500
0.005050,0.003850,0.287550,0.703550
0.005700,0.003950,0.287950,0.702400
0.005700,0.004450,0.289200,0.700650
0.006800,0.004250,0.290250,0.698700
0.007000,0.004250,0.291200,0.697550
0.007350,0.004750,0.291500,0.696400
0.007350,0.005250,0.292350,0.695050
0.007200,0.005650,0.292950,0.694200
0.007800,0.005700,0.293450,0.693050
0.008400,0.006100,0.292800,0.692700
0.008950,0.007000,0.292600,0.691450
0.010250,0.006600,0.292550,0.690600
0.011150,0.007300,0.291950,0.689600
0.011500,0.008100,0.291150,0.689250
0.012450,0.008100,0.290400,0.689050
0.012550,0.008400,0.289250,0.689800
0.013000,0.009300,0.288800,0.688900
0.013750,0.009850,0.287650,0.688750
0.015000,0.009700,0.286650,0.688650
0.016400,0.010450,0.284600,0.688550
0.017700,0.010650,0.282750,0.688900
0.018600,0.011500,0.280750,0.689150
0.019900,0.011800,0.278900,0.689400
0.021400,0.012900,0.277050,0.688650
0.023050,0.014200,0.273950,0.688800
0.024000,0.015300,0.271200,0.689500
0.025350,0.015500,0.269100,0.690050
0.026250,0.016100,0.266800,0.690850
0.027150,0.017100,0.263950,0.691800
0.027100,0.017350,0.262250,0.693300
0.028200,0.018050,0.259400,0.694350
0.029150,0.018900,0.255600,0.696350
0.030350,0.019300,0.252150,0.698200
0.031500,0.019600,0.248550,0.700350
0.032400,0.019600,0.245100,0.702900
0.033350,0.020650,0.240550,0.705450
0.034700,0.021850,0.236000,0.707450
0.036500,0.021550,0.232500,0.709450
0.036150,0.024050,0.226900,0.712900
0.037500,0.024250,0.222700,0.715550
0.038850,0.024200,0.219200,0.717750
0.039700,0.023750,0.215500,0.721050
0.041050,0.023350,0.212350,0.723250
0.043050,0.021900,0.209900,0.725150
0.043500,0.023150,0.205250,0.728100
0.044200,0.023100,0.201250,0.731450
0.044850,0.023350,0.197000,0.734800
0.045500,0.024400,0.192050,0.738050
0.045600,0.024150,0.188400,0.741850
0.044900,0.024800,0.184700,0.745600
0.046200,0.023600,0.181550,0.748650
0.046700,0.023750,0.177400,0.752150
0.046150,0.023550,0.174600,0.755700
0.046650,0.022350,0.172700,0.758300
0.046900,0.020950,0.171000,0.761150
0.045500,0.022450,0.167800,0.764250
0.045350,0.022050,0.165050,0.767550
0.045250,0.021400,0.162650,0.770700
0.045100,0.020650,0.160900,0.773350
0.044050,0.020900,0.158750,0.776300
0.044400,0.018950,0.157850,0.778800
0.044400,0.017900,0.157300,0.780400
0.043650,0.017350,0.155350,0.783650
0.041850,0.017250,0.153450,0.787450
0.040900,0.017050,0.152750,0.789300
0.040000,0.017000,0.151800,0.791200
0.038950,0.016800,0.151500,0.792750
0.038950,0.016100,0.150650,0.794300
0.038100,0.015200,0.149700,0.797000
0.036450,0.015100,0.149600,0.798850
0.035350,0.015700,0.149050,0.799900
0.035300,0.014050,0.148850,0.801800
0.033500,0.014300,0.148000,0.804200
0.032100,0.014850,0.147400,0.805650
0.031650,0.014300,0.147350,0.806700
0.031100,0.013450,0.148450,0.807000
0.031250,0.012400,0.148800,0.807550
0.030600,0.012800,0.149200,0.807400
0.030300,0.013000,0.149750,0.806950
0.029200,0.013750,0.150750,0.806300
0.029500,0.013600,0.151700,0.805200
0.028850,0.013300,0.151850,0.806000
0.027650,0.013050,0.154550,0.804750
0.028000,0.012850,0.155550,0.803600
0.028800,0.011050,0.157050,0.803100
0.028300,0.010900,0.158250,0.802550
0.027750,0.011350,0.158550,0.802350
0.027250,0.011450,0.159400,0.801900
0.026150,0.011500,0.161650,0.800700
0.025800,0.011600,0.162050,0.800550
0.026850,0.010550,0.163000,0.799600
0.026200,0.010250,0.164800,0.798750
0.024750,0.010350,0.166300,0.798600
0.024000,0.010100,0.168100,0.797800
0.024000,0.009650,0.169300,0.797050
0.023150,0.010250,0.172450,0.794150
0.022600,0.010850,0.173300,0.793250
0.023500,0.011550,0.173700,0.791250
0.023950,0.010700,0.175800,0.789550
0.022850,0.011100,0.177600,0.788450
0.023650,0.011100,0.178900,0.786350
0.023600,0.010700,0.180000,0.785700
0.022550,0.011200,0.181050,0.785200
0.022900,0.011550,0.182050,0.783500
0.022400,0.011600,0.183600,0.782400
0.023000,0.011000,0.184600,0.781400
0.022350,0.011700,0.185650,0.780300
0.023550,0.011300,0.186300,0.778850
0.023300,0.011900,0.186950,0.777850
0.023000,0.011700,0.188850,0.776450
0.023100,0.011200,0.189850,0.775850
0.023450,0.010900,0.191450,0.774200
0.023500,0.011200,0.192800,0.772500
0.023000,0.011500,0.194100,0.771400
0.023400,0.011400,0.196100,0.769100
0.023200,0.012400,0.196300,0.768100
0.023250,0.012050,0.197100,0.767600
0.023500,0.011900,0.198300,0.766300
0.022950,0.012650,0.199350,0.765050
0.023700,0.012500,0.200550,0.763250
0.024050,0.011500,0.202200,0.762250
0.023850,0.011900,0.203100,0.761150
0.023650,0.012750,0.203300,0.760300
0.024600,0.013550,0.203800,0.758050
0.024650,0.013600,0.204750,0.757000
0.024750,0.013900,0.204650,0.756700
0.025900,0.013600,0.204600,0.755900
0.026250,0.013650,0.205350,0.754750
0.026750,0.014100,0.205400,0.753750
0.027150,0.015150,0.204200,0.753500
0.026900,0.015950,0.205000,0.752150
0.026700,0.016200,0.204850,0.752250
0.027450,0.016350,0.204100,0.752100
0.028100,0.016750,0.203750,0.751400
0.030050,0.015850,0.202650,0.751450
0.030600,0.015400,0.201900,0.752100
0.030800,0.014950,0.202200,0.752050
0.031150,0.016100,0.201800,0.750950
0.033450,0.016000,0.201300,0.749250
0.032800,0.017400,0.199750,0.750050
0.033800,0.016850,0.198400,0.750950
0.033550,0.017450,0.197400,0.751600
0.034100,0.017150,0.197350,0.751400
0.033250,0.017650,0.196950,0.752150
0.033750,0.017100,0.197200,0.751950
0.033800,0.017700,0.196850,0.751650
0.033850,0.017350,0.196800,0.752000
0.034450,0.017600,0.196750,0.751200
0.033700,0.018250,0.195350,0.752700
0.034650,0.018050,0.195000,0.752300
0.035300,0.018700,0.194250,0.751750
0.034600,0.019400,0.194350,0.751650
0.035000,0.019300,0.194150,0.751550
0.036450,0.018450,0.193600,0.751500
0.036950,0.019100,0.192100,0.751850
0.037000,0.018650,0.190900,0.753450
0.038100,0.019050,0.189450,0.753400
0.039000,0.019650,0.187800,0.753550
0.039350,0.019750,0.186350,0.754550
0.039550,0.020250,0.185250,0.754950
0.040700,0.018700,0.184100,0.756500
0.039650,0.020150,0.182400,0.757800
0.040150,0.019950,0.182300,0.757600
0.040550,0.020650,0.180700,0.758100
0.040950,0.020050,0.179850,0.759150
0.040900,0.021100,0.178150,0.759850
0.042100,0.019300,0.177950,0.760650
0.041950,0.018700,0.177700,0.761650
0.041400,0.019300,0.177550,0.761750
0.041350,0.020600,0.176000,0.762050
0.041600,0.019350,0.176000,0.763050
0.041350,0.019650,0.175850,0.763150
0.040000,0.019900,0.174100,0.766000
0.040100,0.019650,0.172950,0.767300
0.040350,0.019850,0.173100,0.766700
0.039250,0.020300,0.172800,0.767650
0.039350,0.019100,0.172950,0.768600
0.039250,0.018750,0.173150,0.768850
0.040000,0.018950,0.171950,0.769100
0.038850,0.019700,0.170250,0.771200
0.039050,0.019250,0.169750,0.771950
0.038900,0.018700,0.170050,0.772350
0.039050,0.018850,0.169350,0.772750
0.038650,0.018350,0.170250,0.772750
0.038050,0.018200,0.170000,0.773750
0.037700,0.018350,0.169200,0.774750
0.037900,0.017250,0.169450,0.775400
0.036950,0.019150,0.169200,0.774700
0.037200,0.019550,0.168900,0.774350
0.038100,0.018900,0.169200,0.773800
0.038000,0.019350,0.168400,0.774250
0.039350,0.018350,0.168450,0.773850
0.039250,0.017600,0.168500,0.774650
0.039600,0.017550,0.168050,0.774800
0.037650,0.016850,0.168150,0.777350
0.037100,0.016950,0.168450,0.777500
0.037500,0.014900,0.170400,0.777200
0.035850,0.016450,0.170100,0.777600
0.036200,0.015950,0.170150,0.777700
0.034400,0.016450,0.170400,0.778750
0.034950,0.016200,0.169800,0.779050
0.035650,0.015400,0.170550,0.778400
0.034850,0.016350,0.171350,0.777450
0.034600,0.017000,0.171150,0.777250
0.034300,0.016550,0.172600,0.776550
0.033900,0.016550,0.172900,0.776650
0.032500,0.017200,0.173850,0.776450
0.033800,0.015750,0.174800,0.775650
0.033100,0.015600,0.175050,0.776250
0.034100,0.014800,0.175600,0.775500
0.034050,0.015000,0.176700,0.774250
0.033700,0.014800,0.177650,0.773850
0.033450,0.015200,0.177750,0.773600
0.032650,0.015350,0.178350,0.773650
0.031400,0.015900,0.178200,0.774500
0.032050,0.016550,0.177350,0.774050
0.032950,0.015950,0.178650,0.772450
0.033350,0.016200,0.178550,0.771900
0.032250,0.016300,0.179950,0.771500
0.032750,0.015500,0.180650,0.771100
0.032700,0.015350,0.181850,0.770100
0.032400,0.015300,0.182050,0.770250
0.032550,0.015050,0.182300,0.770100
0.033000,0.014750,0.181750,0.770500
0.032400,0.014600,0.182600,0.770400
0.032900,0.014550,0.183050,0.769500
0.032850,0.014300,0.183050,0.769800
0.032250,0.015550,0.183100,0.769100
0.032550,0.015700,0.183550,0.768200
0.032700,0.015900,0.183300,0.768100
0.033450,0.015750,0.183300,0.767500
0.033350,0.015350,0.184100,0.767200
0.033500,0.015750,0.184350,0.766400
0.032800,0.016550,0.185200,0.765450
0.032900,0.015050,0.186400,0.765650
0.032550,0.015150,0.187400,0.764900
0.031850,0.015700,0.186150,0.766300
0.032500,0.015300,0.186800,0.765400
0.031550,0.017200,0.186450,0.764800
0.030550,0.018100,0.187050,0.764300
0.032000,0.017650,0.187950,0.762400
0.032950,0.017350,0.187350,0.762350
0.032800,0.017350,0.187600,0.762250
0.033550,0.018100,0.186750,0.761600
0.034350,0.017600,0.186400,0.761650
0.034350,0.017550,0.186750,0.761350
0.034400,0.017400,0.186300,0.761900
0.034150,0.017750,0.186200,0.761900
0.035400,0.016400,0.188100,0.760100
0.034850,0.016150,0.188800,0.760200
0.034000,0.017600,0.187750,0.760650
0.034600,0.016300,0.187650,0.761450
0.033450,0.017000,0.188150,0.761400
0.033450,0.017400,0.187500,0.761650
0.033650,0.017450,0.188900,0.760000
0.033550,0.017150,0.189050,0.760250
0.034700,0.016250,0.188950,0.760100
0.033150,0.017250,0.189400,0.760200
0.032750,0.017750,0.189200,0.760300
0.034550,0.016850,0.190150,0.758450
0.035100,0.016100,0.190350,0.758450
0.034900,0.016500,0.190400,0.758200
0.035250,0.016850,0.189300,0.758600
0.035400,0.017150,0.188600,0.758850
0.035250,0.017100,0.188250,0.759400
0.035000,0.017700,0.188100,0.759200
0.036350,0.017300,0.188300,0.758050
0.036000,0.017900,0.188350,0.757750
0.036650,0.017650,0.188250,0.757450
0.036400,0.017700,0.187400,0.758500
0.037200,0.017750,0.186300,0.758750
0.036900,0.017950,0.185250,0.759900
0.035700,0.018200,0.184500,0.761600
0.035700,0.018250,0.184350,0.761700
0.035900,0.017550,0.183650,0.762900
0.035400,0.017850,0.183600,0.763150
0.035200,0.018100,0.184800,0.761900
0.035500,0.018450,0.183900,0.762150
0.034850,0.019550,0.183900,0.761700
0.037150,0.018900,0.182500,0.761450
0.036900,0.018850,0.181400,0.762850
0.036350,0.018000,0.181950,0.763700
0.037150,0.016500,0.182800,0.763550
0.036200,0.016750,0.183450,0.763600
0.035600,0.017000,0.184500,0.762900
0.035900,0.016250,0.184700,0.763150
0.035950,0.016350,0.184150,0.763550
0.035350,0.017100,0.183850,0.763700
0.035000,0.017800,0.184200,0.763000
0.035700,0.017450,0.184350,0.762500
0.035500,0.016750,0.184850,0.762900
0.036000,0.017900,0.184200,0.761900
0.035800,0.018750,0.184250,0.761200
0.036850,0.018550,0.182950,0.761650
0.037300,0.018500,0.182350,0.761850
0.036600,0.019350,0.181200,0.762850
0.036100,0.019900,0.180800,0.763200
0.037350,0.019350,0.180150,0.763150
0.038250,0.018650,0.180450,0.762650
0.039000,0.018550,0.179500,0.762950
0.038250,0.017950,0.179550,0.764250
0.037450,0.019550,0.176850,0.766150
0.038000,0.018600,0.176750,0.766650
0.038900,0.018150,0.176650,0.766300
0.037750,0.018400,0.176000,0.767850
0.037750,0.018950,0.175250,0.768050
0.037100,0.018000,0.175100,0.769800
0.037950,0.018700,0.174200,0.769150
0.038400,0.018700,0.174100,0.768800
0.038500,0.019200,0.173300,0.769000
0.037050,0.018300,0.173700,0.770950
0.035650,0.019250,0.172850,0.772250
0.036300,0.018600,0.172700,0.772400
0.036600,0.017350,0.172800,0.773250
0.036500,0.018100,0.172100,0.773300
0.037500,0.017400,0.172000,0.773100
0.037200,0.017400,0.172050,0.773350
0.036600,0.018000,0.172050,0.773350
0.035250,0.018200,0.171250,0.775300
0.036350,0.017200,0.171300,0.775150
0.036750,0.016100,0.171500,0.775650
0.036750,0.015500,0.172550,0.775200
0.035650,0.015600,0.174150,0.774600
0.035700,0.015650,0.174300,0.774350
0.036200,0.015100,0.175050,0.773650
0.035100,0.015650,0.174950,0.774300
0.034550,0.015650,0.175600,0.774200
0.034650,0.015100,0.175950,0.774300
0.034100,0.014750,0.176050,0.775100
0.034200,0.016050,0.175650,0.774100
0.034350,0.015500,0.176650,0.773500
0.033450,0.016450,0.176400,0.773700
0.033150,0.016450,0.176750,0.773650
0.033200,0.016550,0.177050,0.773200
0.032250,0.016600,0.177600,0.773550
0.033150,0.015800,0.177950,0.773100
0.032500,0.017050,0.178000,0.772450
0.032400,0.017500,0.178550,0.771550
0.033450,0.017100,0.178850,0.770600
0.033150,0.017450,0.178550,0.770850
0.033850,0.017100,0.178550,0.770500
0.033550,0.017450,0.179250,0.769750
0.032800,0.017300,0.179600,0.770300
0.033200,0.017350,0.180450,0.769000
0.033500,0.015450,0.181600,0.769450
0.033900,0.014600,0.182900,0.768600
0.033300,0.015550,0.182550,0.768600
0.033750,0.015950,0.182900,0.767400
0.033350,0.017500,0.182600,0.766550
0.033650,0.016650,0.182700,0.767000
0.034850,0.015850,0.182600,0.766700
0.033700,0.016100,0.183850,0.766350
0.033650,0.015800,0.185400,0.765150
0.033800,0.015500,0.186000,0.764700
0.033550,0.015250,0.185750,0.765450
0.033100,0.015800,0.186100,0.765000
0.032450,0.016300,0.185800,0.765450
0.033550,0.015350,0.185650,0.765450
0.033250,0.015450,0.186400,0.764900
0.032650,0.015300,0.186700,0.765350
0.033000,0.015100,0.187700,0.764200
0.032250,0.016150,0.186650,0.764950
0.032150,0.015750,0.186850,0.765250
0.032400,0.016100,0.188450,0.763050
0.032550,0.016300,0.187900,0.763250
0.033450,0.015200,0.188650,0.762700
0.033300,0.015950,0.188500,0.762250
0.032850,0.015800,0.188650,0.762700
0.033300,0.015400,0.189150,0.762150
0.034100,0.015050,0.188650,0.762200
0.033050,0.015550,0.189350,0.762050
0.032850,0.017250,0.189700,0.760200
0.032950,0.017150,0.189950,0.759950
0.033550,0.017400,0.189050,0.760000
0.033000,0.017150,0.189750,0.760100
0.033000,0.017700,0.190500,0.758800
0.033750,0.018300,0.190400,0.757550
0.034700,0.017200,0.190700,0.757400
0.036000,0.016700,0.191600,0.755700
0.035100,0.017350,0.191550,0.756000
0.035100,0.018350,0.190850,0.755700
0.035550,0.019350,0.190350,0.754750
0.036800,0.019250,0.190850,0.753100
0.037700,0.018450,0.191100,0.752750
0.036450,0.019350,0.190500,0.753700
0.037200,0.019050,0.189200,0.754550
0.036850,0.020200,0.187600,0.755350
0.037250,0.019600,0.187600,0.755550
0.037750,0.019750,0.187900,0.754600
0.038650,0.018800,0.189400,0.753150
0.038050,0.018400,0.189150,0.754400
0.037800,0.018350,0.189450,0.754400
0.037950,0.018350,0.189050,0.754650
0.038900,0.017400,0.189850,0.753850
0.037850,0.019150,0.190150,0.752850
0.036950,0.019200,0.189300,0.754550
0.037800,0.018650,0.189800,0.753750
0.037750,0.018600,0.190400,0.753250
0.037700,0.019900,0.188700,0.753700
0.038000,0.020050,0.187500,0.754450
0.037950,0.019600,0.187150,0.755300
0.038800,0.018800,0.187850,0.754550
0.038200,0.020000,0.186800,0.755000
0.039350,0.020050,0.186300,0.754300
0.038850,0.020200,0.186850,0.754100
0.040350,0.019600,0.185600,0.754450
0.040200,0.019650,0.185000,0.755150
0.040150,0.020400,0.184500,0.754950
0.041200,0.019700,0.183150,0.755950
0.041550,0.019450,0.181650,0.757350
0.042150,0.020300,0.179700,0.757850
0.042100,0.019900,0.178700,0.759300
0.041750,0.019150,0.179400,0.759700
0.040900,0.019700,0.179850,0.759550
0.041800,0.019250,0.179100,0.759850
0.041400,0.020000,0.178500,0.760100
0.042200,0.020050,0.177550,0.760200
0.042100,0.019800,0.177250,0.760850
0.041650,0.019650,0.177350,0.761350
0.040800,0.019800,0.177050,0.762350
0.040650,0.020450,0.175900,0.763000
0.041800,0.018850,0.178300,0.761050
0.041300,0.019400,0.176900,0.762400
0.040450,0.018700,0.177450,0.763400
0.039100,0.019650,0.176400,0.764850
0.038650,0.020350,0.175800,0.765200
0.039350,0.018900,0.175350,0.766400
0.038500,0.019900,0.175150,0.766450
0.037750,0.020200,0.176100,0.765950
0.038350,0.019900,0.175050,0.766700
0.038100,0.019700,0.174950,0.767250
0.038150,0.018700,0.176250,0.766900
0.039200,0.017600,0.176950,0.766250
0.039100,0.018050,0.176650,0.766200
0.038250,0.018950,0.175500,0.767300
0.037300,0.018200,0.177000,0.767500
0.036500,0.017550,0.178900,0.767050
0.037000,0.017650,0.178700,0.766650
0.036900,0.016550,0.180500,0.766050
0.037100,0.016500,0.181050,0.765350
0.037350,0.017100,0.180850,0.764700
0.037500,0.017600,0.179850,0.765050
0.036550,0.019000,0.179750,0.764700
0.037100,0.018450,0.178700,0.765750
0.036600,0.018250,0.179350,0.765800
0.037700,0.017450,0.179400,0.765450
0.037950,0.017650,0.178950,0.765450
0.038600,0.017350,0.178750,0.765300
0.037400,0.016750,0.179250,0.766600
0.037550,0.016550,0.179300,0.766600
0.037100,0.016800,0.178350,0.767750
0.037650,0.016600,0.179300,0.766450
0.037700,0.017350,0.180350,0.764600
0.037000,0.017850,0.181400,0.763750
0.037850,0.017150,0.181150,0.763850
0.037000,0.017100,0.181300,0.764600
0.036850,0.017100,0.181250,0.764800
0.036250,0.017750,0.180700,0.765300
0.036300,0.017500,0.180300,0.765900
0.036100,0.016250,0.180200,0.767450
0.035900,0.016700,0.181000,0.766400
0.036950,0.016700,0.180900,0.765450
0.035950,0.017150,0.180850,0.766050
0.036500,0.017650,0.181150,0.764700
0.037250,0.017650,0.180450,0.764650
0.036600,0.017850,0.180350,0.765200
0.035300,0.017350,0.181000,0.766350
0.034450,0.018250,0.180850,0.766450
0.034300,0.017600,0.181350,0.766750
0.033900,0.017650,0.182600,0.765850
0.033750,0.017200,0.183450,0.765600
0.034250,0.015800,0.184650,0.765300
0.033550,0.016450,0.185400,0.764600
0.033950,0.015850,0.185950,0.764250
0.034350,0.016200,0.185350,0.764100
0.034750,0.016250,0.185750,0.763250
0.035000,0.016150,0.186650,0.762200
0.034850,0.016600,0.186000,0.762550
0.034250,0.016950,0.185850,0.762950
0.033200,0.016550,0.186400,0.763850
0.032700,0.017500,0.186850,0.762950
0.033750,0.016950,0.186900,0.762400
0.033250,0.016750,0.187700,0.762300
0.033450,0.016900,0.187650,0.762000
0.034450,0.017250,0.187450,0.760850
0.034750,0.017750,0.186700,0.760800
0.035100,0.016250,0.187900,0.760750
0.034400,0.016250,0.188050,0.761300
0.034450,0.016950,0.187200,0.761400
0.033450,0.017200,0.187950,0.761400
0.033400,0.016950,0.187800,0.761850
0.033300,0.018000,0.186050,0.762650
0.033800,0.017600,0.185450,0.763150
0.033900,0.017850,0.185550,0.762700
0.033800,0.018150,0.185250,0.762800
0.033550,0.018050,0.185800,0.762600
0.034550,0.017500,0.185400,0.762550
0.034450,0.018250,0.184300,0.763000
0.035500,0.017250,0.185000,0.762250
0.035050,0.017750,0.185200,0.762000
0.035750,0.017950,0.185100,0.761200
0.036450,0.018300,0.184300,0.760950
0.036800,0.018650,0.183850,0.760700
0.036200,0.019450,0.183100,0.761250
0.036350,0.020300,0.182600,0.760750
0.037300,0.018200,0.183500,0.761000
0.037550,0.018750,0.182500,0.761200
0.037950,0.018550,0.181700,0.761800
0.037100,0.018550,0.181950,0.762400
0.038100,0.018500,0.181550,0.761850
0.037800,0.017600,0.181850,0.762750
0.037400,0.016800,0.182850,0.762950
0.037650,0.017450,0.181750,0.763150
0.038100,0.017750,0.181650,0.762500
0.038150,0.017650,0.180750,0.763450
0.037100,0.017900,0.181200,0.763800
0.037000,0.017350,0.181200,0.764450
0.036500,0.017550,0.181000,0.764950
0.035900,0.018400,0.180350,0.765350
0.036850,0.018500,0.179900,0.764750
0.037300,0.018150,0.180900,0.763650
0.039250,0.016400,0.181450,0.762900
0.038000,0.017250,0.180250,0.764500
0.037700,0.018350,0.179150,0.764800
0.037450,0.018950,0.177700,0.765900
0.036650,0.020400,0.176600,0.766350
0.036700,0.020350,0.176550,0.766400
0.037250,0.020650,0.175900,0.766200
0.036700,0.019850,0.175400,0.768050
0.037200,0.018600,0.175400,0.768800
0.038700,0.018000,0.175600,0.767700
0.038450,0.017500,0.175750,0.768300
0.039350,0.016250,0.176050,0.768350
0.038500,0.017150,0.175700,0.768650
0.039050,0.017900,0.175150,0.767900
0.039400,0.017750,0.173950,0.768900
0.038100,0.018150,0.173600,0.770150
0.037750,0.018550,0.173250,0.770450
0.037800,0.018400,0.172800,0.771000
0.037600,0.018200,0.172750,0.771450
0.037500,0.017550,0.173750,0.771200
0.036350,0.017300,0.174950,0.771400
0.037250,0.016500,0.176150,0.770100
0.037700,0.015700,0.175750,0.770850
0.037000,0.016600,0.175150,0.771250
0.035300,0.017100,0.175700,0.771900
0.034050,0.018350,0.175300,0.772300
0.034750,0.017300,0.176000,0.771950
0.034450,0.017750,0.175950,0.771850
0.036000,0.016700,0.176500,0.770800
0.035300,0.016600,0.177250,0.770850
0.034200,0.016050,0.177850,0.771900
0.034100,0.016150,0.178200,0.771550
0.032400,0.015900,0.179250,0.772450
0.033200,0.016450,0.179550,0.770800
0.033950,0.016950,0.179350,0.769750
0.033600,0.017400,0.179450,0.769550
0.033750,0.017600,0.178800,0.769850
0.034700,0.016450,0.179750,0.769100
0.034500,0.017050,0.180000,0.768450
0.034500,0.017400,0.180550,0.767550
0.035050,0.017350,0.180000,0.767600
0.035200,0.017200,0.180950,0.766650
0.034900,0.017600,0.181250,0.766250
0.034350,0.016950,0.183500,0.765200
0.035150,0.017550,0.182150,0.765150
0.036000,0.017400,0.182700,0.763900
