I,E,S,R
0.001,0.0009,0.9981,0
0.00115,0.0015,0.9973,5E-05
0.0018,0.0023,0.9958,0.0001
0.0018,0.0035,0.99435,0.00035
0.00245,0.00435,0.99275,0.00045
0.0038,0.005,0.9907,0.0005
0.00445,0.00695,0.98765,0.00095
0.00615,0.0091,0.98335,0.0014
0.00805,0.01255,0.97735,0.00205
0.0107,0.0155,0.97075,0.00305
0.01395,0.01925,0.9623,0.0045
0.0177,0.0254,0.9504,0.0065
0.0232,0.03225,0.9361,0.00845
0.03055,0.0444,0.91385,0.0112
0.03875,0.058,0.88855,0.0147
0.0518,0.07345,0.8554,0.01935
0.0664,0.09095,0.8168,0.02585
0.082,0.11195,0.77085,0.0352
0.10395,0.1337,0.7173,0.04505
0.1278,0.1571,0.656,0.0591
0.1563,0.18155,0.58435,0.0778
0.18735,0.20035,0.51295,0.09935
0.2217,0.2159,0.4399,0.1225
0.2528,0.2322,0.3641,0.1509
0.28535,0.23905,0.29325,0.18235
0.31625,0.23265,0.23165,0.21945
0.33785,0.2206,0.1804,0.26115
0.35565,0.2007,0.1377,0.30595
0.363,0.181,0.10285,0.35315
0.3664,0.1537,0.0796,0.4003
0.36215,0.12975,0.06065,0.44745
0.35205,0.10655,0.0486,0.4928
0.33675,0.0867,0.0383,0.53825
0.32075,0.06855,0.0319,0.5788
0.29655,0.05695,0.027,0.6195
0.2736,0.04565,0.02355,0.6572
0.25065,0.03735,0.0215,0.6905
0.22975,0.03005,0.02,0.7202
0.20635,0.0249,0.01975,0.749
0.1857,0.0204,0.02045,0.77345
0.1647,0.0173,0.0204,0.7976
0.1483,0.0138,0.02055,0.81735
0.1332,0.0116,0.0207,0.8345
0.11905,0.01015,0.0212,0.8496
0.1063,0.00845,0.02325,0.862
0.0954,0.00745,0.0245,0.87265
0.08355,0.0071,0.02615,0.8832
0.07445,0.00605,0.028,0.8915
0.0648,0.0055,0.03035,0.89935
0.0572,0.00465,0.03265,0.9055
0.05055,0.0044,0.0347,0.91035
0.0455,0.00405,0.0365,0.91395
0.04045,0.00355,0.04015,0.91585
0.0354,0.00365,0.0421,0.91885
0.03135,0.00365,0.0446,0.9204
0.0283,0.0037,0.04675,0.92125
0.026,0.00375,0.0488,0.92145
0.02465,0.0029,0.05155,0.9209
0.0221,0.0032,0.05355,0.92115
0.0201,0.003,0.0561,0.9208
0.0178,0.00275,0.05865,0.9208
0.01615,0.0024,0.062,0.91945
0.0143,0.00235,0.06555,0.9178
0.0129,0.0021,0.0681,0.9169
0.01185,0.00215,0.0713,0.9147
0.0116,0.00195,0.0744,0.91205
0.0102,0.0022,0.0761,0.9115
0.00935,0.0022,0.0791,0.90935
0.009,0.00245,0.0819,0.90665
0.00835,0.0022,0.0844,0.90505
0.00785,0.00215,0.08765,0.90235
0.00735,0.002,0.08995,0.9007
0.00715,0.00155,0.0936,0.8977
0.0063,0.00155,0.0966,0.89555
0.0059,0.00145,0.099,0.89365
0.0051,0.00155,0.1015,0.89185
0.00485,0.0015,0.1045,0.88915
0.00485,0.0015,0.1069,0.88675
0.00445,0.0011,0.109,0.88545
0.00425,0.00115,0.1118,0.8828
0.0039,0.001,0.115,0.8801
0.00335,0.0012,0.118,0.87745
0.00315,0.00085,0.12115,0.87485
0.00315,0.0009,0.12385,0.8721
0.0028,0.00075,0.12615,0.8703
0.00255,0.0009,0.12915,0.8674
0.0023,0.00085,0.1313,0.86555
0.00225,0.00075,0.13425,0.86275
0.002,0.00065,0.13775,0.8596
0.0018,0.0007,0.1399,0.8576
0.00165,0.0009,0.1421,0.85535
0.0016,0.0006,0.144,0.8538
0.00155,0.0006,0.14705,0.8508
0.00145,0.00075,0.14955,0.84825
0.00165,0.00065,0.15205,0.84565
0.00155,0.00065,0.15465,0.84315
0.00135,0.00055,0.1573,0.8408
0.0013,0.0005,0.15985,0.83835
0.00135,0.0003,0.1625,0.83585
0.00135,0.0004,0.16515,0.8331
0.0013,0.00045,0.16715,0.8311
0.0012,0.0004,0.16925,0.82915
0.00105,0.00035,0.17185,0.82675
0.001,0.0003,0.17445,0.82425
0.00095,0.0002,0.17715,0.8217
0.00085,0.0003,0.18035,0.8185
0.0007,0.00045,0.18285,0.816
0.00085,0.0004,0.18505,0.8137
0.0008,0.00035,0.18755,0.8113
0.00095,0.00025,0.1901,0.8087
0.00075,0.0003,0.19245,0.8065
0.00065,0.00035,0.195,0.804
0.0006,0.00045,0.19715,0.8018
0.0007,0.0004,0.19915,0.79975
0.0008,0.00045,0.2016,0.79715
0.0008,0.0003,0.20405,0.79485
0.00075,0.00045,0.2061,0.7927
0.0008,0.00045,0.20815,0.7906
0.00075,0.00045,0.2105,0.7883
0.0006,0.00045,0.21295,0.786
0.0006,0.0004,0.21535,0.78365
0.0008,0.00035,0.21745,0.7814
0.00075,0.0003,0.21945,0.7795
0.0006,0.00025,0.2218,0.77735
0.0007,0.00025,0.2237,0.77535
0.00065,0.0002,0.22545,0.7737
0.00065,0.00035,0.22725,0.77175
0.0009,0.0002,0.2289,0.77
0.00075,0.0002,0.2303,0.76875
0.00075,0.0002,0.2318,0.76725
0.0007,0.00015,0.2339,0.76525
0.0007,0.0001,0.23635,0.76285
0.00065,0.0001,0.2388,0.76045
0.0006,0.00015,0.24075,0.7585
0.0005,0.00025,0.24225,0.757
0.0004,0.00035,0.24435,0.7549
0.00045,0.00025,0.2458,0.7535
0.00045,0.00035,0.2478,0.7514
0.00055,0.00035,0.25005,0.74905
0.00065,0.00035,0.2517,0.7473
0.0008,0.00025,0.25395,0.745
0.00085,0.0004,0.25585,0.7429
0.0009,0.0006,0.25795,0.74055
0.0007,0.0007,0.2602,0.7384
0.0008,0.00055,0.2616,0.73705
0.00085,0.00035,0.2641,0.7347
0.0009,0.0005,0.26655,0.73205
0.0009,0.00075,0.26855,0.7298
0.0009,0.00075,0.27025,0.7281
0.00095,0.0007,0.2723,0.72605
0.00095,0.00075,0.27425,0.72405
0.00085,0.00075,0.276,0.7224
0.0009,0.0007,0.278,0.7204
0.0011,0.0007,0.27975,0.71845
0.00125,0.0005,0.2818,0.71645
0.0012,0.00095,0.28295,0.7149
0.0013,0.0009,0.2844,0.7134
0.00115,0.001,0.2861,0.71175
0.0015,0.00075,0.28765,0.7101
0.0013,0.0011,0.28925,0.70835
0.0014,0.00075,0.2912,0.70665
0.00155,0.0008,0.29315,0.7045
0.0013,0.0011,0.29515,0.70245
0.0014,0.00085,0.2969,0.70085
0.0016,0.00075,0.29865,0.699
0.0017,0.00065,0.3002,0.69745
0.00175,0.00095,0.30115,0.69615
0.0019,0.00105,0.30245,0.6946
0.00225,0.00095,0.3041,0.6927
0.00215,0.0016,0.30505,0.6912
0.0025,0.0013,0.30665,0.68955
0.0023,0.00175,0.3078,0.68815
0.0023,0.0016,0.30965,0.68645
0.00255,0.0015,0.3106,0.68535
0.00235,0.00205,0.3116,0.684
0.00255,0.00205,0.3133,0.6821
0.00275,0.00245,0.31385,0.68095
0.00315,0.003,0.314,0.67985
0.0038,0.0026,0.31535,0.67825
0.0041,0.00315,0.3159,0.67685
0.0043,0.0033,0.3171,0.6753
0.0051,0.003,0.319,0.6729
0.00505,0.004,0.3188,0.67215
0.00525,0.0046,0.3192,0.67095
0.00625,0.0047,0.31945,0.6696
0.0067,0.0053,0.3195,0.6685
0.0072,0.0057,0.31955,0.66755
0.00715,0.0069,0.31955,0.6664
0.008,0.00715,0.31925,0.6656
0.00845,0.0078,0.31855,0.6652
0.01035,0.00795,0.31705,0.66465
0.01085,0.00785,0.31695,0.66435
0.0114,0.00775,0.3171,0.66375
0.01185,0.0089,0.3159,0.66335
0.01225,0.0103,0.31495,0.6625
0.01375,0.0108,0.31355,0.6619
0.0156,0.0112,0.31195,0.66125
0.01665,0.0121,0.3097,0.66155
0.0178,0.0133,0.3078,0.6611
0.01795,0.014,0.30605,0.662
0.0195,0.01415,0.30365,0.6627
0.021,0.0162,0.29935,0.66345
0.023,0.01695,0.29645,0.6636
0.025,0.0173,0.2935,0.6642
0.02665,0.01785,0.28975,0.66575
0.0289,0.0187,0.28535,0.66705
0.0307,0.02045,0.2803,0.66855
0.0318,0.0225,0.27485,0.67085
0.0337,0.02365,0.2691,0.67355
0.03595,0.0233,0.2647,0.67605
0.038,0.0234,0.25945,0.67915
0.0388,0.02355,0.25485,0.6828
0.04095,0.0251,0.2484,0.68555
0.04195,0.0264,0.24325,0.6884
0.04315,0.02685,0.2377,0.6923
0.04485,0.0271,0.23175,0.6963
0.0473,0.027,0.2268,0.6989
0.0483,0.02925,0.21965,0.7028
0.04995,0.02935,0.21365,0.70705
0.0517,0.02985,0.20735,0.7111
0.0528,0.0306,0.20195,0.71465
0.05575,0.0294,0.197,0.71785
0.0566,0.0294,0.19125,0.72275
0.05815,0.02775,0.18615,0.72795
0.05955,0.02785,0.18045,0.73215
0.0587,0.0294,0.1743,0.7376
0.0602,0.0285,0.16885,0.74245
0.0594,0.0287,0.1638,0.7481
0.06015,0.02695,0.16,0.7529
0.0606,0.02615,0.1559,0.75735
0.06235,0.025,0.1518,0.76085
0.06175,0.0251,0.1476,0.76555
0.0603,0.0247,0.14485,0.77015
0.0599,0.02455,0.1415,0.77405
0.05945,0.023,0.139,0.77855
0.0565,0.02245,0.13675,0.7843
0.0544,0.0214,0.1361,0.7881
0.052,0.02155,0.1333,0.79315
0.0518,0.0197,0.1325,0.796
0.051,0.01865,0.131,0.79935
0.0496,0.0181,0.12955,0.80275
0.0483,0.0177,0.129,0.805
0.04725,0.01695,0.129,0.8068
0.04495,0.017,0.12785,0.8102
0.04445,0.01715,0.1267,0.8117
0.0426,0.0163,0.127,0.8141
0.042,0.0165,0.12555,0.81595
0.04055,0.0143,0.1266,0.81855
0.0386,0.01425,0.12665,0.8205
0.03725,0.01385,0.1266,0.8223
0.0371,0.01315,0.12685,0.8229
0.03665,0.01215,0.1277,0.8235
0.0347,0.01185,0.1286,0.82485
0.03265,0.01235,0.1297,0.8253
0.0313,0.0117,0.13125,0.82575
0.03035,0.01095,0.13275,0.82595
0.0288,0.01145,0.13375,0.826
0.0278,0.0109,0.13595,0.82535
0.02575,0.01155,0.1374,0.8253
0.0258,0.0107,0.1394,0.8241
0.025,0.0109,0.1407,0.8234
0.02505,0.0108,0.14215,0.822
0.02525,0.01075,0.143,0.821
0.0245,0.01,0.14505,0.82045
0.0242,0.00935,0.1474,0.81905
0.02355,0.0085,0.1489,0.81905
0.02165,0.0088,0.1514,0.81815
0.02105,0.00945,0.154,0.8155
0.0216,0.0082,0.1557,0.8145
0.01995,0.0095,0.1563,0.81425
0.0203,0.00865,0.1594,0.81165
0.0207,0.0086,0.16135,0.80935
0.02005,0.0087,0.1631,0.80815
0.02055,0.0079,0.16505,0.8065
0.02005,0.0082,0.1668,0.80495
0.02035,0.0081,0.16755,0.804
0.02015,0.00775,0.1686,0.8035
0.01895,0.0082,0.17065,0.8022
0.01825,0.00815,0.173,0.8006
0.0177,0.00835,0.1745,0.79945
0.01775,0.0087,0.1762,0.79735
0.0178,0.00795,0.1782,0.79605
0.0176,0.0082,0.18075,0.79345
0.01815,0.0083,0.18285,0.7907
0.0178,0.0096,0.1835,0.7891
0.0179,0.00895,0.18535,0.7878
0.01855,0.00825,0.18775,0.78545
0.01775,0.0084,0.1896,0.78425
0.01725,0.0088,0.19125,0.7827
0.017,0.00915,0.19245,0.7814
0.0162,0.00985,0.19355,0.7804
0.01675,0.00975,0.19465,0.77885
0.01725,0.0094,0.1969,0.77645
0.0167,0.0095,0.1988,0.775
0.01725,0.009,0.2013,0.77245
0.0179,0.00965,0.2026,0.76985
0.0175,0.0095,0.20495,0.76805
0.0181,0.0097,0.20605,0.76615
0.0184,0.00975,0.2074,0.76445
0.01825,0.0096,0.2093,0.76285
0.01775,0.0107,0.21075,0.7608
0.018,0.01115,0.21235,0.7585
0.01825,0.0111,0.214,0.75665
0.0189,0.0112,0.2151,0.7548
0.01975,0.0112,0.21595,0.7531
0.02015,0.0117,0.21735,0.7508
0.0213,0.0118,0.2183,0.7486
0.02225,0.0124,0.2195,0.74585
0.0227,0.01365,0.2193,0.74435
0.02265,0.014,0.2198,0.74355
0.02315,0.01385,0.22015,0.74285
0.02465,0.01425,0.21965,0.74145
0.02515,0.01415,0.2207,0.74
0.02475,0.01465,0.2208,0.7398
0.02635,0.0146,0.2199,0.73915
0.02605,0.0154,0.21985,0.7387
0.02625,0.0156,0.2201,0.73805
0.02675,0.01565,0.2202,0.7374
0.0275,0.01465,0.2201,0.73775
0.0283,0.0156,0.21875,0.73735
0.02955,0.01585,0.2182,0.7364
0.0306,0.0161,0.2181,0.7352
0.03155,0.01685,0.2168,0.7348
0.0323,0.01725,0.216,0.73445
0.033,0.01745,0.2153,0.73425
0.03375,0.01775,0.2144,0.7341
0.03485,0.01745,0.2133,0.7344
0.035,0.0187,0.21145,0.73485
0.03475,0.0204,0.2096,0.73525
0.035,0.0221,0.2077,0.7352
0.0366,0.02095,0.20745,0.735
0.0378,0.0211,0.206,0.7351
0.03905,0.02235,0.20325,0.73535
0.0403,0.02225,0.20035,0.7371
0.0416,0.02135,0.19805,0.739
0.04285,0.02255,0.19515,0.73945
0.04465,0.0223,0.1934,0.73965
0.045,0.0233,0.19075,0.74095
0.04585,0.02445,0.1862,0.7435
0.0457,0.0243,0.1849,0.7451
0.047,0.02475,0.18185,0.7464
0.0489,0.02315,0.18,0.74795
0.0497,0.02325,0.17715,0.7499
0.0494,0.02205,0.17635,0.7522
0.0483,0.02355,0.1739,0.75425
0.0485,0.0232,0.1717,0.7566
0.0479,0.02335,0.1699,0.75885
0.04795,0.0226,0.1687,0.76075
0.04725,0.0214,0.1671,0.76425
0.0463,0.0211,0.1654,0.7672
0.0469,0.0209,0.1646,0.7676
0.0459,0.021,0.1642,0.7689
0.04605,0.02025,0.1638,0.7699
0.04515,0.02075,0.1625,0.7716
0.04605,0.0195,0.1619,0.77255
0.04545,0.0203,0.16125,0.773
0.0442,0.0217,0.15955,0.77455
0.04425,0.02115,0.1589,0.7757
0.0438,0.02025,0.15975,0.7762
0.04355,0.0197,0.15965,0.7771
0.04305,0.0205,0.1588,0.77765
0.04125,0.02175,0.158,0.779
0.0419,0.02065,0.1583,0.77915
0.0426,0.01915,0.1591,0.77915
0.04245,0.0192,0.1591,0.77925
0.04255,0.01885,0.1586,0.78
0.0422,0.01795,0.1587,0.78115
0.0421,0.0176,0.15915,0.78115
0.0408,0.01815,0.1592,0.78185
0.04075,0.01785,0.16015,0.78125
0.04025,0.01805,0.1596,0.7821
0.04005,0.01755,0.15975,0.78265
0.0405,0.01725,0.16025,0.782
0.0401,0.0169,0.1607,0.7823
0.03945,0.01665,0.16135,0.78255
0.0392,0.01745,0.1614,0.78195
0.0376,0.01735,0.16225,0.7828
0.03675,0.01695,0.16325,0.78305
0.0357,0.0178,0.16295,0.78355
0.0359,0.01785,0.1636,0.78265
0.03515,0.0171,0.1643,0.78345
0.03575,0.01675,0.16515,0.78235
0.036,0.0168,0.1663,0.7809
0.0366,0.0157,0.16665,0.78105
0.03615,0.01555,0.1678,0.7805
0.03625,0.01505,0.16875,0.77995
0.0355,0.01495,0.1698,0.77975
0.0349,0.0158,0.1702,0.7791
0.0334,0.01635,0.1711,0.77915
0.03405,0.01625,0.17135,0.77835
0.0342,0.0152,0.1723,0.7783
0.0334,0.01415,0.17305,0.7794
0.033,0.0149,0.17365,0.77845
0.0328,0.0153,0.17335,0.77855
0.0327,0.0149,0.17485,0.77755
0.0321,0.01595,0.17555,0.7764
0.03265,0.016,0.177,0.77435
0.03355,0.01575,0.1772,0.7735
0.0331,0.0154,0.17805,0.77345
0.03365,0.0157,0.178,0.77265
0.0332,0.016,0.17935,0.77145
0.03315,0.0158,0.17895,0.7721
0.03345,0.01495,0.17995,0.77165
0.03325,0.01485,0.18065,0.77125
0.0333,0.01435,0.18135,0.771
0.03255,0.0147,0.18195,0.7708
0.0323,0.01435,0.18195,0.7714
0.03115,0.01465,0.1828,0.7714
0.031,0.01425,0.185,0.76975
0.0301,0.01385,0.18715,0.7689
0.0293,0.01485,0.1883,0.76755
0.0296,0.01495,0.18935,0.7661
0.0297,0.01555,0.18915,0.7656
0.0304,0.0162,0.1896,0.7638
0.03125,0.01565,0.19035,0.76275
0.0314,0.01555,0.1917,0.76135
0.0307,0.01655,0.19165,0.7611
0.0311,0.0173,0.19165,0.75995
0.03225,0.0172,0.1918,0.75875
0.03335,0.017,0.19105,0.7586
0.0325,0.0175,0.19185,0.75815
0.0328,0.0175,0.1909,0.7588
0.03295,0.01715,0.19075,0.75915
0.0336,0.0164,0.1919,0.7581
0.03405,0.0158,0.1922,0.75795
0.0337,0.0164,0.19195,0.75795
0.0329,0.01745,0.19115,0.7585
0.03455,0.01755,0.1914,0.7565
0.0354,0.01745,0.192,0.75515
0.03465,0.01865,0.1916,0.7551
0.035,0.0186,0.19145,0.75495
0.03575,0.0173,0.19155,0.7554
0.0359,0.0173,0.19125,0.75555
0.03605,0.017,0.1905,0.75645
0.0367,0.0178,0.189,0.7565
0.037,0.0169,0.1884,0.7577
0.0376,0.0163,0.18775,0.75835
0.03725,0.0167,0.18745,0.7586
0.0368,0.01735,0.187,0.75885
0.0374,0.0167,0.18695,0.75895
0.0382,0.0167,0.18705,0.75805
0.0387,0.01585,0.1871,0.75835
0.0363,0.01765,0.18535,0.7607
0.0355,0.01735,0.18505,0.7621
0.03585,0.0177,0.1858,0.76065
0.0363,0.018,0.1863,0.7594
0.03655,0.0175,0.18605,0.7599
0.03765,0.017,0.18655,0.7588
0.03805,0.0177,0.18595,0.7583
0.03755,0.01755,0.1868,0.7581
0.0375,0.01775,0.1863,0.75845
0.03855,0.0173,0.18635,0.7578
0.0384,0.01835,0.1848,0.75845
0.0377,0.01875,0.1843,0.75925
0.03705,0.01975,0.18325,0.75995
0.0369,0.0186,0.1839,0.7606
0.0368,0.01815,0.18275,0.7623
0.03735,0.01835,0.18165,0.76265
0.03745,0.01855,0.1808,0.7632
0.03895,0.01725,0.18105,0.76275
0.0385,0.01695,0.1808,0.76375
0.039,0.01745,0.17945,0.7641
0.039,0.0182,0.1783,0.7645
0.03905,0.0183,0.1785,0.76415
0.03845,0.01965,0.1778,0.7641
0.0381,0.01975,0.17815,0.764
0.0384,0.0194,0.17765,0.76455
0.0379,0.02015,0.1762,0.76575
0.0397,0.0201,0.1754,0.7648
0.03935,0.02045,0.17425,0.76595
0.04045,0.0193,0.1743,0.76595
0.04025,0.0196,0.17415,0.766
0.0403,0.0195,0.1725,0.7677
0.03975,0.01975,0.1714,0.7691
0.039,0.0194,0.17115,0.77045
0.03945,0.0188,0.1714,0.77035
0.0398,0.0188,0.1711,0.7703
0.04045,0.0176,0.17085,0.7711
0.03995,0.01755,0.17055,0.77195
0.03955,0.0176,0.1702,0.77265
0.03945,0.01645,0.1699,0.7742
0.03855,0.01745,0.16975,0.77425
0.03875,0.0166,0.16995,0.7747
0.03805,0.0164,0.17035,0.7752
0.0378,0.01605,0.1704,0.77575
0.03705,0.0154,0.17065,0.7769
0.03745,0.0159,0.1701,0.77655
0.03805,0.0156,0.17065,0.7757
0.0372,0.016,0.1706,0.7762
0.0364,0.0174,0.1699,0.7763
0.03605,0.0165,0.1696,0.77785
0.0364,0.0162,0.16975,0.77765
0.0358,0.01595,0.17035,0.7779
0.036,0.0156,0.17155,0.77685
0.03535,0.01555,0.1726,0.7765
0.0348,0.015,0.17345,0.77675
0.0335,0.0147,0.17355,0.77825
0.0331,0.014,0.17435,0.77855
0.03255,0.0146,0.1754,0.77745
0.0325,0.01445,0.17695,0.7761
0.0325,0.01475,0.17715,0.7756
0.03335,0.01375,0.17855,0.77435
0.03255,0.01455,0.1786,0.7743
0.03145,0.015,0.178,0.77555
0.03105,0.01555,0.17785,0.77555
0.03055,0.015,0.1793,0.77515
0.0308,0.01465,0.17895,0.7756
0.03175,0.0152,0.17875,0.7743
0.03085,0.0159,0.17925,0.774
0.0311,0.0146,0.18045,0.77385
0.0309,0.0146,0.1818,0.7727
0.0313,0.01515,0.1823,0.77125
0.0303,0.01575,0.1823,0.77165
0.0308,0.0154,0.1832,0.7706
0.0317,0.0156,0.1839,0.7688
0.03225,0.0159,0.18375,0.7681
0.03125,0.01565,0.18525,0.76785
0.03115,0.01515,0.18525,0.76845
0.03145,0.01435,0.18575,0.76845
0.0307,0.014,0.1878,0.7675
0.03075,0.0144,0.189,0.76585
0.0302,0.0138,0.18945,0.76655
0.02955,0.01395,0.1901,0.7664
0.03005,0.01445,0.19025,0.76525
0.03045,0.015,0.1905,0.76405
0.0306,0.01485,0.1918,0.76275
0.03075,0.01525,0.19075,0.76325
0.0312,0.01615,0.19045,0.7622
0.0318,0.016,0.19075,0.76145
0.03165,0.0165,0.19065,0.7612
0.03105,0.0171,0.19055,0.7613
0.0322,0.01615,0.1908,0.76085
0.03195,0.01655,0.18945,0.76205
0.03265,0.01565,0.18985,0.76185
0.03285,0.01585,0.18955,0.76175
0.03365,0.0161,0.18905,0.7612
0.0339,0.01555,0.18835,0.7622
0.0319,0.01715,0.1871,0.76385
0.0329,0.01655,0.18765,0.7629
0.03225,0.01645,0.1872,0.7641
0.0324,0.0172,0.18725,0.76315
0.0337,0.01715,0.18625,0.7629
0.0343,0.01705,0.1853,0.76335
0.0339,0.01735,0.18575,0.763
0.0345,0.01655,0.18615,0.7628
0.03535,0.0166,0.1859,0.76215
0.03545,0.0171,0.1858,0.76165
0.0357,0.0175,0.18535,0.76145
0.03465,0.01795,0.18545,0.76195
0.03675,0.0161,0.1863,0.76085
0.0371,0.01655,0.18675,0.7596
0.03675,0.0173,0.1867,0.75925
0.03725,0.01745,0.1849,0.7604
0.03715,0.01855,0.18425,0.76005
0.03715,0.01835,0.18415,0.76035
0.03655,0.01945,0.18335,0.76065
0.03835,0.0186,0.1824,0.76065
0.038,0.01955,0.1807,0.76175
0.0376,0.01965,0.18055,0.7622
0.03895,0.01885,0.18055,0.76165
0.0378,0.0193,0.1796,0.7633
0.0391,0.01805,0.1794,0.76345
0.0394,0.0187,0.179,0.7629
0.03945,0.0186,0.1787,0.76325
0.03915,0.01875,0.17875,0.76335
0.03925,0.01805,0.17815,0.76455
0.0401,0.01815,0.17725,0.7645
0.0401,0.01845,0.17675,0.7647
0.03905,0.0191,0.1765,0.76535
0.0396,0.0187,0.17705,0.76465
0.03985,0.01905,0.1765,0.7646
0.0399,0.01985,0.1757,0.76455
0.0402,0.0195,0.1753,0.765
0.0399,0.0199,0.1757,0.7645
0.04025,0.0192,0.17565,0.7649
0.0408,0.01885,0.17585,0.7645
0.03985,0.01965,0.17575,0.76475
0.0419,0.0184,0.1761,0.7636
0.04185,0.0188,0.17515,0.7642
0.04205,0.01845,0.1746,0.7649
0.04075,0.01995,0.1742,0.7651
0.0406,0.0191,0.1737,0.7666
0.04075,0.0176,0.17455,0.7671
0.0393,0.0182,0.1747,0.7678
0.03885,0.01765,0.17555,0.76795
0.0391,0.01835,0.17535,0.7672
0.0391,0.017,0.1769,0.767
0.0382,0.01665,0.1775,0.76765
0.0371,0.0173,0.17715,0.76845
0.0367,0.018,0.1767,0.7686
0.03785,0.01785,0.178,0.7663
0.03835,0.01885,0.1776,0.7652
0.03845,0.0188,0.17795,0.7648
0.03845,0.01805,0.1785,0.765
0.0379,0.01915,0.1788,0.76415
0.03815,0.01945,0.17845,0.76395
0.03885,0.01885,0.1776,0.7647
0.0395,0.01775,0.17775,0.765
0.0394,0.01755,0.1784,0.76465
0.03925,0.0176,0.1787,0.76445
0.0393,0.017,0.1783,0.7654
0.0384,0.01685,0.17795,0.7668
0.03795,0.0174,0.17815,0.7665
0.03765,0.01785,0.1779,0.7666
0.0374,0.0174,0.179,0.7662
0.03775,0.0162,0.18025,0.7658
0.03585,0.01835,0.1805,0.7653
0.0371,0.0173,0.18055,0.76505
0.03745,0.0176,0.17995,0.765
0.0377,0.0175,0.17955,0.76525
0.03695,0.0187,0.17965,0.7647
0.0365,0.0197,0.1796,0.7642
0.0374,0.01855,0.18045,0.7636
0.0371,0.01905,0.1807,0.76315
0.03745,0.0188,0.1811,0.76265
0.0381,0.01815,0.181,0.76275
0.03785,0.0178,0.18075,0.7636
0.03815,0.01865,0.1796,0.7636
0.03855,0.01895,0.1788,0.7637
0.03845,0.01845,0.1794,0.7637
0.03715,0.01895,0.17985,0.76405
0.03705,0.0193,0.1787,0.76495
0.03745,0.01935,0.17805,0.76515
0.0379,0.01915,0.1788,0.76415
0.0373,0.02,0.17815,0.76455
0.0378,0.02035,0.17765,0.7642
0.03825,0.0209,0.17735,0.7635
0.03935,0.01925,0.17795,0.76345
0.0389,0.0209,0.17615,0.76405
0.0406,0.02015,0.17495,0.7643
0.04035,0.0197,0.1754,0.76455
0.0409,0.01925,0.17485,0.765
0.04065,0.01955,0.1738,0.766
0.0408,0.01935,0.17365,0.7662
0.04095,0.0198,0.17215,0.7671
0.041,0.0192,0.1732,0.7666
0.04095,0.0201,0.17275,0.7662
0.04125,0.02025,0.17325,0.76525
0.0412,0.02035,0.1732,0.76525
0.04325,0.01835,0.17265,0.76575
0.0421,0.01875,0.17145,0.7677
0.0414,0.01915,0.1706,0.76885
0.0411,0.01895,0.17055,0.7694
0.0404,0.0192,0.17045,0.76995
0.0397,0.02005,0.16945,0.7708
0.04005,0.01965,0.1697,0.7706
0.03945,0.01835,0.16965,0.77255
0.0391,0.0179,0.1709,0.7721
0.0382,0.01805,0.1705,0.77325
0.0391,0.017,0.17065,0.77325
0.03865,0.01705,0.1714,0.7729
0.0381,0.01685,0.172,0.77305
0.0387,0.0163,0.1728,0.7722
0.0378,0.01615,0.17425,0.7718
0.0363,0.0174,0.17525,0.77105
0.03735,0.0175,0.17535,0.7698
0.03675,0.01745,0.17555,0.77025
0.0361,0.01795,0.17625,0.7697
0.03605,0.01785,0.17655,0.76955
0.0366,0.0165,0.1763,0.7706
0.037,0.0162,0.17685,0.76995
0.03585,0.01675,0.1776,0.7698
0.035,0.017,0.17825,0.76975
0.03635,0.01625,0.1783,0.7691
0.0365,0.01605,0.17925,0.7682
0.0363,0.01575,0.1784,0.76955
0.0357,0.0176,0.1789,0.7678
0.0358,0.01605,0.1802,0.76795
0.03555,0.01665,0.1797,0.7681
0.0362,0.0167,0.18055,0.76655
0.0359,0.0162,0.182,0.7659
0.03495,0.01705,0.1818,0.7662
0.0361,0.01675,0.18195,0.7652
0.03545,0.0174,0.18185,0.7653
0.0354,0.0175,0.1824,0.7647
0.0362,0.0172,0.1827,0.7639
0.03605,0.01815,0.1822,0.7636
0.0365,0.0176,0.18215,0.76375
0.03605,0.01795,0.18205,0.76395
0.0352,0.0169,0.18365,0.76425
0.0345,0.01755,0.18365,0.7643
0.0344,0.0179,0.18415,0.76355
0.0325,0.0174,0.1847,0.7654
0.0346,0.01635,0.18455,0.7645
0.03375,0.0164,0.185,0.76485
0.0333,0.0169,0.1842,0.7656
0.03335,0.01675,0.18395,0.76595
0.0348,0.0159,0.18365,0.76565
0.0348,0.01585,0.1837,0.76565
0.03495,0.01565,0.1842,0.7652
0.03495,0.01635,0.1846,0.7641
0.03515,0.01745,0.18345,0.76395
0.03605,0.01785,0.18295,0.76315
0.0359,0.0176,0.1833,0.7632
0.0359,0.01875,0.1822,0.76315
0.03645,0.0186,0.18205,0.7629
0.03585,0.0194,0.1815,0.76325
0.0366,0.01945,0.1808,0.76315
0.03765,0.01765,0.1818,0.7629
0.0384,0.01735,0.1825,0.76175
0.03855,0.01685,0.1817,0.7629
0.0389,0.01685,0.1804,0.76385
0.03775,0.0182,0.1793,0.76475
0.03835,0.0171,0.17955,0.765
0.0375,0.017,0.17845,0.76705
0.03595,0.01795,0.17775,0.76835
0.0363,0.0184,0.1782,0.7671
0.0367,0.0167,0.17995,0.76665
0.036,0.0177,0.17925,0.76705
0.0355,0.0177,0.179,0.7678
0.0357,0.0173,0.1795,0.7675
0.0366,0.0175,0.1786,0.7673
0.03675,0.0179,0.1784,0.76695
0.0354,0.0197,0.1777,0.7672
0.0355,0.01935,0.1779,0.76725
0.03475,0.0188,0.17925,0.7672
0.03515,0.0202,0.1777,0.76695
0.03615,0.01905,0.17805,0.76675
0.03675,0.019,0.1776,0.76665
0.03835,0.018,0.17735,0.7663
0.0382,0.0178,0.1783,0.7657
0.03925,0.0178,0.1774,0.76555
0.0393,0.01765,0.17715,0.7659
0.03905,0.01835,0.1762,0.7664
0.03945,0.01795,0.17545,0.76715
0.03915,0.01865,0.17545,0.76675
0.0393,0.018,0.1753,0.7674
0.04005,0.01685,0.17585,0.76725
0.03975,0.0165,0.176,0.76775
0.04,0.0172,0.17585,0.76695
