I,E,S,R
0.001000,0.000600,0.998400,0.000000
0.000950,0.001500,0.997400,0.000150
0.001050,0.002000,0.996600,0.000350
0.001550,0.002800,0.995150,0.000500
0.002000,0.003650,0.993650,0.000700
0.002850,0.005450,0.990750,0.000950
0.003700,0.006550,0.988100,0.001650
0.004700,0.008200,0.985050,0.002050
0.006700,0.009750,0.981150,0.002400
0.008850,0.013600,0.974450,0.003100
0.011750,0.017850,0.966050,0.004350
0.014900,0.023700,0.955200,0.006200
0.019300,0.030100,0.942550,0.008050
0.025900,0.036950,0.926300,0.010850
0.032750,0.048050,0.905450,0.013750
0.040500,0.062100,0.879300,0.018100
0.052150,0.076950,0.847200,0.023700
0.067400,0.093200,0.809100,0.030300
0.085350,0.114600,0.760700,0.039350
0.104700,0.138200,0.705750,0.051350
0.129300,0.159750,0.645300,0.065650
0.161550,0.183200,0.574900,0.080350
0.188300,0.207250,0.500250,0.104200
0.222300,0.223300,0.424850,0.129550
0.255750,0.230300,0.355450,0.158500
0.285300,0.233900,0.287700,0.193100
0.314100,0.225750,0.228750,0.231400
0.339300,0.210350,0.178600,0.271750
0.354600,0.189700,0.137500,0.318200
0.363700,0.169650,0.104700,0.361950
0.364000,0.145100,0.081650,0.409250
0.356700,0.124800,0.060450,0.458050
0.346250,0.105450,0.047450,0.500850
0.332150,0.086650,0.036650,0.544550
0.312100,0.071300,0.029050,0.587550
0.291750,0.057100,0.024650,0.626500
0.270600,0.044650,0.022250,0.662500
0.246150,0.035450,0.020450,0.697950
0.221800,0.028350,0.019700,0.730150
0.199950,0.022800,0.019850,0.757400
0.179850,0.018500,0.019650,0.782000
0.161100,0.015450,0.020550,0.802900
0.145000,0.013100,0.021550,0.820350
0.127400,0.012050,0.022100,0.838450
0.113000,0.010200,0.023400,0.853400
0.100900,0.008950,0.024000,0.866150
0.089900,0.007500,0.026100,0.876500
0.081150,0.006000,0.027950,0.884900
0.071000,0.005700,0.029750,0.893550
0.062400,0.005450,0.031400,0.900750
0.055550,0.005950,0.032700,0.905800
0.050650,0.005850,0.035450,0.908050
0.045400,0.005100,0.037900,0.911600
0.040250,0.004400,0.040450,0.914900
0.036500,0.004100,0.042800,0.916600
0.032250,0.004250,0.045000,0.918500
0.029100,0.004050,0.047550,0.919300
0.025800,0.004450,0.049900,0.919850
0.023650,0.004100,0.052650,0.919600
0.021300,0.003550,0.054700,0.920450
0.020200,0.002950,0.057250,0.919600
0.017750,0.002500,0.060600,0.919150
0.015450,0.002600,0.062700,0.919250
0.014300,0.002450,0.065000,0.918250
0.012750,0.001950,0.067700,0.917600
0.011350,0.002050,0.069500,0.917100
0.010500,0.001850,0.072650,0.915000
0.009550,0.001650,0.076100,0.912700
0.008400,0.001450,0.078500,0.911650
0.007500,0.001500,0.081100,0.909900
0.006850,0.001350,0.083800,0.908000
0.006200,0.001300,0.087200,0.905300
0.005650,0.001500,0.089700,0.903150
0.005200,0.001650,0.092200,0.900950
0.004750,0.001500,0.094500,0.899250
0.003850,0.001650,0.097550,0.896950
0.003950,0.001300,0.100450,0.894300
0.003650,0.001100,0.103000,0.892250
0.003500,0.000900,0.105500,0.890100
0.003250,0.000750,0.108750,0.887250
0.002950,0.000850,0.111450,0.884750
0.002450,0.000950,0.114550,0.882050
0.002350,0.000850,0.116900,0.879900
0.002150,0.000850,0.120350,0.876650
0.002100,0.000750,0.122400,0.874750
0.002000,0.000750,0.125500,0.871750
0.001900,0.000800,0.128200,0.869100
0.001950,0.000600,0.131200,0.866250
0.002100,0.000450,0.134250,0.863200
0.001700,0.000550,0.136550,0.861200
0.001450,0.000850,0.138050,0.859650
0.001350,0.000800,0.140650,0.857200
0.001450,0.000700,0.143050,0.854800
0.001450,0.000750,0.145000,0.852800
0.001650,0.000500,0.147250,0.850600
0.001350,0.000700,0.149350,0.848600
0.001400,0.000450,0.152350,0.845800
0.001400,0.000550,0.154500,0.843550
0.001400,0.000450,0.156900,0.841250
0.001350,0.000600,0.158750,0.839300
0.001400,0.000400,0.161150,0.837050
0.001350,0.000550,0.163900,0.834200
0.001250,0.000550,0.166800,0.831400
0.001400,0.000500,0.168900,0.829200
0.001350,0.000600,0.171300,0.826750
0.001400,0.000600,0.173350,0.824650
0.001500,0.000500,0.175750,0.822250
0.001500,0.000400,0.178400,0.819700
0.001150,0.000500,0.180650,0.817700
0.001200,0.000400,0.183300,0.815100
0.001250,0.000500,0.185500,0.812750
0.001100,0.000600,0.187150,0.811150
0.001000,0.000650,0.189350,0.809000
0.000850,0.000550,0.191600,0.807000
0.000800,0.000500,0.193650,0.805050
0.000900,0.000400,0.196950,0.801750
0.000900,0.000500,0.198900,0.799700
0.000950,0.000650,0.201250,0.797150
0.000900,0.000600,0.203300,0.795200
0.000800,0.000500,0.205550,0.793150
0.000900,0.000650,0.207500,0.790950
0.001100,0.000550,0.209650,0.788700
0.001100,0.000500,0.211250,0.787150
0.001050,0.000500,0.213650,0.784800
0.001050,0.000450,0.215700,0.782800
0.000900,0.000600,0.217350,0.781150
0.000850,0.000400,0.219600,0.779150
0.001100,0.000350,0.221600,0.776950
0.001150,0.000350,0.223900,0.774600
0.001050,0.000600,0.225550,0.772800
0.001050,0.000450,0.227550,0.770950
0.000900,0.000600,0.229550,0.768950
0.000850,0.000650,0.231450,0.767050
0.000750,0.000600,0.233600,0.765050
0.001000,0.000500,0.235850,0.762650
0.001000,0.000500,0.238100,0.760400
0.000900,0.000650,0.240300,0.758150
0.000950,0.000700,0.242200,0.756150
0.001050,0.000800,0.244250,0.753900
0.001050,0.000750,0.246700,0.751500
0.001300,0.000450,0.249300,0.748950
0.001200,0.000300,0.251050,0.747450
0.001150,0.000500,0.253400,0.744950
0.001250,0.000550,0.255650,0.742550
0.001350,0.000750,0.257200,0.740700
0.001250,0.000700,0.259100,0.738950
0.001250,0.000850,0.260350,0.737550
0.001250,0.000700,0.262950,0.735100
0.001450,0.000950,0.264650,0.732950
0.001500,0.000900,0.265950,0.731650
0.001550,0.001000,0.267550,0.729900
0.001750,0.001100,0.268950,0.728200
0.001800,0.001050,0.270750,0.726400
0.001700,0.001050,0.272400,0.724850
0.001700,0.001050,0.274100,0.723150
0.001700,0.001350,0.275900,0.721050
0.001750,0.001400,0.277450,0.719400
0.002100,0.001350,0.278950,0.717600
0.002050,0.001550,0.280700,0.715700
0.002100,0.002000,0.281350,0.714550
0.002150,0.002050,0.282600,0.713200
0.002400,0.002050,0.284450,0.711100
0.002500,0.002700,0.285650,0.709150
0.002950,0.002500,0.287200,0.707350
0.003350,0.002250,0.288900,0.705500
0.003450,0.002650,0.289550,0.704350
0.003800,0.003050,0.290600,0.702550
0.004350,0.003150,0.292150,0.700350
0.005000,0.003100,0.293150,0.698750
0.005050,0.003250,0.294250,0.697450
0.005350,0.003150,0.295350,0.696150
0.005700,0.003600,0.295850,0.694850
0.005800,0.003900,0.296600,0.693700
0.005800,0.004200,0.297000,0.693000
0.006150,0.004100,0.297500,0.692250
0.006250,0.004200,0.298050,0.691500
0.006450,0.005100,0.297650,0.690800
0.007350,0.004950,0.298650,0.689050
0.007850,0.005150,0.299050,0.687950
0.008350,0.005300,0.299400,0.686950
0.008900,0.005500,0.299750,0.685850
0.009100,0.006000,0.299750,0.685150
0.010050,0.005050,0.300650,0.684250
0.009750,0.005950,0.300800,0.683500
0.010100,0.006500,0.300900,0.682500
0.010250,0.008000,0.300350,0.681400
0.011350,0.008350,0.300550,0.679750
0.011950,0.008300,0.299400,0.680350
0.012850,0.008500,0.298750,0.679900
0.013850,0.008750,0.297950,0.679450
0.014450,0.009200,0.296550,0.679800
0.014750,0.009500,0.296000,0.679750
0.015800,0.010650,0.294000,0.679550
0.016200,0.011800,0.292050,0.679950
0.017750,0.013100,0.289450,0.679700
0.019300,0.012700,0.287700,0.680300
0.020650,0.014000,0.285250,0.680100
0.022400,0.013850,0.283000,0.680750
0.023350,0.015200,0.280400,0.681050
0.025250,0.015400,0.277450,0.681900
0.026550,0.015200,0.274650,0.683600
0.027450,0.016200,0.270850,0.685500
0.028300,0.018750,0.266700,0.686250
0.030050,0.017500,0.264150,0.688300
0.030900,0.018100,0.260600,0.690400
0.031200,0.019600,0.256400,0.692800
0.033800,0.020050,0.252800,0.693350
0.035950,0.020850,0.249100,0.694100
0.036450,0.021800,0.245300,0.696450
0.037900,0.022650,0.240800,0.698650
0.039700,0.022450,0.236750,0.701100
0.040700,0.024350,0.230650,0.704300
0.042450,0.025600,0.225650,0.706300
0.044450,0.025550,0.220450,0.709550
0.046500,0.024800,0.216250,0.712450
0.048350,0.025100,0.210150,0.716400
0.048200,0.025400,0.205800,0.720600
0.049150,0.026150,0.200950,0.723750
0.049850,0.026600,0.196200,0.727350
0.051050,0.026450,0.192000,0.730500
0.051700,0.026300,0.187400,0.734600
0.052300,0.026150,0.182850,0.738700
0.052550,0.024650,0.179200,0.743600
0.052250,0.026200,0.174550,0.747000
0.053100,0.024700,0.170900,0.751300
0.052800,0.024450,0.167300,0.755450
0.051500,0.023600,0.163450,0.761450
0.051600,0.022900,0.160200,0.765300
0.051700,0.022050,0.157800,0.768450
0.050550,0.023350,0.154450,0.771650
0.050350,0.023450,0.151000,0.775200
0.048800,0.022800,0.148500,0.779900
0.048050,0.021900,0.147550,0.782500
0.047100,0.020750,0.146400,0.785750
0.047900,0.019300,0.144550,0.788250
0.047400,0.019650,0.143100,0.789850
0.047200,0.020950,0.139400,0.792450
0.046650,0.019950,0.138700,0.794700
0.046550,0.018850,0.137650,0.796950
0.045800,0.017250,0.137650,0.799300
0.043500,0.017200,0.137100,0.802200
0.042650,0.016500,0.135900,0.804950
0.041600,0.015050,0.136350,0.807000
0.040200,0.014100,0.136450,0.809250
0.039850,0.013400,0.136650,0.810100
0.038950,0.014050,0.136250,0.810750
0.037000,0.013350,0.137150,0.812500
0.034950,0.013550,0.138000,0.813500
0.033600,0.013950,0.138200,0.814250
0.032450,0.014050,0.138750,0.814750
0.033150,0.013400,0.138950,0.814500
0.033200,0.013800,0.139150,0.813850
0.033500,0.013200,0.140150,0.813150
0.032400,0.013200,0.140100,0.814300
0.032300,0.012300,0.140800,0.814600
0.030650,0.011600,0.142050,0.815700
0.029800,0.010900,0.143950,0.815350
0.029750,0.011400,0.144000,0.814850
0.028900,0.011200,0.145150,0.814750
0.028550,0.011750,0.145750,0.813950
0.027750,0.011700,0.147000,0.813550
0.027600,0.012000,0.147800,0.812600
0.027250,0.011550,0.148350,0.812850
0.027350,0.011300,0.149550,0.811800
0.027000,0.010850,0.150650,0.811500
0.026200,0.009900,0.151900,0.812000
0.025800,0.009800,0.152500,0.811900
0.024200,0.009900,0.154250,0.811650
0.023700,0.009950,0.156200,0.810150
0.023800,0.009750,0.157300,0.809150
0.023100,0.010100,0.158700,0.808100
0.022400,0.010800,0.159000,0.807800
0.022700,0.010600,0.161400,0.805300
0.021850,0.010700,0.161100,0.806350
0.021000,0.010350,0.163000,0.805650
0.020900,0.010700,0.164250,0.804150
0.021600,0.009700,0.166700,0.802000
0.020600,0.009050,0.169550,0.800800
0.020700,0.009200,0.170600,0.799500
0.021150,0.008750,0.172900,0.797200
0.020050,0.010150,0.173700,0.796100
0.019750,0.011000,0.174800,0.794450
0.020150,0.010350,0.176150,0.793350
0.019750,0.010800,0.177050,0.792400
0.020450,0.009850,0.179950,0.789750
0.020000,0.009350,0.182350,0.788300
0.019700,0.010050,0.183150,0.787100
0.020250,0.009350,0.184750,0.785650
0.019350,0.009950,0.186600,0.784100
0.019800,0.009700,0.188350,0.782150
0.019250,0.010100,0.190100,0.780550
0.019250,0.010250,0.192050,0.778450
0.019500,0.010350,0.192650,0.777500
0.020200,0.010550,0.194050,0.775200
0.020200,0.010400,0.195650,0.773750
0.019850,0.010800,0.196800,0.772550
0.020250,0.010400,0.199250,0.770100
0.020300,0.010450,0.200450,0.768800
0.020750,0.010850,0.201400,0.767000
0.021150,0.010550,0.202550,0.765750
0.021000,0.010700,0.202450,0.765850
0.021200,0.011000,0.202950,0.764850
0.021900,0.010400,0.203550,0.764150
0.021850,0.010650,0.205250,0.762250
0.021900,0.011450,0.205000,0.761650
0.022300,0.011650,0.205750,0.760300
0.021850,0.012500,0.206150,0.759500
0.023350,0.012200,0.207350,0.757100
0.022950,0.013200,0.208200,0.755650
0.024800,0.011850,0.209150,0.754200
0.024700,0.012950,0.209400,0.752950
0.024550,0.012900,0.210400,0.752150
0.025550,0.012850,0.210950,0.750650
0.025200,0.013700,0.210600,0.750500
0.025600,0.014200,0.210350,0.749850
0.025800,0.013550,0.211250,0.749400
0.026100,0.014150,0.211950,0.747800
0.026700,0.014950,0.212500,0.745850
0.026550,0.014850,0.212800,0.745800
0.027500,0.015800,0.211600,0.745100
0.028850,0.015850,0.211700,0.743600
0.029400,0.015500,0.211500,0.743600
0.029750,0.015500,0.211450,0.743300
0.029750,0.017600,0.210100,0.742550
0.029950,0.016800,0.210400,0.742850
0.030250,0.015850,0.211100,0.742800
0.031250,0.015250,0.210550,0.742950
0.031950,0.016050,0.210050,0.741950
0.032250,0.016550,0.209600,0.741600
0.032150,0.017300,0.209100,0.741450
0.032350,0.018150,0.208350,0.741150
0.033550,0.017850,0.208050,0.740550
0.033650,0.018650,0.206750,0.740950
0.034250,0.020000,0.205750,0.740000
0.034000,0.019600,0.205550,0.740850
0.034850,0.018650,0.205600,0.740900
0.035200,0.018200,0.205250,0.741350
0.035050,0.018150,0.205200,0.741600
0.035150,0.017750,0.204200,0.742900
0.034750,0.017600,0.204600,0.743050
0.035500,0.017250,0.203550,0.743700
0.035300,0.018150,0.203550,0.743000
0.036600,0.018350,0.202900,0.742150
0.037200,0.018900,0.202200,0.741700
0.037850,0.019700,0.201500,0.740950
0.037950,0.020300,0.199200,0.742550
0.038950,0.019450,0.197600,0.744000
0.039500,0.018600,0.196400,0.745500
0.040100,0.019850,0.193750,0.746300
0.041600,0.018700,0.194450,0.745250
0.041150,0.019950,0.193050,0.745850
0.040750,0.020500,0.191850,0.746900
0.041100,0.020350,0.190350,0.748200
0.041350,0.019650,0.189950,0.749050
0.041700,0.019350,0.189750,0.749200
0.041600,0.019750,0.187450,0.751200
0.041150,0.019800,0.186650,0.752400
0.041750,0.019650,0.184850,0.753750
0.041550,0.018750,0.184250,0.755450
0.039950,0.019600,0.182300,0.758150
0.040500,0.019950,0.181650,0.757900
0.040150,0.020000,0.180500,0.759350
0.040150,0.019600,0.181050,0.759200
0.041450,0.019100,0.180900,0.758550
0.041200,0.019550,0.179450,0.759800
0.041600,0.019800,0.178200,0.760400
0.040750,0.020000,0.177900,0.761350
0.041100,0.018850,0.177750,0.762300
0.040850,0.018950,0.176550,0.763650
0.041400,0.018750,0.176650,0.763200
0.041550,0.018750,0.176650,0.763050
0.040850,0.019450,0.175450,0.764250
0.041800,0.017750,0.175300,0.765150
0.040650,0.017950,0.175250,0.766150
0.039500,0.019650,0.174450,0.766400
0.040700,0.017900,0.174500,0.766900
0.039850,0.019100,0.173400,0.767650
0.039950,0.018300,0.173400,0.768350
0.039800,0.019100,0.172650,0.768450
0.039500,0.019500,0.171600,0.769400
0.037850,0.018950,0.172300,0.770900
0.037550,0.018950,0.172700,0.770800
0.039000,0.017800,0.173050,0.770150
0.038500,0.018300,0.172850,0.770350
0.038050,0.018650,0.172600,0.770700
0.037950,0.018100,0.173000,0.770950
0.038750,0.017600,0.173250,0.770400
0.038450,0.017900,0.173250,0.770400
0.038800,0.017350,0.173450,0.770400
0.039350,0.016700,0.173600,0.770350
0.037300,0.017450,0.173600,0.771650
0.036700,0.017700,0.174150,0.771450
0.036250,0.018350,0.173600,0.771800
0.036900,0.017650,0.174600,0.770850
0.037400,0.017450,0.173900,0.771250
0.037300,0.017000,0.174600,0.771100
0.035300,0.016800,0.175650,0.772250
0.035850,0.016500,0.175850,0.771800
0.036000,0.015900,0.176250,0.771850
0.035500,0.016400,0.176750,0.771350
0.035600,0.016750,0.176250,0.771400
0.034400,0.016550,0.176700,0.772350
0.033900,0.016800,0.176550,0.772750
0.034000,0.016500,0.177050,0.772450
0.034300,0.015650,0.178200,0.771850
0.034300,0.014850,0.179850,0.771000
0.033150,0.015450,0.179700,0.771700
0.032650,0.015000,0.180750,0.771600
0.032950,0.015500,0.180000,0.771550
0.032200,0.015050,0.181650,0.771100
0.032700,0.014850,0.181400,0.771050
0.031950,0.015250,0.182000,0.770800
0.031950,0.015300,0.182850,0.769900
0.031900,0.015100,0.182800,0.770200
0.032750,0.015100,0.183300,0.768850
0.032150,0.015450,0.183200,0.769200
0.032900,0.014400,0.183900,0.768800
0.032600,0.015300,0.184900,0.767200
0.032350,0.016050,0.185550,0.766050
0.032000,0.016350,0.186100,0.765550
0.032750,0.016400,0.185950,0.764900
0.033950,0.016350,0.184950,0.764750
0.035350,0.015000,0.186050,0.763600
0.034450,0.015700,0.185150,0.764700
0.034150,0.015350,0.185250,0.765250
0.033700,0.016100,0.185900,0.764300
0.034100,0.016250,0.186750,0.762900
0.033250,0.016050,0.187600,0.763100
0.034000,0.017050,0.187300,0.761650
0.034050,0.017450,0.187400,0.761100
0.033850,0.017950,0.186750,0.761450
0.033900,0.018000,0.186550,0.761550
0.034150,0.018050,0.186000,0.761800
0.034350,0.017150,0.186300,0.762200
0.035550,0.017450,0.185900,0.761100
0.036950,0.016350,0.186100,0.760600
0.036950,0.016350,0.186250,0.760450
0.036800,0.016100,0.185450,0.761650
0.036300,0.015950,0.185350,0.762400
0.035100,0.016800,0.184800,0.763300
0.035650,0.016600,0.184500,0.763250
0.035450,0.016350,0.184400,0.763800
0.036400,0.016250,0.183900,0.763450
0.036050,0.016200,0.184000,0.763750
0.036800,0.017150,0.182600,0.763450
0.038000,0.017150,0.180850,0.764000
0.037150,0.018500,0.180000,0.764350
0.036800,0.019450,0.178300,0.765450
0.037150,0.019700,0.176950,0.766200
0.037300,0.018600,0.178000,0.766100
0.037700,0.017350,0.178850,0.766100
0.037900,0.017350,0.178600,0.766150
0.036450,0.018300,0.178300,0.766950
0.036950,0.017650,0.180050,0.765350
0.037300,0.017850,0.179650,0.765200
0.037800,0.017850,0.180050,0.764300
0.037400,0.018150,0.179500,0.764950
0.037650,0.018850,0.178550,0.764950
0.037750,0.018550,0.177150,0.766550
0.037750,0.017800,0.177500,0.766950
0.037000,0.018950,0.176550,0.767500
0.037550,0.018800,0.175000,0.768650
0.038300,0.018200,0.175500,0.768000
0.038200,0.017550,0.175850,0.768400
0.038050,0.018250,0.175050,0.768650
0.037750,0.018100,0.175600,0.768550
0.038650,0.019000,0.174300,0.768050
0.039000,0.019050,0.172550,0.769400
0.039550,0.018000,0.172600,0.769850
0.039800,0.018350,0.171050,0.770800
0.038150,0.018700,0.170700,0.772450
0.037800,0.017850,0.171450,0.772900
0.038250,0.018100,0.170000,0.773650
0.037150,0.018300,0.169650,0.774900
0.037900,0.017550,0.170600,0.773950
0.037000,0.018150,0.169550,0.775300
0.037450,0.017250,0.169500,0.775800
0.037900,0.016800,0.168850,0.776450
0.036800,0.016800,0.168600,0.777800
0.035400,0.016450,0.169300,0.778850
0.035250,0.016950,0.169350,0.778450
0.035100,0.017150,0.169200,0.778550
0.035250,0.016400,0.170700,0.777650
0.035550,0.016150,0.171600,0.776700
0.035250,0.015950,0.172050,0.776750
0.035600,0.016100,0.172700,0.775600
0.035050,0.016150,0.172000,0.776800
0.035200,0.015950,0.172050,0.776800
0.034600,0.016000,0.172650,0.776750
0.033300,0.016300,0.172500,0.777900
0.032350,0.016050,0.174300,0.777300
0.032900,0.015750,0.174150,0.777200
0.033200,0.015550,0.174750,0.776500
0.032450,0.015800,0.174950,0.776800
0.031300,0.015500,0.174850,0.778350
0.031450,0.014650,0.176750,0.777150
0.031700,0.014200,0.178400,0.775700
0.030900,0.014500,0.178800,0.775800
0.031350,0.014450,0.179650,0.774550
0.032500,0.014250,0.179850,0.773400
0.031950,0.014500,0.180450,0.773100
0.029950,0.015400,0.180500,0.774150
0.029900,0.014900,0.181700,0.773500
0.030750,0.014300,0.182650,0.772300
0.029850,0.014050,0.183000,0.773100
0.029700,0.014350,0.182850,0.773100
0.029900,0.013600,0.183650,0.772850
0.029650,0.013950,0.183500,0.772900
0.029850,0.013250,0.185100,0.771800
0.030200,0.014100,0.184500,0.771200
0.030800,0.014000,0.185550,0.769650
0.031250,0.014700,0.185550,0.768500
0.030800,0.015300,0.185400,0.768500
0.030100,0.015450,0.185450,0.769000
0.030100,0.015450,0.186000,0.768450
0.029300,0.016150,0.185800,0.768750
0.030150,0.016100,0.185800,0.767950
0.031000,0.016050,0.185000,0.767950
0.031050,0.016200,0.185250,0.767500
0.031950,0.015450,0.186550,0.766050
0.033000,0.015700,0.187250,0.764050
0.033250,0.015500,0.187100,0.764150
0.032900,0.014700,0.188250,0.764150
0.032050,0.015450,0.187200,0.765300
0.032600,0.015500,0.187850,0.764050
0.031300,0.016250,0.187350,0.765100
0.032050,0.017400,0.186600,0.763950
0.033350,0.018100,0.186100,0.762450
0.033800,0.017700,0.185700,0.762800
0.034000,0.017400,0.185850,0.762750
0.034750,0.016900,0.184600,0.763750
0.034900,0.017100,0.184350,0.763650
0.034900,0.017050,0.184150,0.763900
0.035600,0.016850,0.183450,0.764100
0.035850,0.016950,0.183150,0.764050
0.036000,0.017550,0.182250,0.764200
0.036150,0.017200,0.182000,0.764650
0.035900,0.018100,0.182500,0.763500
0.036300,0.018250,0.181100,0.764350
0.036450,0.018550,0.179150,0.765850
0.036700,0.018750,0.179150,0.765400
0.037050,0.018550,0.177950,0.766450
0.037600,0.017500,0.178800,0.766100
0.037700,0.017600,0.178300,0.766400
0.037700,0.018400,0.177450,0.766450
0.037750,0.017200,0.177800,0.767250
0.036500,0.018400,0.176050,0.769050
0.036300,0.017950,0.175350,0.770400
0.037000,0.016700,0.175900,0.770400
0.036700,0.017300,0.176250,0.769750
0.036750,0.016500,0.177100,0.769650
0.035500,0.016900,0.176850,0.770750
0.035000,0.016600,0.177200,0.771200
0.035150,0.016750,0.176600,0.771500
0.035500,0.016400,0.177950,0.770150
0.036050,0.016150,0.178750,0.769050
0.035800,0.016650,0.177850,0.769700
0.034950,0.017650,0.177600,0.769800
0.035100,0.016800,0.179800,0.768300
0.034900,0.017600,0.179150,0.768350
0.034900,0.017450,0.179050,0.768600
0.034350,0.018600,0.179900,0.767150
0.034100,0.019600,0.180050,0.766250
0.034650,0.018650,0.180150,0.766550
0.035750,0.018250,0.179950,0.766050
0.035400,0.018350,0.180400,0.765850
0.035100,0.017250,0.181150,0.766500
0.035400,0.017100,0.180500,0.767000
0.034850,0.017150,0.181400,0.766600
0.033900,0.017700,0.182300,0.766100
0.034850,0.017450,0.182050,0.765650
0.034850,0.016700,0.182500,0.765950
0.034800,0.018150,0.181400,0.765650
0.035850,0.018350,0.181100,0.764700
0.037450,0.018250,0.179850,0.764450
0.037300,0.018100,0.178400,0.766200
0.036500,0.017700,0.180300,0.765500
0.037000,0.017950,0.180650,0.764400
0.038050,0.017200,0.180400,0.764350
0.038750,0.017750,0.178400,0.765100
0.037900,0.017750,0.177950,0.766400
0.038500,0.017050,0.177950,0.766500
0.038300,0.018200,0.176850,0.766650
0.038300,0.018200,0.176950,0.766550
0.038000,0.018550,0.176300,0.767150
0.037950,0.017600,0.177050,0.767400
0.038600,0.017600,0.176550,0.767250
0.038700,0.017450,0.175850,0.768000
0.038000,0.018100,0.174850,0.769050
0.038350,0.017250,0.175950,0.768450
0.037550,0.018400,0.176100,0.767950
0.037400,0.018250,0.175700,0.768650
0.036100,0.019700,0.173900,0.770300
0.035750,0.019950,0.174800,0.769500
0.037250,0.018000,0.174900,0.769850
0.038100,0.016750,0.175800,0.769350
0.037250,0.017100,0.176550,0.769100
0.036200,0.017900,0.176150,0.769750
0.036550,0.017150,0.177100,0.769200
0.035700,0.018500,0.176050,0.769750
0.035500,0.018250,0.176750,0.769500
0.035850,0.018150,0.176800,0.769200
0.035450,0.017950,0.177500,0.769100
0.035300,0.019200,0.177500,0.768000
0.036300,0.017800,0.177900,0.768000
0.035250,0.017750,0.178850,0.768150
0.035300,0.018300,0.179150,0.767250
0.035700,0.019250,0.178700,0.766350
0.036150,0.019100,0.179300,0.765450
0.036250,0.018950,0.179750,0.765050
0.036450,0.019500,0.179250,0.764800
0.037150,0.018850,0.179800,0.764200
0.037850,0.016850,0.180850,0.764450
0.038150,0.016900,0.180650,0.764300
0.038500,0.016600,0.180900,0.764000
0.038500,0.017250,0.179950,0.764300
0.038250,0.017650,0.179100,0.765000
0.038350,0.017850,0.178150,0.765650
0.039300,0.018550,0.177400,0.764750
0.038100,0.018450,0.178250,0.765200
0.037150,0.018150,0.177700,0.767000
0.037300,0.017750,0.177750,0.767200
0.036800,0.017950,0.178300,0.766950
0.037150,0.018450,0.178250,0.766150
0.038900,0.018600,0.178400,0.764100
0.038300,0.017750,0.179500,0.764450
0.037350,0.016850,0.179400,0.766400
0.037400,0.017250,0.179600,0.765750
0.036750,0.017600,0.179100,0.766550
0.036750,0.017900,0.178500,0.766850
0.036600,0.017750,0.179300,0.766350
0.036050,0.018400,0.179600,0.765950
0.035650,0.018100,0.179300,0.766950
0.035150,0.017300,0.179600,0.767950
0.035300,0.017900,0.180450,0.766350
0.036050,0.016950,0.181600,0.765400
0.034850,0.017000,0.182000,0.766150
0.035250,0.016800,0.181900,0.766050
0.035500,0.015900,0.182900,0.765700
0.035450,0.016750,0.182750,0.765050
0.035450,0.016600,0.183850,0.764100
0.035550,0.016950,0.183350,0.764150
0.036450,0.016650,0.183800,0.763100
0.036000,0.017450,0.183800,0.762750
0.036900,0.016950,0.183150,0.763000
0.036650,0.016550,0.182650,0.764150
0.036650,0.017700,0.183050,0.762600
0.036700,0.017450,0.183250,0.762600
0.037100,0.017300,0.183800,0.761800
0.036700,0.017500,0.183850,0.761950
0.036550,0.017200,0.184350,0.761900
0.036550,0.017750,0.183650,0.762050
0.037050,0.017550,0.182750,0.762650
0.037000,0.018600,0.181950,0.762450
0.036750,0.017500,0.183450,0.762300
0.035650,0.018250,0.183200,0.762900
0.035850,0.018150,0.183800,0.762200
0.035400,0.017800,0.183500,0.763300
0.035100,0.016800,0.184100,0.764000
0.036350,0.017450,0.183500,0.762700
0.036250,0.016650,0.184700,0.762400
0.034950,0.016950,0.184950,0.763150
0.034800,0.017200,0.185250,0.762750
0.035100,0.018000,0.184450,0.762450
0.035350,0.018850,0.184200,0.761600
0.036500,0.018100,0.184850,0.760550
0.036350,0.017350,0.184000,0.762300
0.035450,0.016650,0.185600,0.762300
0.036000,0.016350,0.185500,0.762150
0.035150,0.016050,0.186150,0.762650
0.036150,0.015500,0.186300,0.762050
0.035450,0.016250,0.185900,0.762400
0.035300,0.015750,0.186750,0.762200
0.035200,0.017150,0.186950,0.760700
0.035100,0.017300,0.187300,0.760300
0.034750,0.017550,0.186800,0.760900
0.033950,0.018250,0.187100,0.760700
0.035100,0.017900,0.186700,0.760300
0.034300,0.018800,0.186850,0.760050
0.035400,0.018750,0.186600,0.759250
0.035900,0.018900,0.185900,0.759300
0.036950,0.017550,0.185750,0.759750
0.036900,0.018150,0.185250,0.759700
0.037050,0.018850,0.183400,0.760700
0.037600,0.018500,0.182950,0.760950
0.038050,0.018550,0.182600,0.760800
0.038750,0.018650,0.182400,0.760200
0.039900,0.018800,0.181750,0.759550
0.040300,0.018650,0.180500,0.760550
0.040100,0.019000,0.179900,0.761000
0.038750,0.020050,0.178900,0.762300
0.039300,0.020800,0.177050,0.762850
0.039450,0.021200,0.176000,0.763350
0.040200,0.020450,0.175650,0.763700
0.038550,0.020300,0.176600,0.764550
0.038650,0.019850,0.176150,0.765350
0.039300,0.019100,0.176100,0.765500
0.039400,0.019550,0.175450,0.765600
0.040250,0.018600,0.174350,0.766800
0.040650,0.018100,0.173850,0.767400
0.040850,0.018250,0.173700,0.767200
0.040700,0.018700,0.172500,0.768100
0.040950,0.017150,0.173550,0.768350
0.038750,0.018900,0.172200,0.770150
0.037650,0.018350,0.173850,0.770150
0.037850,0.018200,0.174000,0.769950
0.038250,0.017850,0.174450,0.769450
0.038700,0.018050,0.173650,0.769600
0.037900,0.017850,0.173700,0.770550
0.037850,0.017900,0.173800,0.770450
0.037550,0.017800,0.173400,0.771250
0.038300,0.017350,0.172650,0.771700
0.038050,0.018000,0.172850,0.771100
0.038700,0.016850,0.173100,0.771350
0.037400,0.018300,0.171850,0.772450
0.038150,0.018250,0.171000,0.772600
0.038600,0.018050,0.170850,0.772500
0.038450,0.018100,0.169950,0.773500
0.038550,0.017300,0.170700,0.773450
0.038050,0.018000,0.170000,0.773950
0.037350,0.017950,0.169750,0.774950
0.036950,0.018450,0.170500,0.774100
0.035800,0.018500,0.169850,0.775850
0.035700,0.018650,0.169200,0.776450
0.036150,0.018700,0.168200,0.776950
0.036050,0.018250,0.168350,0.777350
0.037150,0.018300,0.167900,0.776650
0.037250,0.017900,0.167200,0.777650
0.035750,0.017500,0.168050,0.778700
0.035900,0.017800,0.168300,0.778000
