I,E,S,R
0.001000,0.000750,0.998250,0.000000
0.001300,0.001350,0.997350,0.000000
0.001600,0.001950,0.996300,0.000150
0.002050,0.003300,0.994350,0.000300
0.002750,0.004300,0.992350,0.000600
0.003800,0.005450,0.989900,0.000850
0.005150,0.007450,0.986000,0.001400
0.006700,0.010300,0.980800,0.002200
0.008850,0.012800,0.975250,0.003100
0.010800,0.017600,0.967450,0.004150
0.014700,0.022200,0.957700,0.005400
0.018450,0.028500,0.945600,0.007450
0.024350,0.036500,0.928850,0.010300
0.032250,0.047350,0.907450,0.012950
0.040400,0.061250,0.881150,0.017200
0.052550,0.073350,0.850950,0.023150
0.067700,0.090550,0.811750,0.030000
0.084200,0.112450,0.764400,0.038950
0.103750,0.136550,0.708650,0.051050
0.128250,0.160300,0.645600,0.065850
0.157150,0.182850,0.576250,0.083750
0.189950,0.202200,0.504350,0.103500
0.220550,0.220400,0.430250,0.128800
0.251900,0.232800,0.356700,0.158600
0.287700,0.236650,0.285000,0.190650
0.317450,0.230850,0.224000,0.227700
0.340550,0.214350,0.175200,0.269900
0.356850,0.197100,0.132850,0.313200
0.363550,0.176050,0.100050,0.360350
0.362750,0.149800,0.077850,0.409600
0.358250,0.125050,0.060200,0.456500
0.345800,0.105150,0.047400,0.501650
0.325850,0.088800,0.037650,0.547700
0.305250,0.071500,0.030950,0.592300
0.284150,0.057400,0.025600,0.632850
0.263900,0.044500,0.023450,0.668150
0.240400,0.035100,0.022300,0.702200
0.217800,0.028800,0.021400,0.732000
0.195800,0.023350,0.020100,0.760750
0.177900,0.019150,0.019650,0.783300
0.159750,0.015550,0.020400,0.804300
0.141950,0.014850,0.018450,0.824750
0.127600,0.012500,0.019050,0.840850
0.114800,0.010300,0.020850,0.854050
0.102250,0.008950,0.022150,0.866650
0.093150,0.007550,0.023150,0.876150
0.082950,0.005850,0.025200,0.886000
0.074300,0.005100,0.027100,0.893500
0.065150,0.004000,0.029950,0.900900
0.057800,0.004500,0.031550,0.906150
0.050750,0.004250,0.033950,0.911050
0.045250,0.004250,0.036000,0.914500
0.040300,0.004350,0.038700,0.916650
0.035000,0.004400,0.040500,0.920100
0.031850,0.003850,0.043050,0.921250
0.027800,0.003600,0.045600,0.923000
0.025800,0.003200,0.049000,0.922000
0.022900,0.003400,0.051700,0.922000
0.020650,0.003150,0.053750,0.922450
0.018750,0.002550,0.056350,0.922350
0.016650,0.002850,0.058750,0.921750
0.014000,0.002650,0.061550,0.921800
0.012800,0.002450,0.064300,0.920450
0.011700,0.002200,0.067450,0.918650
0.010800,0.002200,0.070400,0.916600
0.010200,0.002350,0.073100,0.914350
0.010000,0.001750,0.076250,0.912000
0.009050,0.001750,0.078400,0.910800
0.007800,0.002050,0.081000,0.909150
0.007500,0.001600,0.083650,0.907250
0.006650,0.001750,0.085950,0.905650
0.005900,0.001550,0.088850,0.903700
0.005550,0.000950,0.091700,0.901800
0.005300,0.001000,0.094000,0.899700
0.004500,0.001300,0.096000,0.898200
0.004000,0.001050,0.098900,0.896050
0.003850,0.001050,0.101500,0.893600
0.003650,0.001000,0.104300,0.891050
0.003400,0.000950,0.107250,0.888400
0.003050,0.000750,0.109800,0.886400
0.002900,0.000950,0.112350,0.883800
0.002900,0.000900,0.114550,0.881650
0.002700,0.000850,0.117100,0.879350
0.002550,0.001050,0.119800,0.876600
0.002650,0.001000,0.121700,0.874650
0.002550,0.000800,0.124200,0.872450
0.002400,0.000700,0.126800,0.870100
0.001950,0.000700,0.129500,0.867850
0.002050,0.000650,0.132000,0.865300
0.001850,0.000700,0.134550,0.862900
0.001950,0.000500,0.136900,0.860650
0.001800,0.000600,0.138950,0.858650
0.001750,0.000550,0.141500,0.856200
0.001850,0.000700,0.144200,0.853250
0.001800,0.000750,0.146800,0.850650
0.001750,0.000850,0.148600,0.848800
0.001450,0.001300,0.150850,0.846400
0.001400,0.001550,0.152850,0.844200
0.001550,0.001400,0.155100,0.841950
0.001750,0.001100,0.157750,0.839400
0.001700,0.001050,0.159250,0.838000
0.001850,0.000950,0.161850,0.835350
0.001750,0.001050,0.164150,0.833050
0.001750,0.000950,0.166200,0.831100
0.001950,0.000650,0.168650,0.828750
0.002000,0.000600,0.171300,0.826100
0.001850,0.000700,0.173300,0.824150
0.001850,0.000700,0.175450,0.822000
0.001750,0.000800,0.177050,0.820400
0.001800,0.000900,0.179100,0.818200
0.001500,0.001050,0.181250,0.816200
0.001450,0.001050,0.183250,0.814250
0.001450,0.001000,0.185550,0.812000
0.001350,0.001050,0.188550,0.809050
0.001350,0.001150,0.190650,0.806850
0.001250,0.001100,0.193400,0.804250
0.001500,0.000750,0.195900,0.801850
0.001500,0.000950,0.198100,0.799450
0.001600,0.000800,0.200100,0.797500
0.001550,0.000900,0.201950,0.795600
0.001550,0.001100,0.204550,0.792800
0.001850,0.001100,0.206300,0.790750
0.002000,0.001150,0.208050,0.788800
0.002050,0.001100,0.209750,0.787100
0.001950,0.001250,0.211300,0.785500
0.002100,0.001150,0.213750,0.783000
0.002100,0.000900,0.216100,0.780900
0.002200,0.001100,0.217200,0.779500
0.002050,0.001600,0.218450,0.777900
0.002200,0.001500,0.220500,0.775800
0.002300,0.001350,0.222600,0.773750
0.002550,0.001050,0.224650,0.771750
0.002600,0.001150,0.226600,0.769650
0.002600,0.001450,0.228500,0.767450
0.002600,0.001500,0.230050,0.765850
0.002750,0.001550,0.232500,0.763200
0.002700,0.001750,0.234350,0.761200
0.002700,0.001800,0.235700,0.759800
0.002900,0.002000,0.237000,0.758100
0.003350,0.002250,0.238250,0.756150
0.003700,0.002100,0.239550,0.754650
0.003950,0.001900,0.240850,0.753300
0.004300,0.001800,0.242200,0.751700
0.004500,0.002250,0.243950,0.749300
0.004500,0.002350,0.245800,0.747350
0.004950,0.002500,0.246800,0.745750
0.004900,0.002650,0.248200,0.744250
0.005100,0.002800,0.248750,0.743350
0.005150,0.003050,0.250400,0.741400
0.004750,0.003400,0.251400,0.740450
0.004650,0.003800,0.252750,0.738800
0.004800,0.003300,0.254250,0.737650
0.004650,0.003450,0.256000,0.735900
0.005450,0.002900,0.257850,0.733800
0.005700,0.003250,0.259400,0.731650
0.005850,0.003750,0.260300,0.730100
0.006100,0.003950,0.261750,0.728200
0.006700,0.004150,0.263250,0.725900
0.007200,0.004000,0.264400,0.724400
0.007600,0.004650,0.264750,0.723000
0.007700,0.005000,0.264350,0.722950
0.007800,0.005100,0.265250,0.721850
0.008450,0.005200,0.265350,0.721000
0.008900,0.005000,0.265850,0.720250
0.009100,0.005300,0.267000,0.718600
0.009100,0.006200,0.267150,0.717550
0.009750,0.006800,0.267150,0.716300
0.011200,0.006250,0.267550,0.715000
0.010450,0.007200,0.267200,0.715150
0.011400,0.007150,0.267550,0.713900
0.011400,0.007350,0.267550,0.713700
0.012350,0.007050,0.267750,0.712850
0.013200,0.007500,0.267600,0.711700
0.013600,0.007350,0.267450,0.711600
0.014300,0.007800,0.267000,0.710900
0.014250,0.007700,0.266750,0.711300
0.013850,0.008700,0.266050,0.711400
0.014700,0.008900,0.265450,0.710950
0.015100,0.009350,0.263750,0.711800
0.015900,0.009650,0.262900,0.711550
0.016350,0.009650,0.263400,0.710600
0.017600,0.009550,0.263150,0.709700
0.018400,0.009150,0.262950,0.709500
0.018850,0.009700,0.261850,0.709600
0.019600,0.010600,0.259900,0.709900
0.019450,0.011600,0.258550,0.710400
0.020200,0.012250,0.257100,0.710450
0.020600,0.012500,0.255900,0.711000
0.021550,0.012900,0.254100,0.711450
0.022350,0.013050,0.252650,0.711950
0.024000,0.012350,0.251100,0.712550
0.023200,0.014200,0.248400,0.714200
0.023450,0.015500,0.246100,0.714950
0.024850,0.015700,0.243400,0.716050
0.026700,0.015750,0.241050,0.716500
0.027950,0.015250,0.239350,0.717450
0.028850,0.016500,0.235650,0.719000
0.029600,0.017600,0.232000,0.720800
0.030200,0.018000,0.229800,0.722000
0.031450,0.018150,0.226800,0.723600
0.032500,0.017400,0.224900,0.725200
0.033000,0.018050,0.221550,0.727400
0.033550,0.017700,0.219150,0.729600
0.034600,0.018900,0.215600,0.730900
0.035000,0.019800,0.212650,0.732550
0.035450,0.020350,0.209900,0.734300
0.035250,0.020450,0.207700,0.736600
0.037000,0.020000,0.205200,0.737800
0.038250,0.018700,0.203250,0.739800
0.037850,0.019950,0.200050,0.742150
0.037700,0.020550,0.197550,0.744200
0.037600,0.021600,0.194600,0.746200
0.038200,0.021700,0.191350,0.748750
0.038650,0.019600,0.190200,0.751550
0.038150,0.020250,0.187450,0.754150
0.038300,0.019400,0.185750,0.756550
0.037600,0.020250,0.183550,0.758600
0.038200,0.020250,0.182000,0.759550
0.038650,0.019800,0.180400,0.761150
0.038150,0.020050,0.177900,0.763900
0.038800,0.019200,0.176550,0.765450
0.037550,0.019650,0.174700,0.768100
0.037900,0.019250,0.172800,0.770050
0.038500,0.017700,0.171750,0.772050
0.039000,0.017800,0.170200,0.773000
0.038350,0.018600,0.168000,0.775050
0.037150,0.019300,0.165400,0.778150
0.037650,0.018700,0.164650,0.779000
0.039500,0.017000,0.163550,0.779950
0.038200,0.017250,0.163150,0.781400
0.037650,0.017700,0.162050,0.782600
0.036550,0.018200,0.160300,0.784950
0.037500,0.017250,0.159250,0.786000
0.036750,0.016850,0.158400,0.788000
0.036450,0.016050,0.157750,0.789750
0.037050,0.015000,0.157050,0.790900
0.035100,0.015550,0.155800,0.793550
0.034500,0.015250,0.155550,0.794700
0.034200,0.014800,0.155250,0.795750
0.034450,0.013000,0.155800,0.796750
0.033400,0.013000,0.156200,0.797400
0.033400,0.013200,0.155950,0.797450
0.032950,0.013450,0.156750,0.796850
0.032900,0.013550,0.156800,0.796750
0.031700,0.014600,0.156550,0.797150
0.030900,0.014300,0.157350,0.797450
0.030250,0.014100,0.157750,0.797900
0.030150,0.013200,0.159350,0.797300
0.029750,0.013150,0.160400,0.796700
0.029150,0.013350,0.160900,0.796600
0.027350,0.013700,0.161250,0.797700
0.027750,0.012850,0.162350,0.797050
0.026950,0.012950,0.163100,0.797000
0.026800,0.012000,0.164700,0.796500
0.026050,0.012200,0.165950,0.795800
0.026250,0.011950,0.166550,0.795250
0.026100,0.011000,0.168450,0.794450
0.025450,0.011450,0.168600,0.794500
0.026150,0.010850,0.169600,0.793400
0.026000,0.011250,0.170200,0.792550
0.025700,0.011950,0.170550,0.791800
0.025550,0.012450,0.171350,0.790650
0.025350,0.012100,0.172350,0.790200
0.025900,0.011900,0.172350,0.789850
0.025200,0.012200,0.173550,0.789050
0.025450,0.011600,0.174750,0.788200
0.025000,0.012350,0.175350,0.787300
0.025100,0.012350,0.174800,0.787750
0.025750,0.011300,0.176800,0.786150
0.024900,0.011050,0.177900,0.786150
0.024850,0.010700,0.179200,0.785250
0.024200,0.011250,0.180600,0.783950
0.023200,0.011550,0.181550,0.783700
0.023150,0.012650,0.182400,0.781800
0.024050,0.012150,0.181650,0.782150
0.023800,0.011600,0.182600,0.782000
0.023350,0.011650,0.183600,0.781400
0.023250,0.012400,0.183850,0.780500
0.023200,0.012700,0.185300,0.778800
0.024350,0.012150,0.185250,0.778250
0.023650,0.012550,0.186700,0.777100
0.023000,0.012800,0.188150,0.776050
0.023450,0.012050,0.190550,0.773950
0.024550,0.011200,0.191300,0.772950
0.024500,0.011600,0.192350,0.771550
0.024450,0.012250,0.191850,0.771450
0.023500,0.012400,0.193400,0.770700
0.023850,0.011950,0.194050,0.770150
0.024100,0.012700,0.194700,0.768500
0.024250,0.012200,0.195400,0.768150
0.023650,0.012600,0.196050,0.767700
0.024000,0.012250,0.196350,0.767400
0.024000,0.011950,0.197550,0.766500
0.023700,0.012700,0.196500,0.767100
0.024700,0.011550,0.197950,0.765800
0.025200,0.011500,0.199500,0.763800
0.024600,0.012650,0.199250,0.763500
0.024700,0.013400,0.198750,0.763150
0.025450,0.013000,0.198900,0.762650
0.026400,0.012850,0.198700,0.762050
0.025750,0.013900,0.199000,0.761350
0.026800,0.013550,0.199500,0.760150
0.026950,0.013000,0.200750,0.759300
0.027200,0.013000,0.201050,0.758750
0.027500,0.013050,0.200950,0.758500
0.027600,0.013550,0.201750,0.757100
0.027450,0.014000,0.201700,0.756850
0.028350,0.014600,0.200950,0.756100
0.028550,0.015000,0.200600,0.755850
0.029150,0.014550,0.200600,0.755700
0.028850,0.015200,0.200650,0.755300
0.029200,0.015100,0.200350,0.755350
0.030450,0.014900,0.200400,0.754250
0.031150,0.016250,0.198650,0.753950
0.031300,0.017050,0.197600,0.754050
0.032150,0.016900,0.196600,0.754350
0.032450,0.016400,0.197350,0.753800
0.032300,0.016850,0.196250,0.754600
0.032500,0.017450,0.195950,0.754100
0.033450,0.016150,0.197000,0.753400
0.033150,0.016450,0.197100,0.753300
0.034350,0.015300,0.197750,0.752600
0.034100,0.015950,0.197550,0.752400
0.033800,0.016900,0.196300,0.753000
0.033950,0.017550,0.195500,0.753000
0.033550,0.018050,0.194300,0.754100
0.033600,0.018450,0.192850,0.755100
0.033550,0.018750,0.192000,0.755700
0.034350,0.018250,0.193050,0.754350
0.035750,0.018150,0.192550,0.753550
0.036200,0.017700,0.191650,0.754450
0.035400,0.017950,0.192100,0.754550
0.036100,0.018000,0.190700,0.755200
0.035950,0.017900,0.190450,0.755700
0.037000,0.018400,0.188500,0.756100
0.036950,0.018700,0.187750,0.756600
0.038100,0.018250,0.186750,0.756900
0.037750,0.019150,0.185750,0.757350
0.038050,0.018850,0.185150,0.757950
0.037800,0.019500,0.184150,0.758550
0.039400,0.018750,0.182850,0.759000
0.039300,0.019350,0.181050,0.760300
0.039550,0.018850,0.180800,0.760800
0.039250,0.019250,0.179900,0.761600
0.039950,0.018550,0.179250,0.762250
0.038800,0.019700,0.177850,0.763650
0.038950,0.019900,0.176850,0.764300
0.039300,0.019600,0.175400,0.765700
0.040200,0.018800,0.176100,0.764900
0.040300,0.019450,0.175050,0.765200
0.040500,0.019900,0.173250,0.766350
0.040850,0.019150,0.172750,0.767250
0.040800,0.017650,0.173100,0.768450
0.038700,0.017300,0.172600,0.771400
0.038200,0.017350,0.172500,0.771950
0.036850,0.018750,0.171800,0.772600
0.037550,0.017750,0.173100,0.771600
0.037150,0.016950,0.173500,0.772400
0.036300,0.017500,0.173500,0.772700
0.036100,0.017350,0.172550,0.774000
0.036800,0.016950,0.173300,0.772950
0.038250,0.016550,0.172250,0.772950
0.038500,0.015100,0.173400,0.773000
0.036950,0.016200,0.173100,0.773750
0.036100,0.016300,0.173150,0.774450
0.035500,0.016650,0.173850,0.774000
0.035450,0.016350,0.174650,0.773550
0.035650,0.016300,0.174750,0.773300
0.036100,0.015250,0.174450,0.774200
0.035450,0.015650,0.174150,0.774750
0.033600,0.015700,0.175050,0.775650
0.033400,0.015900,0.174900,0.775800
0.034200,0.016350,0.176400,0.773050
0.033850,0.017050,0.175450,0.773650
0.034250,0.016450,0.175550,0.773750
0.033400,0.015850,0.176700,0.774050
0.032650,0.015500,0.177350,0.774500
0.032950,0.016950,0.175300,0.774800
0.033250,0.016850,0.175100,0.774800
0.033150,0.016400,0.176050,0.774400
0.032950,0.016500,0.176250,0.774300
0.032050,0.016350,0.176200,0.775400
0.032250,0.015350,0.176850,0.775550
0.032250,0.015050,0.176500,0.776200
0.031250,0.016500,0.176350,0.775900
0.031300,0.016100,0.176350,0.776250
0.031200,0.015850,0.176400,0.776550
0.032450,0.015550,0.176850,0.775150
0.032650,0.015850,0.177200,0.774300
0.033300,0.014400,0.177800,0.774500
0.032900,0.014500,0.178300,0.774300
0.032100,0.014400,0.178850,0.774650
0.032800,0.015050,0.178400,0.773750
0.032450,0.016350,0.178550,0.772650
0.031950,0.016450,0.179200,0.772400
0.031950,0.016300,0.178800,0.772950
0.032000,0.016950,0.178650,0.772400
0.032450,0.016750,0.178550,0.772250
0.033400,0.016200,0.178800,0.771600
0.032600,0.016950,0.179000,0.771450
0.033400,0.016600,0.179650,0.770350
0.033650,0.016350,0.179700,0.770300
0.033500,0.015950,0.178800,0.771750
0.033800,0.016900,0.177750,0.771550
0.033900,0.016800,0.176700,0.772600
0.033600,0.016200,0.178050,0.772150
0.034000,0.015500,0.179150,0.771350
0.033700,0.015050,0.179500,0.771750
0.033750,0.015400,0.180050,0.770800
0.032550,0.014700,0.180750,0.772000
0.032700,0.015950,0.179700,0.771650
0.033100,0.015700,0.180400,0.770800
0.033150,0.014900,0.181050,0.770900
0.032600,0.015650,0.180800,0.770950
0.032400,0.016800,0.181000,0.769800
0.033050,0.015050,0.182200,0.769700
0.032900,0.015100,0.183800,0.768200
0.032000,0.015900,0.183400,0.768700
0.032000,0.015350,0.184650,0.768000
0.032050,0.015700,0.184850,0.767400
0.031500,0.015750,0.185850,0.766900
0.031550,0.014650,0.187600,0.766200
0.031300,0.014750,0.187800,0.766150
0.029950,0.015950,0.187050,0.767050
0.029350,0.016200,0.187650,0.766800
0.029400,0.016050,0.187800,0.766750
0.030650,0.015700,0.188400,0.765250
0.030450,0.016750,0.189100,0.763700
0.032050,0.017300,0.189050,0.761600
0.032450,0.017100,0.187900,0.762550
0.033150,0.016500,0.188550,0.761800
0.033650,0.017250,0.187650,0.761450
0.033950,0.017100,0.187450,0.761500
0.034250,0.016950,0.186900,0.761900
0.034600,0.016700,0.186800,0.761900
0.035100,0.017100,0.186850,0.760950
0.034600,0.017100,0.187400,0.760900
0.033900,0.018050,0.187050,0.761000
0.033900,0.017700,0.187250,0.761150
0.034950,0.017350,0.187200,0.760500
0.035250,0.017600,0.186400,0.760750
0.035700,0.017750,0.185150,0.761400
0.035250,0.018650,0.183750,0.762350
0.035200,0.019050,0.183950,0.761800
0.036450,0.017450,0.183300,0.762800
0.036400,0.017650,0.182950,0.763000
0.036000,0.017300,0.182650,0.764050
0.034850,0.018100,0.182250,0.764800
0.034600,0.018200,0.181700,0.765500
0.035650,0.017000,0.182100,0.765250
0.035800,0.016650,0.181400,0.766150
0.035050,0.016750,0.180450,0.767750
0.034800,0.016850,0.180050,0.768300
0.034700,0.016150,0.180200,0.768950
0.035300,0.015200,0.180400,0.769100
0.035050,0.016400,0.180050,0.768500
0.034500,0.016250,0.180900,0.768350
0.035050,0.016800,0.180200,0.767950
0.034850,0.016150,0.180700,0.768300
0.035250,0.015550,0.180000,0.769200
0.035100,0.015500,0.180100,0.769300
0.034600,0.015500,0.181450,0.768450
0.034150,0.015500,0.180800,0.769550
0.033600,0.015200,0.181000,0.770200
0.033250,0.015950,0.181700,0.769100
0.034250,0.015900,0.181650,0.768200
0.033200,0.016300,0.181600,0.768900
0.033400,0.016400,0.182400,0.767800
0.033550,0.015750,0.183000,0.767700
0.033050,0.016550,0.182500,0.767900
0.033050,0.016250,0.184200,0.766500
0.032800,0.016900,0.184600,0.765700
0.033550,0.016400,0.184500,0.765550
0.033900,0.016300,0.183800,0.766000
0.033900,0.017400,0.182550,0.766150
0.033450,0.017250,0.182400,0.766900
0.033250,0.017550,0.182550,0.766650
0.033250,0.017650,0.183300,0.765800
0.033700,0.017300,0.182800,0.766200
0.033600,0.017700,0.182600,0.766100
0.034950,0.017100,0.182550,0.765400
0.035200,0.017150,0.182450,0.765200
0.035050,0.016700,0.183550,0.764700
0.035400,0.016150,0.183850,0.764600
0.034500,0.017250,0.182700,0.765550
0.035700,0.016450,0.181800,0.766050
0.035950,0.017450,0.181050,0.765550
0.035400,0.017150,0.181200,0.766250
0.036000,0.016150,0.181800,0.766050
0.035100,0.016650,0.182000,0.766250
0.034400,0.016350,0.181950,0.767300
0.034650,0.016350,0.182400,0.766600
0.034550,0.015900,0.183300,0.766250
0.034200,0.016950,0.181900,0.766950
0.035000,0.015800,0.180900,0.768300
0.034700,0.016400,0.181800,0.767100
0.034000,0.017750,0.181400,0.766850
0.032400,0.017650,0.181650,0.768300
0.032650,0.016300,0.182750,0.768300
0.034200,0.015350,0.184300,0.766150
0.034750,0.016100,0.183650,0.765500
0.034600,0.016750,0.182400,0.766250
0.034700,0.017450,0.181950,0.765900
0.033800,0.017400,0.183150,0.765650
0.033900,0.016250,0.184850,0.765000
0.033450,0.017000,0.184400,0.765150
0.033450,0.017050,0.185100,0.764400
0.033100,0.016750,0.184900,0.765250
0.032900,0.016050,0.185350,0.765700
0.032300,0.017450,0.185150,0.765100
0.033350,0.017000,0.184100,0.765550
0.034400,0.018250,0.182800,0.764550
0.034350,0.017700,0.181800,0.766150
0.033750,0.018500,0.181350,0.766400
0.033900,0.018300,0.181850,0.765950
0.034250,0.017500,0.182000,0.766250
0.034300,0.018100,0.181800,0.765800
0.035450,0.017450,0.182250,0.764850
0.035250,0.017950,0.181950,0.764850
0.036050,0.017400,0.182150,0.764400
0.036300,0.018800,0.180300,0.764600
0.036850,0.018250,0.180800,0.764100
0.037050,0.018200,0.180000,0.764750
0.037600,0.018750,0.179850,0.763800
0.036550,0.020300,0.178600,0.764550
0.036800,0.020500,0.176900,0.765800
0.038650,0.019050,0.176200,0.766100
0.038500,0.018450,0.176300,0.766750
0.039000,0.017900,0.176200,0.766900
0.038850,0.018500,0.175200,0.767450
0.038100,0.019450,0.174200,0.768250
0.037300,0.019400,0.173700,0.769600
0.038850,0.017400,0.173600,0.770150
0.038200,0.018650,0.172450,0.770700
0.037000,0.019650,0.171350,0.772000
0.037950,0.018500,0.171200,0.772350
0.038750,0.018200,0.171050,0.772000
0.037950,0.018600,0.171200,0.772250
0.037450,0.018750,0.172800,0.771000
0.038150,0.018750,0.171350,0.771750
0.037300,0.019000,0.170450,0.773250
0.036600,0.019750,0.169400,0.774250
0.037400,0.019100,0.168850,0.774650
0.038200,0.017550,0.169950,0.774300
0.037800,0.017700,0.170650,0.773850
0.037500,0.018050,0.170350,0.774100
0.038300,0.018150,0.169650,0.773900
0.038950,0.017700,0.168950,0.774400
0.037350,0.018500,0.168700,0.775450
0.036900,0.017650,0.169600,0.775850
0.037200,0.016900,0.169500,0.776400
0.037250,0.016300,0.169300,0.777150
0.036500,0.015550,0.170650,0.777300
0.035500,0.014900,0.172000,0.777600
0.034800,0.015500,0.172600,0.777100
0.035150,0.015200,0.172750,0.776900
0.035250,0.013900,0.174150,0.776700
0.033950,0.013600,0.176300,0.776150
0.033700,0.014000,0.176050,0.776250
0.032400,0.014400,0.176550,0.776650
0.032600,0.014650,0.177350,0.775400
0.032150,0.013850,0.178200,0.775800
0.032850,0.015050,0.179400,0.772700
0.033650,0.014100,0.180250,0.772000
0.032100,0.014100,0.181900,0.771900
0.031400,0.014500,0.182300,0.771800
0.030150,0.016500,0.181050,0.772300
0.030500,0.016150,0.180950,0.772400
0.030250,0.015550,0.181350,0.772850
0.030550,0.015600,0.182000,0.771850
0.030100,0.016150,0.183000,0.770750
0.030250,0.015950,0.184850,0.768950
0.029700,0.016750,0.185050,0.768500
0.030350,0.016600,0.184850,0.768200
0.030800,0.016550,0.185450,0.767200
0.031350,0.016200,0.186250,0.766200
0.031400,0.015750,0.186950,0.765900
0.032100,0.015200,0.186950,0.765750
0.032200,0.014500,0.187200,0.766100
0.032350,0.014650,0.187150,0.765850
0.031550,0.015150,0.188500,0.764800
0.032150,0.014850,0.187950,0.765050
0.032150,0.015350,0.188600,0.763900
0.031900,0.015900,0.189000,0.763200
0.031600,0.015650,0.188650,0.764100
0.031600,0.015150,0.188900,0.764350
0.032250,0.015200,0.189050,0.763500
0.031850,0.015150,0.189450,0.763550
0.031150,0.014800,0.190050,0.764000
0.030800,0.014300,0.191050,0.763850
0.030850,0.014650,0.190900,0.763600
0.030350,0.014500,0.191500,0.763650
0.030950,0.013100,0.194150,0.761800
0.030750,0.013200,0.193900,0.762150
0.030350,0.014650,0.194250,0.760750
0.030750,0.013750,0.195550,0.759950
0.030300,0.013700,0.196700,0.759300
0.029700,0.015350,0.196300,0.758650
0.029500,0.015350,0.198300,0.756850
0.028950,0.016300,0.198300,0.756450
0.028600,0.016200,0.198700,0.756500
0.029750,0.015900,0.198200,0.756150
0.029900,0.015650,0.197700,0.756750
0.030850,0.015800,0.197700,0.755650
0.031200,0.016950,0.197300,0.754550
0.032550,0.016050,0.197800,0.753600
0.033000,0.016000,0.197350,0.753650
0.033400,0.016500,0.196800,0.753300
0.033100,0.016100,0.197900,0.752900
0.033550,0.016650,0.196850,0.752950
0.033750,0.016200,0.196850,0.753200
0.033750,0.016800,0.195600,0.753850
0.034750,0.016750,0.195350,0.753150
0.035500,0.016600,0.195350,0.752550
0.034600,0.017650,0.195000,0.752750
0.034700,0.018100,0.194650,0.752550
0.035650,0.018000,0.193750,0.752600
0.036300,0.018350,0.192150,0.753200
0.037450,0.018600,0.191250,0.752700
0.037400,0.019050,0.191150,0.752400
0.037200,0.019150,0.190450,0.753200
0.037950,0.019400,0.189050,0.753600
0.039150,0.020250,0.187500,0.753100
0.039800,0.020050,0.186300,0.753850
0.039150,0.020650,0.185350,0.754850
0.040150,0.021150,0.184650,0.754050
0.039550,0.021250,0.184000,0.755200
0.040200,0.021050,0.182450,0.756300
0.040900,0.021000,0.181250,0.756850
0.041150,0.020300,0.180950,0.757600
0.040300,0.020700,0.181950,0.757050
0.041150,0.020400,0.181650,0.756800
0.041300,0.020400,0.180950,0.757350
0.041700,0.019600,0.180450,0.758250
0.042200,0.018850,0.178950,0.760000
0.041250,0.018700,0.178650,0.761400
0.040800,0.019300,0.177150,0.762750
0.040650,0.019450,0.177150,0.762750
0.041000,0.020250,0.175800,0.762950
0.040950,0.019350,0.175300,0.764400
0.040900,0.018950,0.175550,0.764600
0.040950,0.017900,0.174750,0.766400
0.041700,0.016750,0.175200,0.766350
0.040300,0.017350,0.174150,0.768200
0.039200,0.018150,0.173500,0.769150
0.038600,0.018200,0.174100,0.769100
0.037100,0.018100,0.173700,0.771100
0.036450,0.018350,0.173500,0.771700
0.037300,0.017500,0.174000,0.771200
0.036600,0.018150,0.174350,0.770900
0.037000,0.018300,0.174500,0.770200
0.038050,0.016250,0.176250,0.769450
0.036800,0.017700,0.174550,0.770950
0.037650,0.017700,0.173600,0.771050
0.038400,0.018000,0.173550,0.770050
0.038050,0.018550,0.173100,0.770300
0.038450,0.018500,0.172700,0.770350
0.038250,0.016950,0.173900,0.770900
0.037400,0.017150,0.174250,0.771200
0.037250,0.017750,0.173300,0.771700
0.037700,0.016950,0.173400,0.771950
0.036350,0.016750,0.174050,0.772850
0.034900,0.016250,0.174500,0.774350
0.034700,0.015550,0.175150,0.774600
0.033600,0.014950,0.177000,0.774450
0.033100,0.014800,0.178200,0.773900
0.034100,0.015250,0.178850,0.771800
0.034850,0.014050,0.180450,0.770650
0.034300,0.015300,0.180600,0.769800
0.032700,0.016500,0.180450,0.770350
0.032850,0.016650,0.180950,0.769550
0.032500,0.017050,0.180750,0.769700
0.033100,0.016200,0.181900,0.768800
0.033100,0.017200,0.181450,0.768250
0.033850,0.016400,0.182150,0.767600
0.032500,0.016900,0.182800,0.767800
0.031900,0.016850,0.182950,0.768300
0.032300,0.016350,0.183300,0.768050
0.033550,0.015400,0.184150,0.766900
0.034350,0.014850,0.184700,0.766100
0.033450,0.015800,0.184800,0.765950
0.032800,0.016600,0.184400,0.766200
0.032300,0.016400,0.185150,0.766150
0.031550,0.017050,0.184800,0.766600
0.030500,0.018350,0.184750,0.766400
0.031200,0.017950,0.185650,0.765200
0.031850,0.016950,0.186250,0.764950
0.031700,0.017600,0.185250,0.765450
0.033300,0.017600,0.185950,0.763150
0.034400,0.016550,0.186400,0.762650
0.034250,0.016450,0.187700,0.761600
0.034150,0.016550,0.186450,0.762850
0.033900,0.015750,0.187450,0.762900
0.033900,0.016500,0.187400,0.762200
0.034100,0.016450,0.187500,0.761950
0.034200,0.017400,0.187400,0.761000
0.035550,0.015400,0.187550,0.761500
0.034750,0.016050,0.186750,0.762450
0.035300,0.016700,0.185550,0.762450
0.035750,0.017200,0.184350,0.762700
0.035700,0.016600,0.184600,0.763100
0.035850,0.017750,0.183150,0.763250
0.035500,0.018450,0.182300,0.763750
0.036100,0.017900,0.181950,0.764050
0.036100,0.017850,0.182850,0.763200
0.035000,0.017800,0.184100,0.763100
0.035800,0.017350,0.183750,0.763100
0.036250,0.017600,0.182450,0.763700
0.036750,0.017250,0.181550,0.764450
0.036050,0.018250,0.181350,0.764350
0.036500,0.017350,0.181100,0.765050
0.035400,0.018450,0.180650,0.765500
0.035650,0.018400,0.179600,0.766350
0.035900,0.017700,0.179950,0.766450
0.036850,0.017600,0.179650,0.765900
0.036600,0.017250,0.179700,0.766450
0.037200,0.017600,0.179700,0.765500
0.038150,0.017250,0.178750,0.765850
0.038700,0.016100,0.178600,0.766600
0.037400,0.017700,0.177550,0.767350
0.037250,0.018300,0.177450,0.767000
0.037700,0.017350,0.177950,0.767000
0.038100,0.017750,0.177600,0.766550
0.037500,0.018300,0.177000,0.767200
0.037600,0.018450,0.176400,0.767550
0.037600,0.018200,0.175250,0.768950
0.037150,0.017950,0.175700,0.769200
0.037350,0.017800,0.175300,0.769550
0.037650,0.018100,0.174100,0.770150
0.038300,0.017950,0.172550,0.771200
