I,E,S,R
0.001000,0.000850,0.998150,0.000000
0.001100,0.001600,0.997200,0.000100
0.001400,0.002100,0.996150,0.000350
0.001950,0.002800,0.994750,0.000500
0.002550,0.003600,0.993150,0.000700
0.003350,0.004350,0.991000,0.001300
0.004150,0.005550,0.988350,0.001950
0.005100,0.007900,0.984600,0.002400
0.005900,0.010800,0.980050,0.003250
0.008450,0.013650,0.974050,0.003850
0.010400,0.017900,0.967050,0.004650
0.014150,0.023000,0.956750,0.006100
0.017800,0.027950,0.946100,0.008150
0.025100,0.033000,0.931750,0.010150
0.030850,0.042450,0.912900,0.013800
0.039500,0.055000,0.887850,0.017650
0.049250,0.068800,0.858600,0.023350
0.061050,0.089800,0.818400,0.030750
0.077450,0.109000,0.774450,0.039100
0.098700,0.127600,0.724950,0.048750
0.120350,0.153350,0.664150,0.062150
0.147950,0.176600,0.596100,0.079350
0.180350,0.194500,0.525750,0.099400
0.211350,0.212350,0.452450,0.123850
0.246400,0.223800,0.378950,0.150850
0.275700,0.231350,0.308900,0.184050
0.307900,0.226550,0.246400,0.219150
0.331500,0.215450,0.192850,0.260200
0.351350,0.197350,0.150200,0.301100
0.361700,0.176150,0.115550,0.346600
0.364000,0.155000,0.086650,0.394350
0.360150,0.132150,0.066850,0.440850
0.348200,0.113700,0.050600,0.487500
0.331300,0.096350,0.039600,0.532750
0.314850,0.079600,0.032150,0.573400
0.298150,0.064500,0.027800,0.609550
0.277250,0.051500,0.023750,0.647500
0.253900,0.041150,0.022050,0.682900
0.233850,0.032450,0.020750,0.712950
0.210550,0.026700,0.019450,0.743300
0.190250,0.020700,0.019000,0.770050
0.171500,0.017300,0.018700,0.792500
0.153950,0.014450,0.019550,0.812050
0.138200,0.011650,0.020100,0.830050
0.122400,0.010150,0.021250,0.846200
0.108050,0.009650,0.022600,0.859700
0.097550,0.008050,0.024650,0.869750
0.086000,0.007400,0.025750,0.880850
0.076350,0.006250,0.027950,0.889450
0.068500,0.005750,0.028900,0.896850
0.061300,0.005050,0.031100,0.902550
0.054300,0.004800,0.033100,0.907800
0.049550,0.004800,0.034600,0.911050
0.044650,0.004800,0.036900,0.913650
0.039400,0.004400,0.039000,0.917200
0.035050,0.004200,0.040750,0.920000
0.031250,0.003850,0.042600,0.922300
0.027700,0.003550,0.045400,0.923350
0.024950,0.003100,0.048000,0.923950
0.021850,0.003100,0.050400,0.924650
0.019600,0.002950,0.052950,0.924500
0.017850,0.002500,0.055500,0.924150
0.016300,0.002100,0.058250,0.923350
0.014900,0.002000,0.060500,0.922600
0.013600,0.001850,0.063350,0.921200
0.011450,0.001950,0.066550,0.920050
0.009950,0.002000,0.069650,0.918400
0.009050,0.001600,0.072550,0.916800
0.008250,0.001650,0.074700,0.915400
0.007250,0.001750,0.077100,0.913900
0.006150,0.001600,0.079600,0.912650
0.005300,0.001800,0.082300,0.910600
0.005350,0.001800,0.084800,0.908050
0.004950,0.001850,0.086900,0.906300
0.005000,0.001500,0.089300,0.904200
0.004400,0.001500,0.091900,0.902200
0.004100,0.001250,0.094750,0.899900
0.003950,0.001000,0.098400,0.896650
0.003650,0.001150,0.100450,0.894750
0.003500,0.001000,0.103400,0.892100
0.003250,0.000700,0.106250,0.889800
0.002950,0.000650,0.108700,0.887700
0.002600,0.000600,0.111100,0.885700
0.002250,0.000600,0.114100,0.883050
0.002200,0.000550,0.116400,0.880850
0.002050,0.000500,0.119450,0.878000
0.001500,0.000550,0.122000,0.875950
0.001100,0.000350,0.125200,0.873350
0.001100,0.000200,0.128250,0.870450
0.001150,0.000250,0.130350,0.868250
0.001150,0.000300,0.133150,0.865400
0.001000,0.000250,0.135450,0.863300
0.000750,0.000300,0.137650,0.861300
0.000750,0.000300,0.140300,0.858650
0.000650,0.000100,0.143750,0.855500
0.000550,0.000200,0.146200,0.853050
0.000600,0.000200,0.148200,0.851000
0.000650,0.000150,0.150650,0.848550
0.000600,0.000250,0.152900,0.846250
0.000650,0.000250,0.155300,0.843800
0.000650,0.000250,0.157850,0.841250
0.000400,0.000350,0.160000,0.839250
0.000600,0.000200,0.163200,0.836000
0.000650,0.000100,0.165900,0.833350
0.000500,0.000150,0.168850,0.830500
0.000600,0.000100,0.171100,0.828200
0.000450,0.000050,0.174300,0.825200
0.000450,0.000100,0.177250,0.822200
0.000400,0.000200,0.179800,0.819600
0.000400,0.000200,0.181850,0.817550
0.000450,0.000250,0.184000,0.815300
0.000500,0.000200,0.186550,0.812750
0.000550,0.000200,0.188250,0.811000
0.000600,0.000100,0.190600,0.808700
0.000550,0.000100,0.192550,0.806800
0.000500,0.000200,0.194500,0.804800
0.000450,0.000200,0.196450,0.802900
0.000350,0.000300,0.199400,0.799950
0.000400,0.000250,0.201600,0.797750
0.000450,0.000350,0.203950,0.795250
0.000400,0.000300,0.206500,0.792800
0.000500,0.000250,0.208200,0.791050
0.000450,0.000250,0.210900,0.788400
0.000300,0.000350,0.212800,0.786550
0.000350,0.000300,0.215050,0.784300
0.000300,0.000250,0.216750,0.782700
0.000350,0.000200,0.219100,0.780350
0.000300,0.000250,0.221400,0.778050
0.000400,0.000200,0.223750,0.775650
0.000450,0.000200,0.225800,0.773550
0.000450,0.000150,0.227650,0.771750
0.000450,0.000200,0.229550,0.769800
0.000500,0.000150,0.232000,0.767350
0.000450,0.000100,0.234050,0.765400
0.000550,0.000100,0.235650,0.763700
0.000450,0.000100,0.237750,0.761700
0.000250,0.000200,0.239500,0.760050
0.000250,0.000200,0.241350,0.758200
0.000300,0.000150,0.243900,0.755650
0.000250,0.000100,0.245500,0.754150
0.000250,0.000100,0.247900,0.751750
0.000250,0.000150,0.250050,0.749550
0.000200,0.000300,0.251750,0.747750
0.000200,0.000300,0.253400,0.746100
0.000250,0.000250,0.255900,0.743600
0.000300,0.000250,0.258350,0.741100
0.000300,0.000200,0.260350,0.739150
0.000300,0.000200,0.262050,0.737450
0.000350,0.000250,0.264050,0.735350
0.000450,0.000200,0.266000,0.733350
0.000350,0.000150,0.268300,0.731200
0.000400,0.000100,0.270400,0.729100
0.000450,0.000050,0.272400,0.727100
0.000450,0.000200,0.274200,0.725150
0.000550,0.000100,0.276450,0.722900
0.000550,0.000300,0.278250,0.720900
0.000600,0.000400,0.280050,0.718950
0.000550,0.000500,0.282300,0.716650
0.000700,0.000450,0.284250,0.714600
0.000650,0.000600,0.285950,0.712800
0.000750,0.000750,0.287850,0.710650
0.000850,0.000650,0.289150,0.709350
0.001050,0.000500,0.290450,0.708000
0.001100,0.000400,0.292500,0.706000
0.001000,0.000500,0.295350,0.703150
0.001200,0.000500,0.297250,0.701050
0.001150,0.000700,0.298900,0.699250
0.001100,0.000750,0.300500,0.697650
0.001250,0.000750,0.302450,0.695550
0.001050,0.001050,0.304100,0.693800
0.001150,0.001100,0.305650,0.692100
0.001350,0.001000,0.307450,0.690200
0.001250,0.001450,0.309300,0.688000
0.001600,0.001050,0.311100,0.686250
0.001800,0.001200,0.312250,0.684750
0.001900,0.001400,0.313850,0.682850
0.002000,0.001250,0.315200,0.681550
0.002050,0.001450,0.316900,0.679600
0.002050,0.001600,0.317950,0.678400
0.002500,0.001450,0.319050,0.677000
0.002700,0.001600,0.320150,0.675550
0.002500,0.002150,0.321000,0.674350
0.002950,0.002000,0.322400,0.672650
0.003250,0.002350,0.323000,0.671400
0.003400,0.002500,0.324050,0.670050
0.003650,0.002250,0.325050,0.669050
0.004150,0.002750,0.325700,0.667400
0.004250,0.003300,0.326800,0.665650
0.004500,0.003500,0.327850,0.664150
0.005200,0.003300,0.329000,0.662500
0.005100,0.003350,0.329700,0.661850
0.005300,0.004450,0.329350,0.660900
0.005800,0.004200,0.330000,0.660000
0.006800,0.004500,0.329850,0.658850
0.006900,0.004850,0.329500,0.658750
0.007500,0.005300,0.329700,0.657500
0.008000,0.005850,0.329650,0.656500
0.008900,0.006500,0.329100,0.655500
0.010100,0.006850,0.328500,0.654550
0.010550,0.008100,0.327950,0.653400
0.011700,0.008250,0.327800,0.652250
0.012050,0.008700,0.326850,0.652400
0.012800,0.009300,0.325950,0.651950
0.013650,0.009950,0.324600,0.651800
0.015250,0.009900,0.323300,0.651550
0.015950,0.011150,0.321200,0.651700
0.017150,0.010850,0.320350,0.651650
0.017550,0.012400,0.318200,0.651850
0.018750,0.012350,0.316000,0.652900
0.018450,0.014550,0.313700,0.653300
0.021350,0.013950,0.311450,0.653250
0.022250,0.015600,0.307650,0.654500
0.022100,0.017800,0.303900,0.656200
0.025350,0.017200,0.300500,0.656950
0.028150,0.017700,0.295750,0.658400
0.029650,0.018950,0.290850,0.660550
0.031500,0.020500,0.285600,0.662400
0.032700,0.022800,0.281050,0.663450
0.035150,0.023550,0.275900,0.665400
0.038250,0.025100,0.268800,0.667850
0.040350,0.026900,0.262750,0.670000
0.042850,0.026900,0.257050,0.673200
0.044500,0.028000,0.250400,0.677100
0.047400,0.028550,0.243450,0.680600
0.048000,0.029850,0.237100,0.685050
0.048350,0.031550,0.229800,0.690300
0.050900,0.030250,0.224600,0.694250
0.055450,0.028650,0.217650,0.698250
0.056000,0.028900,0.211050,0.704050
0.057700,0.030100,0.204750,0.707450
0.057850,0.031050,0.198050,0.713050
0.058150,0.032350,0.191250,0.718250
0.058600,0.032800,0.184650,0.723950
0.060600,0.033150,0.177750,0.728500
0.060650,0.031900,0.172400,0.735050
0.061900,0.031150,0.166250,0.740700
0.064500,0.027750,0.161250,0.746500
0.063450,0.028300,0.156000,0.752250
0.064100,0.027850,0.151050,0.757000
0.061600,0.029000,0.146100,0.763300
0.061200,0.027550,0.142100,0.769150
0.061300,0.025900,0.138700,0.774100
0.060850,0.024150,0.135450,0.779550
0.059400,0.023100,0.132500,0.785000
0.057500,0.022400,0.129850,0.790250
0.056750,0.020700,0.128400,0.794150
0.055300,0.019350,0.126350,0.799000
0.054600,0.018300,0.125400,0.801700
0.052750,0.019000,0.122750,0.805500
0.051000,0.017950,0.121550,0.809500
0.050550,0.017250,0.119450,0.812750
0.048100,0.016800,0.118500,0.816600
0.046050,0.016200,0.118200,0.819550
0.044100,0.017400,0.117400,0.821100
0.042350,0.016350,0.116800,0.824500
0.041700,0.016750,0.116850,0.824700
0.039800,0.016150,0.117650,0.826400
0.041050,0.013900,0.118600,0.826450
0.039650,0.013450,0.118950,0.827950
0.039000,0.013150,0.119400,0.828450
0.036450,0.012850,0.119950,0.830750
0.033250,0.013250,0.120700,0.832800
0.032600,0.012300,0.122350,0.832750
0.031550,0.012250,0.123300,0.832900
0.030700,0.011700,0.124150,0.833450
0.029300,0.012100,0.125150,0.833450
0.028800,0.011450,0.126900,0.832850
0.028250,0.010750,0.129200,0.831800
0.028050,0.010350,0.131650,0.829950
0.026900,0.010300,0.132850,0.829950
0.025300,0.010250,0.134550,0.829900
0.024600,0.009900,0.136450,0.829050
0.024150,0.009450,0.138250,0.828150
0.022300,0.010150,0.139750,0.827800
0.021650,0.009800,0.141200,0.827350
0.020650,0.009950,0.143250,0.826150
0.020100,0.009300,0.145350,0.825250
0.019900,0.009200,0.147950,0.822950
0.019350,0.009400,0.150050,0.821200
0.020100,0.008450,0.152550,0.818900
0.020650,0.008200,0.154000,0.817150
0.019950,0.008050,0.156550,0.815450
0.020500,0.007150,0.158950,0.813400
0.020050,0.007050,0.160900,0.812000
0.019850,0.006500,0.163000,0.810650
0.018850,0.006650,0.165550,0.808950
0.018250,0.008000,0.166200,0.807550
0.017600,0.007850,0.168750,0.805800
0.017700,0.007500,0.170600,0.804200
0.017650,0.007250,0.172200,0.802900
0.017900,0.006950,0.174600,0.800550
0.017250,0.007850,0.176050,0.798850
0.017300,0.007650,0.178400,0.796650
0.015950,0.009450,0.179800,0.794800
0.017600,0.008550,0.182350,0.791500
0.017500,0.009500,0.184400,0.788600
0.018350,0.008400,0.187250,0.786000
0.018250,0.008550,0.188300,0.784900
0.017900,0.009300,0.189350,0.783450
0.018200,0.009000,0.191450,0.781350
0.017500,0.009550,0.192900,0.780050
0.017800,0.009850,0.194050,0.778300
0.018000,0.010100,0.195150,0.776750
0.018350,0.010250,0.196200,0.775200
0.018700,0.010650,0.198000,0.772650
0.019500,0.010700,0.199050,0.770750
0.019600,0.011000,0.199700,0.769700
0.020200,0.010200,0.201100,0.768500
0.020200,0.010500,0.202750,0.766550
0.020700,0.010400,0.203200,0.765700
0.021450,0.009900,0.204400,0.764250
0.021000,0.010350,0.204950,0.763700
0.021650,0.010750,0.205950,0.761650
0.021700,0.011200,0.206750,0.760350
0.022400,0.010750,0.208000,0.758850
0.021350,0.011800,0.209400,0.757450
0.021250,0.012450,0.210500,0.755800
0.022150,0.012900,0.211000,0.753950
0.022000,0.013950,0.210850,0.753200
0.023200,0.014000,0.211350,0.751450
0.024650,0.014100,0.211850,0.749400
0.024550,0.013950,0.211850,0.749650
0.025350,0.014150,0.211950,0.748550
0.025550,0.014500,0.211600,0.748350
0.026650,0.014350,0.211600,0.747400
0.026850,0.014450,0.210250,0.748450
0.026650,0.014650,0.210400,0.748300
0.026850,0.015700,0.209500,0.747950
0.027050,0.016000,0.208250,0.748700
0.027450,0.016600,0.208150,0.747800
0.028150,0.016300,0.208700,0.746850
0.028450,0.016200,0.208000,0.747350
0.028400,0.015350,0.207250,0.749000
0.029250,0.015300,0.207200,0.748250
0.028750,0.016200,0.206300,0.748750
0.029700,0.016350,0.205300,0.748650
0.029750,0.015850,0.205850,0.748550
0.031200,0.016600,0.205850,0.746350
0.031700,0.017200,0.204850,0.746250
0.032300,0.017100,0.203800,0.746800
0.033450,0.016550,0.203250,0.746750
0.032350,0.017550,0.202050,0.748050
0.032750,0.017400,0.201950,0.747900
0.032900,0.017700,0.200900,0.748500
0.033250,0.018250,0.200100,0.748400
0.033000,0.018450,0.199750,0.748800
0.033450,0.018750,0.199350,0.748450
0.033700,0.018100,0.199800,0.748400
0.034700,0.018350,0.198550,0.748400
0.035800,0.017950,0.196550,0.749700
0.035700,0.018450,0.194950,0.750900
0.037300,0.018450,0.195000,0.749250
0.037150,0.018750,0.194800,0.749300
0.036950,0.018750,0.194950,0.749350
0.037200,0.019000,0.193150,0.750650
0.037600,0.018750,0.191800,0.751850
0.037400,0.020600,0.189750,0.752250
0.037250,0.021000,0.189050,0.752700
0.039400,0.019500,0.189050,0.752050
0.038950,0.021050,0.187150,0.752850
0.037750,0.021150,0.188150,0.752950
0.039400,0.019850,0.187700,0.753050
0.040100,0.020000,0.186400,0.753500
0.040450,0.020250,0.186200,0.753100
0.041000,0.019650,0.185350,0.754000
0.040600,0.019950,0.184650,0.754800
0.041400,0.019550,0.183700,0.755350
0.040850,0.019150,0.183350,0.756650
0.040900,0.019300,0.182150,0.757650
0.040900,0.018750,0.182050,0.758300
0.039650,0.019650,0.181550,0.759150
0.039900,0.019350,0.180750,0.760000
0.040500,0.020050,0.179650,0.759800
0.040950,0.019450,0.178950,0.760650
0.040550,0.019500,0.178350,0.761600
0.040300,0.019800,0.176850,0.763050
0.040450,0.019550,0.176250,0.763750
0.040500,0.019500,0.175750,0.764250
0.039750,0.019850,0.174350,0.766050
0.039800,0.019900,0.173500,0.766800
0.040450,0.019300,0.173100,0.767150
0.040950,0.017900,0.173400,0.767750
0.040550,0.017450,0.172400,0.769600
0.041450,0.017250,0.171900,0.769400
0.042200,0.017550,0.172100,0.768150
0.042600,0.016950,0.172500,0.767950
0.041550,0.017500,0.172700,0.768250
0.041450,0.018200,0.172050,0.768300
0.039800,0.018400,0.172750,0.769050
0.039850,0.018100,0.172950,0.769100
0.040400,0.017750,0.172700,0.769150
0.039550,0.018150,0.172500,0.769800
0.038650,0.018450,0.172600,0.770300
0.038400,0.019000,0.172950,0.769650
0.037950,0.019250,0.173000,0.769800
0.039200,0.019200,0.171450,0.770150
0.038450,0.018650,0.172000,0.770900
0.039300,0.018650,0.171950,0.770100
0.038550,0.018600,0.172000,0.770850
0.038750,0.017500,0.172850,0.770900
0.039400,0.016450,0.174050,0.770100
0.038950,0.015650,0.174950,0.770450
0.038450,0.016050,0.175300,0.770200
0.038000,0.015700,0.175600,0.770700
0.036350,0.016850,0.174600,0.772200
0.036300,0.017500,0.173850,0.772350
0.036050,0.016900,0.174150,0.772900
0.036300,0.016250,0.174500,0.772950
0.036350,0.016950,0.173500,0.773200
0.037000,0.016350,0.173550,0.773100
0.036900,0.016250,0.173150,0.773700
0.036900,0.016100,0.173700,0.773300
0.037400,0.016100,0.173700,0.772800
0.038300,0.015600,0.174650,0.771450
0.037150,0.016700,0.173300,0.772850
0.036450,0.016700,0.173350,0.773500
0.036650,0.017050,0.172350,0.773950
0.035700,0.017700,0.173200,0.773400
0.036250,0.016450,0.174100,0.773200
0.037200,0.016950,0.174500,0.771350
0.036550,0.017300,0.174150,0.772000
0.036950,0.017050,0.173250,0.772750
0.036050,0.017000,0.173100,0.773850
0.036450,0.017600,0.172900,0.773050
0.036050,0.017450,0.173650,0.772850
0.035750,0.017450,0.173750,0.773050
0.034500,0.017500,0.174800,0.773200
0.035000,0.016950,0.175550,0.772500
0.034500,0.016750,0.175950,0.772800
0.033400,0.017600,0.175700,0.773300
0.034600,0.017850,0.175450,0.772100
0.035650,0.016900,0.174500,0.772950
0.035550,0.016950,0.174950,0.772550
0.035300,0.016000,0.175850,0.772850
0.035450,0.016200,0.176250,0.772100
0.035400,0.016250,0.176450,0.771900
0.035500,0.015900,0.176650,0.771950
0.035350,0.016300,0.176300,0.772050
0.035550,0.016250,0.177000,0.771200
0.034950,0.017000,0.177050,0.771000
0.033750,0.018150,0.176950,0.771150
0.034150,0.017750,0.176400,0.771700
0.034200,0.017550,0.176950,0.771300
0.034150,0.016600,0.177600,0.771650
0.034200,0.015850,0.178250,0.771700
0.034650,0.015250,0.178750,0.771350
0.034650,0.015350,0.178400,0.771600
0.033850,0.015700,0.178750,0.771700
0.034300,0.016200,0.177800,0.771700
0.034850,0.015800,0.178200,0.771150
0.034550,0.015800,0.179400,0.770250
0.034450,0.015200,0.179850,0.770500
0.034750,0.014450,0.180250,0.770550
0.034400,0.014850,0.179750,0.771000
0.034250,0.015650,0.178800,0.771300
0.034000,0.015650,0.178800,0.771550
0.035000,0.015000,0.179100,0.770900
0.033800,0.016100,0.179400,0.770700
0.034500,0.015950,0.180500,0.769050
0.033450,0.017350,0.180150,0.769050
0.034800,0.016900,0.180850,0.767450
0.034750,0.017000,0.181350,0.766900
0.035350,0.016300,0.180950,0.767400
0.036300,0.015850,0.180000,0.767850
0.036250,0.016350,0.180050,0.767350
0.036000,0.017350,0.179200,0.767450
0.036550,0.017750,0.177600,0.768100
0.036350,0.016600,0.179250,0.767800
0.036950,0.016600,0.178900,0.767550
0.037550,0.017200,0.177050,0.768200
0.036500,0.018200,0.176850,0.768450
0.036050,0.017650,0.177750,0.768550
0.035900,0.017550,0.177400,0.769150
0.035400,0.017900,0.177300,0.769400
0.034900,0.017900,0.175950,0.771250
0.035400,0.016500,0.175650,0.772450
0.034450,0.017500,0.175050,0.773000
0.034450,0.016800,0.175350,0.773400
0.035100,0.016650,0.175000,0.773250
0.032900,0.017350,0.175200,0.774550
0.033150,0.018000,0.175000,0.773850
0.033450,0.017000,0.174500,0.775050
0.033300,0.016800,0.174600,0.775300
0.034000,0.016050,0.174250,0.775700
0.034700,0.015650,0.174700,0.774950
0.033000,0.016000,0.174250,0.776750
0.032900,0.015400,0.175400,0.776300
0.033050,0.014850,0.175600,0.776500
0.032550,0.014500,0.176650,0.776300
0.032200,0.016100,0.176000,0.775700
0.032850,0.016350,0.175250,0.775550
0.032300,0.016400,0.176000,0.775300
0.033100,0.016000,0.176100,0.774800
0.032950,0.017050,0.175650,0.774350
0.033750,0.016500,0.176050,0.773700
0.034150,0.016450,0.176000,0.773400
0.033700,0.016050,0.177450,0.772800
0.034500,0.016550,0.177000,0.771950
0.034150,0.015750,0.178450,0.771650
0.034550,0.015950,0.179200,0.770300
0.034250,0.016400,0.177900,0.771450
0.035250,0.016900,0.177250,0.770600
0.035900,0.017200,0.176100,0.770800
0.036250,0.016150,0.175550,0.772050
0.035100,0.016200,0.175850,0.772850
0.035700,0.015150,0.175900,0.773250
0.034300,0.015650,0.176400,0.773650
0.032350,0.016750,0.176400,0.774500
0.034100,0.015150,0.177050,0.773700
0.033850,0.014900,0.177800,0.773450
0.032800,0.015200,0.178500,0.773500
0.033300,0.014650,0.180450,0.771600
0.033850,0.015700,0.179000,0.771450
0.033300,0.015850,0.179400,0.771450
0.034000,0.016100,0.178950,0.770950
0.034350,0.016600,0.178200,0.770850
0.033950,0.016650,0.179550,0.769850
0.034500,0.015850,0.180100,0.769550
0.034300,0.016700,0.180050,0.768950
0.034700,0.016500,0.179800,0.769000
0.035550,0.016650,0.178150,0.769650
0.034550,0.018000,0.177300,0.770150
0.034500,0.017200,0.177150,0.771150
0.033650,0.016500,0.178150,0.771700
0.033000,0.016150,0.179150,0.771700
0.033250,0.016650,0.177950,0.772150
0.032450,0.017250,0.178850,0.771450
0.033000,0.016450,0.178550,0.772000
0.033300,0.016350,0.177800,0.772550
0.033550,0.016300,0.178600,0.771550
0.033250,0.016750,0.178100,0.771900
0.033050,0.016350,0.179150,0.771450
0.033100,0.016600,0.179350,0.770950
0.034050,0.015100,0.180050,0.770800
0.035250,0.013650,0.181100,0.770000
0.034950,0.014300,0.180050,0.770700
0.034000,0.014850,0.179950,0.771200
0.033750,0.014400,0.180000,0.771850
0.034150,0.014850,0.180050,0.770950
0.033200,0.015450,0.180150,0.771200
0.033300,0.015250,0.180550,0.770900
0.033000,0.014900,0.181300,0.770800
0.032550,0.014550,0.182200,0.770700
0.031850,0.014750,0.182000,0.771400
0.031700,0.015650,0.182150,0.770500
0.032100,0.015950,0.182900,0.769050
0.031550,0.015750,0.183400,0.769300
0.033550,0.014600,0.184000,0.767850
0.033150,0.015250,0.183900,0.767700
0.033650,0.015950,0.183400,0.767000
0.033950,0.016700,0.182850,0.766500
0.034400,0.016100,0.182800,0.766700
0.034950,0.017350,0.181100,0.766600
0.034700,0.017800,0.180450,0.767050
0.035950,0.018100,0.179500,0.766450
0.035450,0.018150,0.179150,0.767250
0.036350,0.017100,0.178900,0.767650
0.037750,0.016800,0.178000,0.767450
0.037900,0.016950,0.177700,0.767450
0.037950,0.017650,0.177250,0.767150
0.037650,0.018600,0.176100,0.767650
0.037350,0.018600,0.175450,0.768600
0.036500,0.018300,0.175900,0.769300
0.036900,0.018750,0.174900,0.769450
0.036750,0.018050,0.175950,0.769250
0.037100,0.018200,0.176000,0.768700
0.037300,0.017900,0.175450,0.769350
0.036850,0.017400,0.175300,0.770450
0.036900,0.017050,0.175000,0.771050
0.037600,0.017200,0.174450,0.770750
0.037600,0.017600,0.174050,0.770750
0.038350,0.016800,0.174550,0.770300
0.038250,0.017550,0.175050,0.769150
0.037850,0.018650,0.174550,0.768950
0.037250,0.018650,0.174850,0.769250
0.037750,0.018600,0.174700,0.768950
0.037950,0.018450,0.175100,0.768500
0.038500,0.017800,0.175400,0.768300
0.037950,0.018900,0.174100,0.769050
0.038150,0.019100,0.173000,0.769750
0.038350,0.018700,0.172700,0.770250
0.038500,0.019550,0.171900,0.770050
0.039050,0.018500,0.170700,0.771750
0.038100,0.018650,0.170150,0.773100
0.040200,0.016750,0.171300,0.771750
0.040000,0.016500,0.172250,0.771250
0.038600,0.017500,0.171000,0.772900
0.036950,0.018400,0.171400,0.773250
0.037000,0.017750,0.172300,0.772950
0.036700,0.017700,0.173750,0.771850
0.035750,0.018600,0.173550,0.772100
0.036100,0.017250,0.174900,0.771750
0.035200,0.017750,0.175100,0.771950
0.035150,0.017450,0.174200,0.773200
0.035500,0.016250,0.175700,0.772550
0.035250,0.015950,0.176300,0.772500
0.034400,0.016350,0.176050,0.773200
0.033250,0.016350,0.177850,0.772550
0.033250,0.017050,0.177900,0.771800
0.034100,0.017100,0.178250,0.770550
0.034850,0.016450,0.179600,0.769100
0.034400,0.016800,0.180200,0.768600
0.034800,0.015700,0.181100,0.768400
0.032550,0.015900,0.182200,0.769350
0.032600,0.016550,0.182050,0.768800
0.032150,0.016150,0.183500,0.768200
0.032550,0.015200,0.184700,0.767550
0.032500,0.015800,0.184750,0.766950
0.032950,0.015300,0.184900,0.766850
0.032700,0.016250,0.184400,0.766650
0.033650,0.016150,0.183950,0.766250
0.035100,0.016200,0.183750,0.764950
0.035800,0.016200,0.182850,0.765150
0.034950,0.018150,0.181950,0.764950
0.034600,0.018200,0.181500,0.765700
0.035600,0.017100,0.182150,0.765150
0.034250,0.018450,0.181750,0.765550
0.035550,0.017650,0.182450,0.764350
0.036050,0.017850,0.182550,0.763550
0.036750,0.016750,0.182800,0.763700
0.036750,0.016650,0.182900,0.763700
0.036700,0.017150,0.183100,0.763050
0.036250,0.017200,0.183850,0.762700
0.037150,0.016700,0.184650,0.761500
0.037050,0.018050,0.183850,0.761050
0.037100,0.018400,0.182950,0.761550
0.037100,0.018050,0.182850,0.762000
0.037200,0.017500,0.182450,0.762850
0.037300,0.017500,0.182300,0.762900
0.036650,0.016950,0.182700,0.763700
0.037700,0.016900,0.182200,0.763200
0.037600,0.017400,0.182050,0.762950
0.037050,0.018550,0.181450,0.762950
0.037250,0.018250,0.181400,0.763100
0.037550,0.018350,0.180800,0.763300
0.039050,0.017150,0.180500,0.763300
0.039000,0.018550,0.178500,0.763950
0.038600,0.018250,0.178700,0.764450
0.037550,0.017600,0.179000,0.765850
0.037400,0.018200,0.178650,0.765750
0.036950,0.018950,0.177200,0.766900
0.037900,0.018850,0.177250,0.766000
0.038200,0.019000,0.176300,0.766500
0.038150,0.017800,0.176650,0.767400
0.036650,0.018750,0.177150,0.767450
0.037600,0.018450,0.176350,0.767600
0.037650,0.018300,0.176400,0.767650
0.039000,0.018100,0.175550,0.767350
0.038900,0.018900,0.175200,0.767000
0.039200,0.018300,0.175500,0.767000
0.039150,0.019150,0.175050,0.766650
0.040050,0.018450,0.174100,0.767400
0.040950,0.017850,0.174750,0.766450
0.039100,0.019000,0.173800,0.768100
0.038950,0.018200,0.173000,0.769850
0.038300,0.020050,0.171450,0.770200
0.038400,0.019050,0.171750,0.770800
0.038450,0.018550,0.171950,0.771050
0.038800,0.017800,0.171550,0.771850
0.040300,0.018000,0.170350,0.771350
0.039600,0.018450,0.169400,0.772550
0.039250,0.017050,0.170500,0.773200
0.039150,0.016500,0.171100,0.773250
0.038400,0.017350,0.170150,0.774100
0.036700,0.018050,0.170250,0.775000
0.036850,0.017350,0.170600,0.775200
0.035500,0.017150,0.171250,0.776100
0.035800,0.016100,0.172400,0.775700
0.035550,0.016350,0.172700,0.775400
0.035000,0.015700,0.173350,0.775950
0.035700,0.014050,0.174250,0.776000
0.034600,0.015650,0.174450,0.775300
0.033750,0.015300,0.174750,0.776200
0.032100,0.016900,0.175300,0.775700
0.032600,0.016700,0.177050,0.773650
0.032100,0.016750,0.176300,0.774850
0.033200,0.016000,0.177000,0.773800
0.032650,0.015300,0.177700,0.774350
0.033050,0.014850,0.178700,0.773400
0.032850,0.015600,0.180050,0.771500
0.032400,0.016200,0.182000,0.769400
0.032750,0.017050,0.181600,0.768600
0.032450,0.017300,0.182150,0.768100
0.032650,0.017300,0.182700,0.767350
0.032850,0.017100,0.182400,0.767650
0.034150,0.016650,0.182900,0.766300
0.034000,0.016450,0.183200,0.766350
0.034400,0.016250,0.184350,0.765000
0.034000,0.017500,0.185050,0.763450
0.033000,0.017650,0.186750,0.762600
0.033000,0.016050,0.188650,0.762300
0.031450,0.016900,0.188900,0.762750
0.032750,0.015600,0.189250,0.762400
0.031950,0.015750,0.189450,0.762850
0.031800,0.015250,0.190300,0.762650
0.031200,0.016350,0.190850,0.761600
0.031250,0.016100,0.191700,0.760950
0.031050,0.016600,0.191050,0.761300
0.031250,0.015750,0.191900,0.761100
0.031950,0.014700,0.192150,0.761200
0.031900,0.014850,0.193900,0.759350
0.032300,0.015350,0.193950,0.758400
0.031800,0.015200,0.194500,0.758500
0.031500,0.015300,0.195550,0.757650
0.030950,0.015700,0.197150,0.756200
0.030450,0.015550,0.198100,0.755900
0.031250,0.015950,0.198400,0.754400
0.031750,0.015650,0.198650,0.753950
0.031200,0.016400,0.198900,0.753500
0.030350,0.017150,0.200150,0.752350
0.032000,0.016150,0.199150,0.752700
0.033200,0.015750,0.198950,0.752100
0.033350,0.016200,0.199250,0.751200
0.032900,0.016750,0.198900,0.751450
0.032850,0.016500,0.198900,0.751750
0.032550,0.018550,0.197400,0.751500
0.033200,0.018250,0.197000,0.751550
0.033900,0.018600,0.197200,0.750300
0.035050,0.017400,0.196600,0.750950
0.035100,0.016850,0.197250,0.750800
0.035850,0.017100,0.196300,0.750750
0.036650,0.015900,0.196400,0.751050
0.036300,0.016200,0.196300,0.751200
0.035650,0.018400,0.195600,0.750350
0.036550,0.017400,0.195600,0.750450
0.037550,0.017150,0.195700,0.749600
0.037250,0.017600,0.195250,0.749900
0.036350,0.017800,0.194550,0.751300
0.036300,0.018450,0.193650,0.751600
0.037400,0.017850,0.193900,0.750850
