
real	0m20,025s
user	0m20,711s
sys	0m0,369s

real	0m20,091s
user	0m20,849s
sys	0m0,320s

real	0m19,720s
user	0m20,620s
sys	0m0,331s

real	0m19,902s
user	0m20,698s
sys	0m0,386s

real	0m19,919s
user	0m20,719s
sys	0m0,305s

real	0m19,728s
user	0m20,622s
sys	0m0,294s

real	0m20,741s
user	0m21,581s
sys	0m0,322s

real	0m20,097s
user	0m20,888s
sys	0m0,311s

real	0m19,761s
user	0m20,614s
sys	0m0,350s

real	0m19,962s
user	0m20,855s
sys	0m0,330s
