
--------------------------
Total energy: 1702.13 Joules, including:
	CPU energy: 1702.13 Joules
	GPU energy: 0.00 Joules
--------------------------

--------------------------
Total energy: 1710.85 Joules, including:
	CPU energy: 1710.85 Joules
	GPU energy: 0.00 Joules
--------------------------

--------------------------
Total energy: 1370.41 Joules, including:
	CPU energy: 1370.41 Joules
	GPU energy: 0.00 Joules
--------------------------

--------------------------
Total energy: 1345.57 Joules, including:
	CPU energy: 1345.57 Joules
	GPU energy: 0.00 Joules
--------------------------

--------------------------
Total energy: 1543.17 Joules, including:
	CPU energy: 1543.17 Joules
	GPU energy: 0.00 Joules
--------------------------

--------------------------
Total energy: 1710.43 Joules, including:
	CPU energy: 1710.43 Joules
	GPU energy: 0.00 Joules
--------------------------

--------------------------
Total energy: 1692.91 Joules, including:
	CPU energy: 1692.91 Joules
	GPU energy: 0.00 Joules
--------------------------

--------------------------
Total energy: 1692.60 Joules, including:
	CPU energy: 1692.60 Joules
	GPU energy: 0.00 Joules
--------------------------

--------------------------
Total energy: 1703.67 Joules, including:
	CPU energy: 1703.67 Joules
	GPU energy: 0.00 Joules
--------------------------

--------------------------
Total energy: 1711.18 Joules, including:
	CPU energy: 1711.18 Joules
	GPU energy: 0.00 Joules
--------------------------
