
--------------------------
Total energy: 5547.29 Joules, including:
	CPU energy: 5547.29 Joules
	GPU energy: 0.00 Joules
--------------------------

--------------------------
Total energy: 6976.93 Joules, including:
	CPU energy: 6976.93 Joules
	GPU energy: 0.00 Joules
--------------------------

--------------------------
Total energy: 6133.21 Joules, including:
	CPU energy: 6133.21 Joules
	GPU energy: 0.00 Joules
--------------------------

--------------------------
Total energy: 6974.40 Joules, including:
	CPU energy: 6974.40 Joules
	GPU energy: 0.00 Joules
--------------------------

--------------------------
Total energy: 6627.29 Joules, including:
	CPU energy: 6627.29 Joules
	GPU energy: 0.00 Joules
--------------------------
