I,E,S,R
0.001000,0.000650,0.998350,0.000000
0.001200,0.001050,0.997600,0.000150
0.001400,0.001400,0.997000,0.000200
0.001550,0.002450,0.995550,0.000450
0.001850,0.003200,0.994350,0.000600
0.002550,0.004300,0.992450,0.000700
0.003300,0.005250,0.990400,0.001050
0.004350,0.006650,0.987450,0.001550
0.005850,0.008800,0.983200,0.002150
0.007200,0.011600,0.978200,0.003000
0.010100,0.014950,0.971100,0.003850
0.012750,0.019900,0.962100,0.005250
0.017200,0.026350,0.949350,0.007100
0.022650,0.031450,0.936450,0.009450
0.029350,0.042700,0.916000,0.011950
0.037900,0.052300,0.893850,0.015950
0.047500,0.071100,0.860600,0.020800
0.059400,0.087450,0.825700,0.027450
0.077900,0.103100,0.784800,0.034200
0.097050,0.123550,0.735800,0.043600
0.118250,0.149350,0.675400,0.057000
0.145400,0.169900,0.611950,0.072750
0.174850,0.191900,0.542250,0.091000
0.205700,0.212600,0.467700,0.114000
0.238900,0.226300,0.393750,0.141050
0.267150,0.237600,0.323050,0.172200
0.301450,0.233150,0.257100,0.208300
0.328950,0.224100,0.199900,0.247050
0.349650,0.207700,0.151850,0.290800
0.361650,0.187250,0.113900,0.337200
0.368200,0.162800,0.085750,0.383250
0.363050,0.137500,0.065700,0.433750
0.353250,0.114850,0.050250,0.481650
0.340550,0.092800,0.039550,0.527100
0.324450,0.075200,0.031450,0.568900
0.300000,0.060750,0.026950,0.612300
0.277050,0.049150,0.023550,0.650250
0.254000,0.039100,0.021600,0.685300
0.231650,0.031500,0.020200,0.716650
0.209450,0.025250,0.019150,0.746150
0.189000,0.020700,0.019500,0.770800
0.170500,0.016250,0.019950,0.793300
0.153150,0.013900,0.021450,0.811500
0.136450,0.011400,0.021800,0.830350
0.121750,0.009150,0.023200,0.845900
0.107850,0.008800,0.024200,0.859150
0.094750,0.007950,0.024700,0.872600
0.083800,0.006600,0.027000,0.882600
0.072950,0.006300,0.028350,0.892400
0.065150,0.005300,0.030100,0.899450
0.057250,0.005650,0.031800,0.905300
0.050750,0.004700,0.034000,0.910550
0.044300,0.004900,0.035800,0.915000
0.039600,0.004700,0.037900,0.917800
0.036050,0.004050,0.040400,0.919500
0.032500,0.003350,0.043300,0.920850
0.028750,0.003650,0.045500,0.922100
0.025800,0.003450,0.047550,0.923200
0.023150,0.003250,0.050150,0.923450
0.019500,0.003250,0.052450,0.924800
0.017650,0.002700,0.055600,0.924050
0.015650,0.002300,0.058600,0.923450
0.013750,0.002350,0.061050,0.922850
0.012400,0.002000,0.063150,0.922450
0.011350,0.001700,0.066150,0.920800
0.010100,0.001750,0.069150,0.919000
0.009050,0.001850,0.071300,0.917800
0.008200,0.001600,0.073100,0.917100
0.007450,0.001700,0.075050,0.915800
0.006850,0.001300,0.077350,0.914500
0.006100,0.001550,0.079900,0.912450
0.005350,0.001600,0.082450,0.910600
0.005100,0.001350,0.085650,0.907900
0.004800,0.001000,0.088050,0.906150
0.004650,0.000750,0.090950,0.903650
0.004150,0.000750,0.094050,0.901050
0.003700,0.000800,0.097200,0.898300
0.003450,0.000750,0.099700,0.896100
0.003350,0.000550,0.102400,0.893700
0.003100,0.000400,0.105800,0.890700
0.002750,0.000550,0.107850,0.888850
0.002550,0.000700,0.110800,0.885950
0.002100,0.000550,0.114200,0.883150
0.001900,0.000550,0.116800,0.880750
0.001950,0.000400,0.119700,0.877950
0.001600,0.000500,0.122700,0.875200
0.001400,0.000600,0.125700,0.872300
0.001350,0.000450,0.128150,0.870050
0.001250,0.000600,0.130550,0.867600
0.001400,0.000500,0.132950,0.865150
0.001200,0.000550,0.135150,0.863100
0.001200,0.000550,0.138000,0.860250
0.001250,0.000450,0.140500,0.857800
0.001400,0.000350,0.143150,0.855100
0.001450,0.000350,0.144750,0.853450
0.001150,0.000300,0.147400,0.851150
0.000900,0.000300,0.150500,0.848300
0.000700,0.000400,0.152900,0.846000
0.000850,0.000200,0.154900,0.844050
0.000800,0.000250,0.157700,0.841250
0.000800,0.000400,0.159950,0.838850
0.000900,0.000400,0.161950,0.836750
0.000950,0.000250,0.164500,0.834300
0.000900,0.000200,0.167100,0.831800
0.000900,0.000200,0.169500,0.829400
0.000800,0.000250,0.171600,0.827350
0.000700,0.000300,0.174600,0.824400
0.000700,0.000400,0.177750,0.821150
0.000850,0.000400,0.180200,0.818550
0.000950,0.000500,0.182850,0.815700
0.001150,0.000450,0.184900,0.813500
0.001150,0.000500,0.186750,0.811600
0.000900,0.000700,0.189450,0.808950
0.000950,0.000650,0.191850,0.806550
0.001050,0.000650,0.193750,0.804550
0.001200,0.000500,0.196150,0.802150
0.001100,0.000450,0.197600,0.800850
0.001100,0.000250,0.200050,0.798600
0.001050,0.000400,0.202100,0.796450
0.000950,0.000600,0.204050,0.794400
0.001000,0.000500,0.206350,0.792150
0.001000,0.000450,0.208500,0.790050
0.001000,0.000350,0.210450,0.788200
0.000850,0.000400,0.212450,0.786300
0.001050,0.000350,0.214550,0.784050
0.001150,0.000250,0.216300,0.782300
0.001100,0.000250,0.218950,0.779700
0.001000,0.000350,0.220550,0.778100
0.000900,0.000500,0.222850,0.775750
0.000950,0.000400,0.225250,0.773400
0.000850,0.000400,0.226700,0.772050
0.000850,0.000350,0.228500,0.770300
0.000850,0.000300,0.231050,0.767800
0.000850,0.000150,0.232950,0.766050
0.000700,0.000300,0.235100,0.763900
0.000850,0.000200,0.237700,0.761250
0.000900,0.000300,0.239550,0.759250
0.000750,0.000450,0.241350,0.757450
0.000550,0.000500,0.243900,0.755050
0.000750,0.000250,0.245650,0.753350
0.000650,0.000400,0.247950,0.751000
0.000750,0.000400,0.250000,0.748850
0.000900,0.000450,0.251650,0.747000
0.000950,0.000600,0.253450,0.745000
0.001000,0.000600,0.255750,0.742650
0.001050,0.000650,0.258100,0.740200
0.001000,0.000750,0.260700,0.737550
0.001100,0.000550,0.262700,0.735650
0.000850,0.000700,0.264300,0.734150
0.000900,0.000650,0.266350,0.732100
0.001050,0.000750,0.268400,0.729800
0.001100,0.000800,0.270200,0.727900
0.001200,0.000950,0.271700,0.726150
0.001350,0.001050,0.273500,0.724100
0.001750,0.000800,0.274700,0.722750
0.001850,0.000850,0.276300,0.721000
0.001700,0.001150,0.277750,0.719400
0.001750,0.001250,0.279250,0.717750
0.001850,0.001200,0.280650,0.716300
0.002050,0.001200,0.281650,0.715100
0.002050,0.001300,0.283550,0.713100
0.002150,0.001450,0.285050,0.711350
0.002250,0.001700,0.287250,0.708800
0.002400,0.001750,0.288550,0.707300
0.002600,0.001650,0.290200,0.705550
0.002650,0.001850,0.291350,0.704150
0.002900,0.001850,0.292850,0.702400
0.003000,0.001800,0.294350,0.700850
0.003400,0.002100,0.296250,0.698250
0.003400,0.002300,0.297600,0.696700
0.003750,0.002500,0.297950,0.695800
0.004000,0.002250,0.299550,0.694200
0.003950,0.002550,0.301350,0.692150
0.004100,0.003200,0.301650,0.691050
0.004450,0.003300,0.303450,0.688800
0.004900,0.003450,0.305200,0.686450
0.005050,0.003700,0.306350,0.684900
0.005450,0.004000,0.307650,0.682900
0.005950,0.004550,0.307600,0.681900
0.006900,0.005550,0.306850,0.680700
0.007500,0.005600,0.306950,0.679950
0.007850,0.005750,0.306600,0.679800
0.008150,0.006250,0.306400,0.679200
0.009250,0.005650,0.306850,0.678250
0.010100,0.006200,0.306800,0.676900
0.010150,0.007150,0.306450,0.676250
0.010900,0.007150,0.306200,0.675750
0.011800,0.007500,0.305750,0.674950
0.012100,0.007850,0.305350,0.674700
0.013300,0.008200,0.304150,0.674350
0.012900,0.008800,0.303850,0.674450
0.013600,0.009600,0.302450,0.674350
0.014600,0.010800,0.300500,0.674100
0.015650,0.011750,0.298600,0.674000
0.016750,0.012700,0.297150,0.673400
0.018200,0.012650,0.295150,0.674000
0.020200,0.012400,0.293600,0.673800
0.021300,0.012750,0.291450,0.674500
0.022250,0.013700,0.288900,0.675150
0.023450,0.014700,0.285400,0.676450
0.024650,0.014800,0.283200,0.677350
0.025750,0.016600,0.279000,0.678650
0.026300,0.016650,0.275950,0.681100
0.027500,0.017300,0.272650,0.682550
0.028950,0.018150,0.268850,0.684050
0.031450,0.018600,0.264300,0.685650
0.033500,0.020250,0.258750,0.687500
0.034600,0.021200,0.254150,0.690050
0.035850,0.022400,0.249500,0.692250
0.036650,0.024550,0.244150,0.694650
0.037750,0.024000,0.240150,0.698100
0.039550,0.024350,0.234250,0.701850
0.042650,0.023950,0.228400,0.705000
0.043800,0.024900,0.223050,0.708250
0.044600,0.023750,0.219150,0.712500
0.044850,0.024500,0.213850,0.716800
0.046500,0.025900,0.207650,0.719950
0.046600,0.026500,0.202400,0.724500
0.047550,0.025650,0.198650,0.728150
0.049850,0.024900,0.193600,0.731650
0.051100,0.024150,0.189350,0.735400
0.051000,0.025300,0.184000,0.739700
0.050700,0.025150,0.179850,0.744300
0.051250,0.024900,0.176400,0.747450
0.050050,0.024750,0.173450,0.751750
0.050200,0.025500,0.168300,0.756000
0.050900,0.024500,0.165250,0.759350
0.051350,0.024250,0.162000,0.762400
0.051400,0.023200,0.157950,0.767450
0.051200,0.021500,0.155950,0.771350
0.049750,0.020750,0.153700,0.775800
0.049750,0.021050,0.150350,0.778850
0.049100,0.020000,0.148150,0.782750
0.047200,0.020600,0.145200,0.787000
0.045900,0.019900,0.144750,0.789450
0.045050,0.018350,0.143700,0.792900
0.043750,0.019000,0.141850,0.795400
0.043650,0.017750,0.140650,0.797950
0.041350,0.016950,0.141500,0.800200
0.041050,0.017500,0.140000,0.801450
0.040500,0.017000,0.139250,0.803250
0.039600,0.016550,0.139700,0.804150
0.039100,0.015100,0.140350,0.805450
0.038000,0.014650,0.140750,0.806600
0.037750,0.015250,0.139800,0.807200
0.037350,0.014950,0.139200,0.808500
0.036250,0.013150,0.140050,0.810550
0.035000,0.012900,0.140150,0.811950
0.034050,0.013000,0.139800,0.813150
0.032150,0.013250,0.139050,0.815550
0.032500,0.012950,0.140100,0.814450
0.032350,0.012700,0.140450,0.814500
0.031450,0.012150,0.140950,0.815450
0.031050,0.012000,0.140450,0.816500
0.029500,0.011950,0.141150,0.817400
0.028450,0.012100,0.142000,0.817450
0.028250,0.011400,0.143050,0.817300
0.027350,0.010500,0.144650,0.817500
0.026750,0.010250,0.145800,0.817200
0.026300,0.009700,0.147000,0.817000
0.024950,0.010150,0.148000,0.816900
0.023350,0.010350,0.149800,0.816500
0.022950,0.009600,0.150550,0.816900
0.021600,0.010000,0.151550,0.816850
0.021250,0.009700,0.153400,0.815650
0.020800,0.009300,0.155650,0.814250
0.021300,0.008500,0.158300,0.811900
0.021000,0.007850,0.159550,0.811600
0.019950,0.008100,0.160950,0.811000
0.020350,0.007900,0.162450,0.809300
0.019900,0.008550,0.163300,0.808250
0.019000,0.008650,0.165400,0.806950
0.018500,0.009150,0.166200,0.806150
0.018100,0.007900,0.169100,0.804900
0.017900,0.008150,0.170900,0.803050
0.017100,0.008450,0.172800,0.801650
0.017000,0.007800,0.175400,0.799800
0.016250,0.007850,0.177450,0.798450
0.015800,0.008100,0.179850,0.796250
0.015850,0.008200,0.181750,0.794200
0.015550,0.008050,0.184750,0.791650
0.015700,0.007300,0.188000,0.789000
0.015350,0.007150,0.190250,0.787250
0.015050,0.006600,0.193300,0.785050
0.014500,0.007050,0.195350,0.783100
0.015000,0.007450,0.196850,0.780700
0.015600,0.007150,0.198950,0.778300
0.015550,0.007600,0.200650,0.776200
0.015550,0.007800,0.202950,0.773700
0.016500,0.007850,0.204500,0.771150
0.016800,0.007350,0.207100,0.768750
0.016900,0.008350,0.208650,0.766100
0.017100,0.009400,0.209800,0.763700
0.017900,0.009100,0.211250,0.761750
0.017400,0.009050,0.213350,0.760200
0.017750,0.009750,0.214400,0.758100
0.018100,0.010050,0.215250,0.756600
0.018850,0.010150,0.215400,0.755600
0.019700,0.009750,0.216200,0.754350
0.020000,0.010200,0.216800,0.753000
0.018650,0.011250,0.217850,0.752250
0.019700,0.010900,0.219100,0.750300
0.020600,0.010700,0.221300,0.747400
0.020750,0.010800,0.221900,0.746550
0.020600,0.011300,0.223150,0.744950
0.021350,0.010700,0.223750,0.744200
0.021000,0.010600,0.224350,0.744050
0.020750,0.010950,0.225150,0.743150
0.021000,0.011700,0.226000,0.741300
0.020900,0.011800,0.227300,0.740000
0.021650,0.011850,0.227250,0.739250
0.022200,0.012050,0.228650,0.737100
0.022400,0.013100,0.228100,0.736400
0.022550,0.013550,0.228650,0.735250
0.023100,0.014450,0.227900,0.734550
0.023100,0.015350,0.227350,0.734200
0.024050,0.014450,0.228450,0.733050
0.025200,0.014950,0.228550,0.731300
0.025700,0.014850,0.228350,0.731100
0.026350,0.015800,0.227150,0.730700
0.027900,0.015550,0.227150,0.729400
0.029000,0.015800,0.226050,0.729150
0.029200,0.015650,0.225700,0.729450
0.029050,0.017650,0.224150,0.729150
0.029550,0.017650,0.223550,0.729250
0.030150,0.018600,0.221350,0.729900
0.032450,0.017300,0.220800,0.729450
0.033900,0.017950,0.219000,0.729150
0.034500,0.018800,0.217450,0.729250
0.035750,0.018550,0.216000,0.729700
0.037750,0.018050,0.214450,0.729750
0.036700,0.020300,0.212300,0.730700
0.037650,0.019850,0.211900,0.730600
0.038000,0.020550,0.210250,0.731200
0.038850,0.020350,0.209050,0.731750
0.040300,0.021400,0.206900,0.731400
0.041100,0.021450,0.205000,0.732450
0.041650,0.022150,0.201900,0.734300
0.043150,0.021700,0.198350,0.736800
0.042750,0.022550,0.195900,0.738800
0.043100,0.022450,0.194500,0.739950
0.043200,0.023550,0.191050,0.742200
0.045650,0.023800,0.188250,0.742300
0.046900,0.023450,0.186000,0.743650
0.045550,0.023750,0.185100,0.745600
0.046300,0.022450,0.183600,0.747650
0.045700,0.023900,0.180900,0.749500
0.045150,0.024050,0.179500,0.751300
0.046000,0.022700,0.178600,0.752700
0.046250,0.022350,0.177100,0.754300
0.047150,0.021400,0.176100,0.755350
0.046900,0.021350,0.174850,0.756900
0.045750,0.021200,0.174150,0.758900
0.045650,0.021450,0.173600,0.759300
0.046600,0.021000,0.172500,0.759900
0.046600,0.021200,0.170550,0.761650
0.046100,0.022900,0.167900,0.763100
0.046650,0.022750,0.166700,0.763900
0.046450,0.022550,0.165800,0.765200
0.046350,0.021750,0.164550,0.767350
0.045950,0.020900,0.164150,0.769000
0.045400,0.020200,0.163500,0.770900
0.044850,0.019000,0.163750,0.772400
0.043200,0.020150,0.161800,0.774850
0.042900,0.020650,0.160450,0.776000
0.043050,0.018350,0.160900,0.777700
0.041800,0.019500,0.159950,0.778750
0.041200,0.020350,0.159200,0.779250
0.042650,0.018850,0.159100,0.779400
0.041800,0.017900,0.159550,0.780750
0.041600,0.017850,0.160200,0.780350
0.040450,0.019300,0.159100,0.781150
0.040700,0.019250,0.158950,0.781100
0.041900,0.017250,0.159400,0.781450
0.040550,0.016850,0.159550,0.783050
0.040600,0.016600,0.160100,0.782700
0.039900,0.016000,0.160150,0.783950
0.038550,0.016350,0.159750,0.785350
0.038450,0.016800,0.158750,0.786000
0.037650,0.017550,0.159000,0.785800
0.038100,0.016450,0.159350,0.786100
0.037250,0.015400,0.160250,0.787100
0.037200,0.015700,0.160450,0.786650
0.036800,0.015400,0.161550,0.786250
0.036600,0.014650,0.161750,0.787000
0.035950,0.015500,0.162050,0.786500
0.035850,0.015050,0.162800,0.786300
0.034100,0.015750,0.163700,0.786450
0.033800,0.015150,0.164800,0.786250
0.033350,0.014950,0.166050,0.785650
0.032700,0.015200,0.167550,0.784550
0.032700,0.014600,0.168450,0.784250
0.032700,0.014750,0.169250,0.783300
0.032100,0.014900,0.170150,0.782850
0.032000,0.015250,0.170650,0.782100
0.031600,0.016400,0.169550,0.782450
0.031800,0.016600,0.169500,0.782100
0.031250,0.016350,0.169950,0.782450
0.030900,0.015900,0.170400,0.782800
0.032150,0.014700,0.171700,0.781450
0.031300,0.013750,0.173450,0.781500
0.030600,0.015000,0.174000,0.780400
0.031200,0.014350,0.175750,0.778700
0.030650,0.015250,0.174500,0.779600
0.030150,0.015250,0.176200,0.778400
0.030900,0.014550,0.177650,0.776900
0.031100,0.013300,0.178600,0.777000
0.031000,0.013000,0.179200,0.776800
0.030200,0.012950,0.180650,0.776200
0.028700,0.014300,0.181900,0.775100
0.028500,0.014000,0.183450,0.774050
0.029100,0.013900,0.185500,0.771500
0.029450,0.013800,0.186400,0.770350
0.028900,0.013100,0.187500,0.770500
0.028750,0.013550,0.187850,0.769850
0.029200,0.014150,0.188000,0.768650
0.029750,0.014600,0.188250,0.767400
0.029750,0.014800,0.188550,0.766900
0.029900,0.015050,0.188150,0.766900
0.030400,0.015000,0.188050,0.766550
0.030100,0.015550,0.187550,0.766800
0.030750,0.015600,0.187600,0.766050
0.030650,0.016450,0.188050,0.764850
0.031150,0.017050,0.187950,0.763850
0.031800,0.016700,0.188450,0.763050
0.031600,0.017450,0.188000,0.762950
0.032400,0.016900,0.188500,0.762200
0.032650,0.016350,0.188650,0.762350
0.032600,0.016400,0.187950,0.763050
0.032150,0.016200,0.188950,0.762700
0.031500,0.016600,0.188600,0.763300
0.030450,0.017850,0.188800,0.762900
0.031850,0.016200,0.189750,0.762200
0.032550,0.016500,0.189950,0.761000
0.032400,0.015950,0.190000,0.761650
0.032900,0.016000,0.189700,0.761400
0.032050,0.016700,0.189150,0.762100
0.031350,0.016150,0.190750,0.761750
0.031650,0.016250,0.190450,0.761650
0.031050,0.016050,0.190150,0.762750
0.031700,0.015250,0.190200,0.762850
0.031300,0.015750,0.189800,0.763150
0.030650,0.016300,0.189900,0.763150
0.031300,0.016300,0.190350,0.762050
0.032900,0.016550,0.189700,0.760850
0.032350,0.017300,0.188700,0.761650
0.032950,0.017600,0.187600,0.761850
0.033850,0.016350,0.188200,0.761600
0.035000,0.015950,0.187800,0.761250
0.035150,0.016450,0.187050,0.761350
0.034000,0.017900,0.185450,0.762650
0.033050,0.019200,0.185050,0.762700
0.033600,0.019350,0.184200,0.762850
0.034650,0.018000,0.184550,0.762800
0.034400,0.018050,0.183550,0.764000
0.035550,0.017800,0.183150,0.763500
0.036050,0.017050,0.182950,0.763950
0.036700,0.016900,0.183250,0.763150
0.035900,0.017400,0.182500,0.764200
0.036200,0.017400,0.182800,0.763600
0.036650,0.017000,0.182800,0.763550
0.036650,0.017150,0.182350,0.763850
0.036100,0.016100,0.182900,0.764900
0.036150,0.016200,0.182950,0.764700
0.035150,0.016500,0.182900,0.765450
0.035550,0.016400,0.181300,0.766750
0.034600,0.017200,0.180900,0.767300
0.034200,0.017100,0.181200,0.767500
0.034850,0.016500,0.181400,0.767250
0.033550,0.017950,0.180100,0.768400
0.034050,0.018050,0.178950,0.768950
0.034700,0.017750,0.179200,0.768350
0.034750,0.018100,0.179000,0.768150
0.035200,0.016700,0.179600,0.768500
0.035500,0.016400,0.179050,0.769050
0.035650,0.016350,0.179250,0.768750
0.035050,0.016050,0.178800,0.770100
0.035050,0.016900,0.178300,0.769750
0.035150,0.017300,0.178450,0.769100
0.035800,0.017500,0.177500,0.769200
0.037300,0.017050,0.176550,0.769100
0.035850,0.017300,0.177050,0.769800
0.036050,0.017150,0.176450,0.770350
0.035500,0.016450,0.176500,0.771550
0.037000,0.015650,0.176250,0.771100
0.037400,0.014450,0.176750,0.771400
0.035750,0.016250,0.175750,0.772250
0.034500,0.016000,0.175150,0.774350
0.034200,0.016250,0.174500,0.775050
0.033550,0.016100,0.174700,0.775650
0.033250,0.016250,0.174800,0.775700
0.034200,0.014300,0.175800,0.775700
0.033350,0.015450,0.175300,0.775900
0.032800,0.014600,0.176300,0.776300
0.032000,0.015200,0.177000,0.775800
0.031000,0.015650,0.177350,0.776000
0.031750,0.015900,0.176750,0.775600
0.032900,0.015350,0.177100,0.774650
0.032300,0.016400,0.177100,0.774200
0.032600,0.016100,0.178050,0.773250
0.033250,0.015750,0.178850,0.772150
0.032850,0.015750,0.179550,0.771850
0.032750,0.015800,0.179450,0.772000
0.032600,0.015500,0.180000,0.771900
0.032150,0.014600,0.179450,0.773800
0.032750,0.015350,0.178950,0.772950
0.032450,0.016200,0.178800,0.772550
0.032150,0.016450,0.178200,0.773200
0.031950,0.016150,0.179150,0.772750
0.032650,0.016750,0.178250,0.772350
0.033300,0.016450,0.177350,0.772900
0.034150,0.015000,0.177700,0.773150
0.033950,0.014850,0.177550,0.773650
0.033450,0.015050,0.178100,0.773400
0.031650,0.015950,0.178000,0.774400
0.031600,0.015550,0.178450,0.774400
0.030650,0.016000,0.178700,0.774650
0.029700,0.015850,0.178550,0.775900
0.029800,0.016200,0.179600,0.774400
0.029750,0.016250,0.180450,0.773550
0.030150,0.014950,0.181100,0.773800
0.031450,0.013750,0.181700,0.773100
0.031100,0.014000,0.183150,0.771750
0.031050,0.014250,0.183400,0.771300
0.030750,0.014900,0.183500,0.770850
0.029850,0.016150,0.183750,0.770250
0.030650,0.015000,0.184450,0.769900
0.030750,0.014850,0.185200,0.769200
0.031250,0.014450,0.185550,0.768750
0.031150,0.014400,0.186300,0.768150
0.031250,0.014300,0.187250,0.767200
0.030800,0.014800,0.187700,0.766700
0.031000,0.015750,0.187400,0.765850
0.031650,0.015250,0.188650,0.764450
0.031750,0.015700,0.187600,0.764950
0.032650,0.014700,0.188500,0.764150
0.031500,0.014700,0.189250,0.764550
0.031450,0.016100,0.188600,0.763850
0.031950,0.016250,0.188250,0.763550
0.032900,0.014550,0.189700,0.762850
0.033500,0.014850,0.189750,0.761900
0.032800,0.016200,0.189450,0.761550
0.033350,0.016550,0.189250,0.760850
0.032750,0.016850,0.189500,0.760900
0.033150,0.016550,0.189600,0.760700
0.032600,0.017350,0.189600,0.760450
0.033100,0.016600,0.189350,0.760950
0.033900,0.016450,0.190150,0.759500
0.033850,0.016700,0.190800,0.758650
0.033450,0.016800,0.190900,0.758850
0.033300,0.017300,0.190050,0.759350
0.034600,0.016500,0.189750,0.759150
0.035650,0.014850,0.191100,0.758400
0.035750,0.016550,0.189700,0.758000
0.034000,0.017400,0.189100,0.759500
0.035300,0.016700,0.189400,0.758600
0.034250,0.016550,0.189350,0.759850
0.033500,0.018100,0.187800,0.760600
0.034150,0.017050,0.188650,0.760150
0.034300,0.017300,0.187550,0.760850
0.033050,0.018750,0.187050,0.761150
0.033650,0.018000,0.188100,0.760250
0.034700,0.017600,0.187750,0.759950
0.034150,0.017300,0.188150,0.760400
0.034300,0.017100,0.187850,0.760750
0.034800,0.017550,0.187000,0.760650
0.036350,0.017150,0.186750,0.759750
0.035500,0.018150,0.187150,0.759200
0.035250,0.018250,0.186800,0.759700
0.034850,0.018400,0.186850,0.759900
0.034400,0.018850,0.186300,0.760450
0.035900,0.018000,0.186700,0.759400
0.036100,0.017600,0.186550,0.759750
0.036650,0.017600,0.187550,0.758200
0.037150,0.017150,0.186950,0.758750
0.036600,0.017300,0.186800,0.759300
0.035500,0.018150,0.185850,0.760500
0.036550,0.018150,0.185800,0.759500
0.036750,0.018700,0.185800,0.758750
0.036300,0.018150,0.185300,0.760250
0.036900,0.017950,0.185250,0.759900
0.037200,0.017050,0.186350,0.759400
0.038400,0.016250,0.185900,0.759450
0.036350,0.017700,0.185250,0.760700
0.036250,0.017050,0.185500,0.761200
0.035600,0.018300,0.184350,0.761750
0.036950,0.017200,0.184350,0.761500
0.035850,0.018100,0.184800,0.761250
0.036200,0.017950,0.184350,0.761500
0.035150,0.018800,0.183700,0.762350
0.035150,0.018250,0.183600,0.763000
0.035200,0.017300,0.184100,0.763400
0.034950,0.016950,0.185550,0.762550
0.035450,0.017100,0.186550,0.760900
0.036800,0.016500,0.186050,0.760650
0.036750,0.016600,0.186100,0.760550
0.035400,0.017350,0.184950,0.762300
0.036600,0.017300,0.183900,0.762200
0.037150,0.018000,0.183550,0.761300
0.036750,0.017800,0.184350,0.761100
0.037000,0.018800,0.183700,0.760500
0.037700,0.017900,0.184350,0.760050
0.038650,0.017000,0.184250,0.760100
0.037550,0.017300,0.184850,0.760300
0.036650,0.018500,0.183200,0.761650
0.036700,0.019400,0.182150,0.761750
0.037350,0.018700,0.182400,0.761550
0.038050,0.020050,0.181400,0.760500
0.038050,0.018950,0.183150,0.759850
0.038600,0.018950,0.182400,0.760050
0.037850,0.018150,0.183150,0.760850
0.036900,0.019050,0.183000,0.761050
0.036700,0.018550,0.183200,0.761550
0.036500,0.018000,0.184200,0.761300
0.036800,0.017750,0.184550,0.760900
0.036750,0.019000,0.184750,0.759500
0.036400,0.018950,0.185150,0.759500
0.038150,0.018400,0.184600,0.758850
0.038650,0.018650,0.183800,0.758900
0.038600,0.018900,0.182500,0.760000
0.038450,0.018550,0.181800,0.761200
0.038100,0.018150,0.182900,0.760850
0.038450,0.017450,0.183100,0.761000
0.037650,0.018250,0.183350,0.760750
0.037600,0.018800,0.182300,0.761300
0.037250,0.019400,0.182000,0.761350
0.039200,0.018850,0.181100,0.760850
0.039050,0.018500,0.180550,0.761900
0.039500,0.017750,0.181200,0.761550
0.039400,0.018350,0.180400,0.761850
0.039400,0.018050,0.179050,0.763500
0.040400,0.017350,0.179400,0.762850
0.039900,0.018150,0.178600,0.763350
0.039200,0.019200,0.176750,0.764850
0.040850,0.018400,0.176450,0.764300
0.041250,0.019550,0.174800,0.764400
0.041300,0.019150,0.174700,0.764850
0.041150,0.019250,0.174000,0.765600
0.041100,0.018050,0.174050,0.766800
0.040950,0.018200,0.173950,0.766900
0.039650,0.017800,0.174200,0.768350
0.038700,0.017750,0.174750,0.768800
0.038050,0.017600,0.175200,0.769150
0.038500,0.017500,0.175500,0.768500
0.038000,0.018000,0.175050,0.768950
0.038800,0.017350,0.175250,0.768600
0.038500,0.018200,0.174750,0.768550
0.038800,0.017900,0.174950,0.768350
0.039450,0.017000,0.175950,0.767600
0.038700,0.017600,0.175400,0.768300
0.037650,0.018950,0.174250,0.769150
0.039200,0.018150,0.173800,0.768850
0.037900,0.018600,0.173750,0.769750
0.038700,0.017200,0.174900,0.769200
0.038500,0.016750,0.175400,0.769350
0.037300,0.017750,0.174850,0.770100
0.036500,0.018050,0.174200,0.771250
0.036950,0.017150,0.175550,0.770350
0.037150,0.016900,0.175450,0.770500
0.036600,0.019100,0.174500,0.769800
0.036450,0.018500,0.174700,0.770350
0.037050,0.018300,0.174400,0.770250
0.036350,0.018800,0.174550,0.770300
0.036150,0.019350,0.175100,0.769400
0.036100,0.018800,0.174750,0.770350
0.038050,0.017900,0.174200,0.769850
0.037000,0.017000,0.175050,0.770950
0.036700,0.018050,0.174400,0.770850
0.037600,0.017200,0.174600,0.770600
0.036650,0.018000,0.174450,0.770900
0.037200,0.017850,0.175600,0.769350
0.037750,0.017200,0.175800,0.769250
0.036600,0.017900,0.175600,0.769900
0.036250,0.019100,0.175150,0.769500
0.036300,0.018600,0.176550,0.768550
0.036550,0.018350,0.176300,0.768800
0.037000,0.017900,0.176550,0.768550
0.036850,0.017500,0.176950,0.768700
0.036900,0.017500,0.176650,0.768950
0.037000,0.016700,0.177600,0.768700
0.037500,0.016200,0.177750,0.768550
0.037150,0.016450,0.176800,0.769600
0.036650,0.017250,0.175850,0.770250
0.036650,0.017550,0.175400,0.770400
0.036650,0.018450,0.175100,0.769800
0.036900,0.017250,0.175400,0.770450
0.036000,0.017850,0.174850,0.771300
0.035500,0.017750,0.175000,0.771750
0.034500,0.018200,0.174900,0.772400
0.035200,0.017750,0.174450,0.772600
0.035900,0.016300,0.176300,0.771500
0.035850,0.015550,0.176750,0.771850
0.036550,0.015550,0.177650,0.770250
0.036550,0.016100,0.177350,0.770000
0.035850,0.016150,0.177900,0.770100
0.035750,0.016900,0.177500,0.769850
0.035200,0.016350,0.178950,0.769500
0.033950,0.017100,0.178300,0.770650
0.033850,0.017250,0.178600,0.770300
0.034600,0.016150,0.178950,0.770300
0.034800,0.015400,0.180650,0.769150
0.033250,0.017250,0.179300,0.770200
0.033500,0.017350,0.179200,0.769950
0.034100,0.015950,0.180200,0.769750
0.034600,0.015600,0.180650,0.769150
0.035050,0.015300,0.180100,0.769550
0.035200,0.016400,0.178700,0.769700
0.034750,0.017400,0.178400,0.769450
0.034500,0.017150,0.178650,0.769700
0.034300,0.017050,0.178550,0.770100
0.033450,0.017750,0.178200,0.770600
0.033200,0.017150,0.178350,0.771300
0.033400,0.016700,0.179000,0.770900
0.033450,0.017950,0.178300,0.770300
0.034500,0.016600,0.178300,0.770600
0.035200,0.016450,0.178200,0.770150
0.034600,0.017500,0.178250,0.769650
0.034400,0.017100,0.179700,0.768800
0.034750,0.016150,0.180500,0.768600
0.034050,0.015750,0.181600,0.768600
0.034650,0.015000,0.181950,0.768400
0.032700,0.015750,0.181900,0.769650
0.032950,0.016000,0.182650,0.768400
0.032400,0.016450,0.183000,0.768150
0.032550,0.017250,0.183800,0.766400
0.033300,0.015700,0.185150,0.765850
0.033200,0.015200,0.186400,0.765200
0.032950,0.014850,0.187400,0.764800
0.033350,0.016100,0.185800,0.764750
0.033900,0.016600,0.185000,0.764500
