I,E,S,R
0.001,0.00125,0.99775,0
0.00115,0.0019,0.99675,0.0002
0.0015,0.00295,0.9951,0.00045
0.00205,0.00395,0.9934,0.0006
0.00255,0.00475,0.9916,0.0011
0.0036,0.00575,0.98925,0.0014
0.0043,0.00655,0.98705,0.0021
0.0054,0.00855,0.98315,0.0029
0.007,0.01045,0.9787,0.00385
0.0093,0.0126,0.97355,0.00455
0.01145,0.0171,0.9659,0.00555
0.0148,0.0219,0.95655,0.00675
0.0192,0.0276,0.9446,0.0086
0.02385,0.0365,0.9289,0.01075
0.0297,0.04585,0.90985,0.0146
0.0395,0.0556,0.88605,0.01885
0.05075,0.07145,0.85335,0.02445
0.0632,0.08725,0.81875,0.0308
0.078,0.1074,0.77455,0.04005
0.0983,0.12845,0.7235,0.04975
0.1225,0.1518,0.66335,0.06235
0.14935,0.17355,0.5985,0.0786
0.17825,0.2009,0.5226,0.09825
0.2086,0.217,0.45155,0.12285
0.24245,0.2243,0.3811,0.15215
0.2735,0.2303,0.3116,0.1846
0.30315,0.22745,0.24995,0.21945
0.3256,0.22025,0.19565,0.2585
0.34695,0.20025,0.15085,0.30195
0.3586,0.18075,0.1142,0.34645
0.362,0.15665,0.0865,0.39485
0.35535,0.13665,0.0651,0.4429
0.3472,0.11555,0.0506,0.48665
0.33055,0.09385,0.04065,0.53495
0.3135,0.07445,0.0344,0.57765
0.29115,0.06205,0.02925,0.61755
0.27015,0.0496,0.0261,0.65415
0.2459,0.0404,0.02405,0.68965
0.2241,0.0328,0.0225,0.7206
0.2042,0.0272,0.021,0.7476
0.183,0.02195,0.02095,0.7741
0.16585,0.0174,0.02165,0.7951
0.14765,0.01505,0.02175,0.81555
0.13155,0.0119,0.0224,0.83415
0.1167,0.01055,0.02365,0.8491
0.10375,0.00845,0.0253,0.8625
0.09195,0.0068,0.0268,0.87445
0.0816,0.00575,0.0281,0.88455
0.07265,0.00595,0.0297,0.8917
0.0646,0.0056,0.0317,0.8981
0.0576,0.00575,0.0332,0.90345
0.0506,0.00505,0.03505,0.9093
0.04515,0.0053,0.0373,0.91225
0.03985,0.00515,0.03875,0.91625
0.03665,0.00415,0.0406,0.9186
0.0312,0.0039,0.04325,0.92165
0.0283,0.00365,0.04595,0.9221
0.0251,0.0031,0.0497,0.9221
0.02295,0.00265,0.05295,0.92145
0.0202,0.00285,0.0557,0.92125
0.0177,0.0027,0.0588,0.9208
0.0152,0.00285,0.06145,0.9205
0.01345,0.0025,0.06425,0.9198
0.0122,0.0028,0.0669,0.9181
0.011,0.00265,0.0695,0.91685
0.01045,0.00195,0.0726,0.915
0.0092,0.00205,0.07475,0.914
0.0085,0.00175,0.07785,0.9119
0.0079,0.00175,0.08065,0.9097
0.0069,0.00165,0.0834,0.90805
0.00615,0.0018,0.0868,0.90525
0.00585,0.00185,0.08945,0.90285
0.0056,0.0015,0.0922,0.9007
0.00505,0.00135,0.09425,0.89935
0.0046,0.00135,0.0966,0.89745
0.00445,0.0013,0.0992,0.89505
0.00425,0.00125,0.1023,0.8922
0.00395,0.00125,0.10435,0.89045
0.00365,0.00115,0.1074,0.8878
0.0034,0.00115,0.1104,0.88505
0.0036,0.0009,0.1133,0.8822
0.0036,0.0007,0.1166,0.8791
0.0029,0.0009,0.1197,0.8765
0.00265,0.00135,0.1216,0.8744
0.0025,0.00125,0.1245,0.87175
0.00255,0.0012,0.12665,0.8696
0.0028,0.00105,0.12915,0.867
0.00255,0.0011,0.1313,0.86505
0.00215,0.0012,0.1335,0.86315
0.00205,0.0011,0.1362,0.86065
0.0019,0.0011,0.13855,0.85845
0.00195,0.00095,0.1416,0.8555
0.00185,0.00085,0.14365,0.85365
0.0016,0.0007,0.1462,0.8515
0.00135,0.00085,0.14885,0.84895
0.0012,0.00085,0.15145,0.8465
0.0014,0.0005,0.15395,0.84415
0.00125,0.00045,0.15625,0.84205
0.0012,0.00035,0.15885,0.8396
0.00105,0.0004,0.1611,0.83745
0.001,0.00035,0.16345,0.8352
0.001,0.00045,0.16605,0.8325
0.001,0.0004,0.16865,0.82995
0.0009,0.0006,0.17045,0.82805
0.00115,0.0006,0.17305,0.8252
0.0008,0.0007,0.175,0.8235
0.0009,0.00055,0.17755,0.821
0.0009,0.0005,0.17945,0.81915
0.00095,0.0005,0.1819,0.81665
0.001,0.00035,0.1843,0.81435
0.00095,0.0003,0.18655,0.8122
0.00095,0.0004,0.1893,0.80935
0.00105,0.0005,0.1918,0.80665
0.0009,0.0008,0.19375,0.80455
0.00095,0.00075,0.19595,0.80235
0.0011,0.0005,0.19805,0.80035
0.0011,0.00055,0.2005,0.79785
0.00115,0.00045,0.20315,0.79525
0.00095,0.0008,0.20495,0.7933
0.0011,0.00085,0.207,0.79105
0.00125,0.00065,0.2094,0.7887
0.00115,0.0008,0.211,0.78705
0.00105,0.00075,0.21325,0.78495
0.00115,0.00055,0.21505,0.78325
0.00125,0.00065,0.2173,0.7808
0.00125,0.00085,0.2185,0.7794
0.0014,0.00075,0.2204,0.77745
0.0014,0.0008,0.2219,0.7759
0.00145,0.0009,0.22295,0.7747
0.00145,0.00095,0.2252,0.7724
0.0014,0.00095,0.2278,0.76985
0.00125,0.0011,0.2296,0.76805
0.00145,0.00115,0.232,0.7654
0.00175,0.0009,0.2344,0.76295
0.00185,0.0007,0.23615,0.7613
0.0017,0.0009,0.23795,0.75945
0.00155,0.00115,0.24005,0.75725
0.0019,0.001,0.24195,0.75515
0.00155,0.001,0.2438,0.75365
0.0016,0.001,0.2457,0.7517
0.0018,0.0011,0.24775,0.74935
0.0019,0.00095,0.25,0.74715
0.002,0.0012,0.2513,0.7455
0.00225,0.00105,0.25305,0.74365
0.00215,0.0011,0.2554,0.74135
0.00195,0.0014,0.2565,0.74015
0.0019,0.0013,0.25835,0.73845
0.0019,0.0011,0.2608,0.7362
0.00205,0.00125,0.26265,0.73405
0.00215,0.0012,0.2645,0.73215
0.00225,0.0012,0.2663,0.73025
0.00235,0.0011,0.26785,0.7287
0.0024,0.00115,0.26925,0.7272
0.0025,0.0013,0.2706,0.7256
0.00255,0.0013,0.2725,0.72365
0.00285,0.00155,0.27385,0.72175
0.0028,0.0017,0.2749,0.7206
0.00285,0.0017,0.2767,0.71875
0.0029,0.0022,0.2781,0.7168
0.0034,0.0021,0.2795,0.715
0.0036,0.00215,0.28085,0.7134
0.00345,0.00245,0.2825,0.7116
0.00385,0.0025,0.2842,0.70945
0.0038,0.00285,0.28505,0.7083
0.0042,0.0033,0.2858,0.7067
0.00435,0.0038,0.28685,0.705
0.0046,0.00355,0.28835,0.7035
0.0052,0.00315,0.2898,0.70185
0.00525,0.0036,0.2912,0.69995
0.00615,0.00365,0.2913,0.6989
0.00665,0.0042,0.2917,0.69745
0.00755,0.00455,0.29195,0.69595
0.0078,0.0049,0.29225,0.69505
0.00815,0.0052,0.2924,0.69425
0.0087,0.00545,0.2926,0.69325
0.0087,0.0067,0.2919,0.6927
0.0088,0.0069,0.29125,0.69305
0.0099,0.00665,0.29145,0.692
0.0101,0.00665,0.2915,0.69175
0.01065,0.00735,0.29095,0.69105
0.0114,0.00765,0.2908,0.69015
0.0116,0.0072,0.29075,0.69045
0.01245,0.0082,0.29045,0.6889
0.0129,0.00905,0.2892,0.68885
0.0134,0.0096,0.289,0.688
0.01385,0.0104,0.28775,0.688
0.01445,0.0108,0.28745,0.6873
0.0154,0.0115,0.28595,0.68715
0.0162,0.0118,0.28505,0.68695
0.01735,0.01275,0.2832,0.6867
0.01785,0.013,0.2821,0.68705
0.01945,0.0121,0.28145,0.687
0.01955,0.01315,0.2793,0.688
0.02095,0.0136,0.27705,0.6884
0.02205,0.01475,0.27405,0.68915
0.02435,0.01605,0.2708,0.6888
0.02485,0.01655,0.26815,0.69045
0.0264,0.01715,0.2652,0.69125
0.02775,0.0184,0.26185,0.692
0.02975,0.01865,0.25795,0.69365
0.03135,0.0187,0.25405,0.6959
0.03235,0.0188,0.2506,0.69825
0.03435,0.01925,0.24675,0.69965
0.0342,0.02145,0.2421,0.70225
0.03615,0.02195,0.23795,0.70395
0.0377,0.0222,0.23305,0.70705
0.0389,0.02165,0.2301,0.70935
0.0393,0.022,0.2259,0.7128
0.03995,0.02285,0.2217,0.7155
0.0421,0.02305,0.21745,0.7174
0.04325,0.0251,0.21165,0.72
0.0438,0.0258,0.20795,0.72245
0.04495,0.02475,0.2044,0.7259
0.04525,0.02505,0.1999,0.7298
0.04665,0.02385,0.19605,0.73345
0.04715,0.02375,0.19125,0.73785
0.0471,0.0242,0.18605,0.74265
0.0484,0.0251,0.1802,0.7463
0.04815,0.0253,0.1757,0.75085
0.0493,0.02345,0.1732,0.75405
0.05,0.0235,0.1691,0.7574
0.05,0.02315,0.1655,0.76135
0.04945,0.02395,0.1619,0.7647
0.04875,0.0235,0.15885,0.7689
0.048,0.0221,0.15675,0.77315
0.0471,0.02235,0.15425,0.7763
0.047,0.02235,0.15165,0.779
0.0465,0.02035,0.15205,0.7811
0.04615,0.01865,0.15105,0.78415
0.0452,0.0191,0.1485,0.7872
0.04365,0.02005,0.14615,0.79015
0.04435,0.0191,0.1452,0.79135
0.0434,0.01935,0.14365,0.7936
0.043,0.0185,0.1428,0.7957
0.04335,0.0176,0.1416,0.79745
0.0423,0.01755,0.1404,0.79975
0.0423,0.0172,0.1395,0.801
0.0404,0.01725,0.1382,0.80415
0.04,0.0157,0.1396,0.8047
0.03775,0.0157,0.13895,0.8076
0.03655,0.016,0.13865,0.8088
0.0357,0.0148,0.1397,0.8098
0.0347,0.01405,0.14145,0.8098
0.03455,0.01305,0.14115,0.81125
0.03295,0.01235,0.1419,0.8128
0.03165,0.01295,0.14265,0.81275
0.0313,0.01305,0.1425,0.81315
0.03205,0.01255,0.1427,0.8127
0.03205,0.01195,0.14375,0.81225
0.03085,0.0124,0.14445,0.8123
0.02925,0.01265,0.1457,0.8124
0.0293,0.01255,0.1465,0.81165
0.0286,0.012,0.1475,0.8119
0.02865,0.01255,0.14765,0.81115
0.029,0.01165,0.14905,0.8103
0.02815,0.01095,0.1508,0.8101
0.0278,0.0112,0.1512,0.8098
0.02685,0.0108,0.1537,0.80865
0.02595,0.0112,0.15575,0.8071
0.02525,0.0106,0.157,0.80715
0.024,0.01095,0.15915,0.8059
0.0239,0.0102,0.15985,0.80605
0.02425,0.0097,0.16125,0.8048
0.0245,0.01,0.1633,0.8022
0.02385,0.0099,0.1644,0.80185
0.0242,0.00975,0.1652,0.80085
0.0228,0.0109,0.1659,0.8004
0.023,0.0111,0.16735,0.79855
0.0223,0.0108,0.16895,0.79795
0.02145,0.0109,0.171,0.79665
0.0211,0.01125,0.1728,0.79485
0.0207,0.0107,0.17425,0.79435
0.0212,0.00995,0.17605,0.7928
0.02125,0.0098,0.1772,0.79175
0.0215,0.0096,0.17865,0.79025
0.02155,0.00975,0.1801,0.7886
0.02095,0.0096,0.1821,0.78735
0.02065,0.01045,0.18275,0.78615
0.02125,0.00995,0.1845,0.7843
0.02035,0.0103,0.18605,0.7833
0.01985,0.01025,0.18795,0.78195
0.02015,0.00955,0.19,0.7803
0.01955,0.0104,0.19035,0.7797
0.01935,0.01005,0.19155,0.77905
0.01915,0.01015,0.19215,0.77855
0.0202,0.0099,0.1942,0.7757
0.0205,0.0096,0.19475,0.77515
0.02015,0.01075,0.19475,0.77435
0.02045,0.0112,0.19485,0.7735
0.02035,0.0115,0.1965,0.77165
0.0216,0.01005,0.19795,0.7704
0.0213,0.01065,0.19805,0.77
0.0209,0.011,0.19895,0.76915
0.02195,0.01085,0.20025,0.76695
0.0221,0.0105,0.20155,0.76585
0.02185,0.0111,0.20225,0.7648
0.02245,0.0111,0.2038,0.76265
0.02285,0.01035,0.20615,0.76065
0.0229,0.01015,0.2083,0.75865
0.02295,0.00955,0.20995,0.75755
0.0225,0.01045,0.2107,0.75635
0.0226,0.01045,0.21205,0.7549
0.02275,0.01055,0.21305,0.75365
0.02255,0.01075,0.2138,0.7529
0.0228,0.0112,0.2141,0.7519
0.02235,0.01145,0.21605,0.75015
0.02225,0.01225,0.21655,0.74895
0.02185,0.0121,0.2174,0.74865
0.0232,0.01145,0.21885,0.7465
0.0233,0.01245,0.2183,0.74595
0.02285,0.012,0.22035,0.7448
0.0234,0.01195,0.22155,0.7431
0.02435,0.01275,0.22155,0.74135
0.02415,0.0138,0.2211,0.74095
0.0243,0.0144,0.2213,0.74
0.0257,0.0141,0.22155,0.73865
0.02585,0.0146,0.2214,0.73815
0.0259,0.0148,0.22105,0.73825
0.0263,0.0152,0.21975,0.73875
0.0264,0.01675,0.21845,0.7384
0.0273,0.01565,0.21835,0.7387
0.0287,0.01595,0.2181,0.73725
0.0303,0.01595,0.21735,0.7364
0.0313,0.01695,0.2158,0.73595
0.03145,0.01805,0.2145,0.736
0.03195,0.01765,0.2151,0.7353
0.03295,0.018,0.21375,0.7353
0.0331,0.01795,0.2134,0.73555
0.0334,0.0185,0.21255,0.73555
0.03415,0.0197,0.2107,0.73545
0.03585,0.0189,0.21015,0.7351
0.036,0.01955,0.2086,0.73585
0.0366,0.02075,0.2068,0.73585
0.037,0.0204,0.20545,0.73715
0.0387,0.0199,0.2037,0.7377
0.03825,0.02085,0.20265,0.73825
0.0384,0.0208,0.2016,0.7392
0.0393,0.0213,0.1999,0.7395
0.03905,0.02095,0.19855,0.74145
0.03875,0.02015,0.1984,0.7427
0.0397,0.02085,0.1963,0.74315
0.04075,0.02045,0.19395,0.74485
0.03945,0.0201,0.19255,0.7479
0.03945,0.0215,0.1907,0.74835
0.0403,0.021,0.1889,0.7498
0.03965,0.0212,0.1877,0.75145
0.04085,0.0212,0.1863,0.75165
0.0411,0.02165,0.1852,0.75205
0.04105,0.0224,0.1834,0.75315
0.0421,0.0217,0.18195,0.75425
0.0426,0.02125,0.1814,0.75475
0.04385,0.01935,0.1809,0.7559
0.0432,0.01995,0.1804,0.75645
0.0446,0.0185,0.1792,0.7577
0.04315,0.0207,0.1768,0.75935
0.04365,0.02105,0.1755,0.7598
0.04375,0.02055,0.17505,0.76065
0.04285,0.0201,0.175,0.76205
0.04215,0.01945,0.1745,0.7639
0.04185,0.02,0.1736,0.76455
0.0421,0.01915,0.1734,0.76535
0.0408,0.0185,0.17325,0.76745
0.0404,0.0183,0.1728,0.7685
0.0389,0.0179,0.17375,0.76945
0.03835,0.01895,0.1735,0.7692
0.03875,0.01815,0.17275,0.77035
0.03995,0.0185,0.17175,0.7698
0.0407,0.01845,0.171,0.76985
0.04015,0.01925,0.17035,0.77025
0.03985,0.01835,0.17055,0.77125
0.0391,0.01825,0.17065,0.772
0.0385,0.0179,0.16945,0.77415
0.03905,0.01755,0.16845,0.77495
0.03925,0.01685,0.16905,0.77485
0.0385,0.0165,0.16935,0.77565
0.03735,0.0166,0.1704,0.77565
0.0375,0.0163,0.1703,0.7759
0.03655,0.01675,0.1708,0.7759
0.0363,0.0156,0.17155,0.77655
0.03605,0.01625,0.1706,0.7771
0.0363,0.0154,0.1709,0.7774
0.03545,0.01565,0.1721,0.7768
0.0355,0.01495,0.17355,0.776
0.0348,0.0158,0.1739,0.7755
0.03505,0.0157,0.17445,0.7748
0.03615,0.01505,0.1749,0.7739
0.03545,0.01535,0.1748,0.7744
0.03375,0.01715,0.1742,0.7749
0.0354,0.0164,0.1744,0.7738
0.03485,0.01625,0.17495,0.77395
0.03455,0.01645,0.17585,0.77315
0.03475,0.0159,0.17645,0.7729
0.0339,0.01625,0.17565,0.7742
0.03285,0.0162,0.17735,0.7736
0.03305,0.01545,0.17865,0.77285
0.03285,0.01565,0.1802,0.7713
0.0329,0.01565,0.18075,0.7707
0.0326,0.0155,0.1815,0.7704
0.0323,0.0163,0.18145,0.76995
0.03235,0.01525,0.1825,0.7699
0.03255,0.01505,0.1825,0.7699
0.0318,0.0161,0.182,0.7701
0.03305,0.0161,0.18145,0.7694
0.0332,0.01555,0.1823,0.76895
0.03285,0.01435,0.18285,0.76995
0.0323,0.014,0.18505,0.76865
0.03205,0.01355,0.1862,0.7682
0.0316,0.0141,0.1864,0.7679
0.03165,0.0151,0.1864,0.76685
0.0315,0.0155,0.18645,0.76655
0.03235,0.01465,0.1866,0.7664
0.03075,0.01465,0.1876,0.767
0.03055,0.01435,0.1882,0.7669
0.0315,0.01475,0.1882,0.76555
0.03265,0.01515,0.18835,0.76385
0.03105,0.01555,0.1894,0.764
0.0322,0.0153,0.1892,0.7633
0.0319,0.01565,0.18895,0.7635
0.0326,0.01645,0.18865,0.7623
0.0329,0.0161,0.1883,0.7627
0.03325,0.0163,0.18825,0.7622
0.03215,0.01705,0.18945,0.76135
0.0329,0.01705,0.18895,0.7611
0.03225,0.0178,0.18795,0.762
0.0332,0.0176,0.1877,0.7615
0.03285,0.01725,0.18755,0.76235
0.03345,0.01765,0.1874,0.7615
0.03445,0.0181,0.1865,0.76095
0.03465,0.0182,0.18585,0.7613
0.0338,0.018,0.1858,0.7624
0.03405,0.01725,0.18575,0.76295
0.03505,0.0172,0.18465,0.7631
0.035,0.01795,0.1844,0.76265
0.0354,0.0178,0.1839,0.7629
0.03605,0.0174,0.1837,0.76285
0.0347,0.01855,0.1836,0.76315
0.0357,0.01785,0.18345,0.763
0.0368,0.0175,0.18335,0.76235
0.03555,0.0186,0.18215,0.7637
0.0357,0.01875,0.18115,0.7644
0.0361,0.0183,0.18085,0.76475
0.0365,0.0179,0.1799,0.7657
0.03675,0.01805,0.17945,0.76575
0.0369,0.01725,0.1798,0.76605
0.037,0.0173,0.17965,0.76605
0.03745,0.0181,0.1779,0.76655
0.03725,0.0187,0.1773,0.76675
0.03775,0.0187,0.1779,0.76565
0.03825,0.01755,0.1778,0.7664
0.0381,0.018,0.17735,0.76655
0.0385,0.01775,0.1766,0.76715
0.03855,0.01825,0.17595,0.76725
0.03905,0.018,0.1762,0.76675
0.0388,0.019,0.1753,0.7669
0.03735,0.01935,0.17445,0.76885
0.0378,0.01845,0.1745,0.76925
0.0388,0.018,0.1742,0.769
0.0372,0.01805,0.17375,0.771
0.0364,0.0179,0.1736,0.7721
0.03605,0.01825,0.173,0.7727
0.0362,0.01815,0.17395,0.7717
0.03615,0.01765,0.1741,0.7721
0.03675,0.0178,0.17385,0.7716
0.0379,0.017,0.1743,0.7708
0.03745,0.0182,0.17295,0.7714
0.03745,0.01895,0.17375,0.76985
0.03805,0.0189,0.17265,0.7704
0.0379,0.0186,0.17295,0.77055
0.0378,0.0173,0.17295,0.77195
0.03825,0.0175,0.17245,0.7718
0.03915,0.0172,0.17245,0.7712
0.03875,0.0177,0.1722,0.77135
0.0391,0.01685,0.17205,0.772
0.0373,0.017,0.1739,0.7718
0.03685,0.01725,0.17365,0.77225
0.03665,0.01705,0.17435,0.77195
0.0362,0.01665,0.17455,0.7726
0.0371,0.01705,0.17385,0.772
0.0364,0.0187,0.1724,0.7725
0.03725,0.0172,0.17245,0.7731
0.0355,0.0168,0.17375,0.77395
0.03585,0.0166,0.17385,0.7737
0.0353,0.01735,0.17365,0.7737
0.03565,0.01655,0.1738,0.774
0.0353,0.0168,0.17415,0.77375
0.035,0.0164,0.17505,0.77355
0.0339,0.01625,0.17525,0.7746
0.033,0.016,0.17515,0.77585
0.03305,0.01575,0.1754,0.7758
0.0328,0.01425,0.17655,0.7764
0.0326,0.015,0.17655,0.77585
0.0329,0.01445,0.17675,0.7759
0.0331,0.0145,0.1773,0.7751
0.03135,0.0151,0.1781,0.77545
0.0314,0.01565,0.1775,0.77545
0.0325,0.01485,0.1787,0.77395
0.03255,0.01485,0.179,0.7736
0.0322,0.0135,0.1798,0.7745
0.0309,0.0148,0.1804,0.7739
0.0311,0.01525,0.17995,0.7737
0.0305,0.01555,0.1801,0.77385
0.03125,0.0159,0.18015,0.7727
0.0322,0.01555,0.1814,0.77085
0.0318,0.01535,0.18215,0.7707
0.0309,0.01495,0.18345,0.7707
0.0303,0.01505,0.18405,0.7706
0.03045,0.0152,0.1846,0.76975
0.0308,0.0149,0.185,0.7693
0.02985,0.0148,0.1862,0.76915
0.03075,0.01515,0.18735,0.76675
0.03225,0.01475,0.1871,0.7659
0.03185,0.0151,0.18765,0.7654
0.03165,0.0148,0.1886,0.76495
0.03085,0.0151,0.18905,0.765
0.0304,0.01595,0.1894,0.76425
0.03025,0.01615,0.18905,0.76455
0.0305,0.01655,0.18935,0.7636
0.03065,0.0158,0.1909,0.76265
0.03075,0.0159,0.19115,0.7622
0.03045,0.0168,0.1905,0.76225
0.03155,0.01595,0.19085,0.76165
0.03205,0.01565,0.1913,0.761
0.032,0.01645,0.19175,0.7598
0.0327,0.01695,0.19105,0.7593
0.033,0.0163,0.1918,0.7589
0.03295,0.01685,0.19195,0.75825
0.0327,0.01765,0.19135,0.7583
0.03255,0.0187,0.1902,0.75855
0.03435,0.0178,0.1904,0.75745
0.0351,0.0179,0.1897,0.7573
0.0366,0.01735,0.1884,0.75765
0.0376,0.01685,0.18795,0.7576
0.03645,0.01725,0.18855,0.75775
0.0361,0.0176,0.1882,0.7581
0.03445,0.0177,0.18755,0.7603
0.03445,0.01745,0.18725,0.76085
0.03465,0.0179,0.1876,0.75985
0.03615,0.0184,0.1858,0.75965
0.036,0.01885,0.18545,0.7597
0.03695,0.0185,0.1853,0.75925
0.03805,0.01895,0.1834,0.7596
0.0378,0.0195,0.1819,0.7608
0.03725,0.0191,0.1815,0.76215
0.03835,0.01845,0.1813,0.7619
0.03805,0.0184,0.18095,0.7626
0.03775,0.01785,0.18095,0.76345
0.0368,0.0177,0.18085,0.76465
0.036,0.01715,0.18155,0.7653
0.0356,0.0174,0.1812,0.7658
0.0348,0.0172,0.18225,0.76575
0.0356,0.0167,0.18185,0.76585
0.03605,0.01745,0.18115,0.76535
0.0355,0.01745,0.182,0.76505
0.0359,0.0178,0.1826,0.7637
0.0361,0.01685,0.18245,0.7646
0.0359,0.0177,0.18155,0.76485
0.03615,0.0173,0.18125,0.7653
0.0363,0.01775,0.1808,0.76515
0.03685,0.01645,0.18165,0.76505
0.0365,0.0172,0.1819,0.7644
0.0369,0.01715,0.18195,0.764
0.0365,0.01745,0.18085,0.7652
0.0368,0.0168,0.18085,0.76555
0.0364,0.01625,0.182,0.76535
0.03525,0.0187,0.18055,0.7655
0.03555,0.0191,0.1794,0.76595
0.03595,0.01865,0.17915,0.76625
0.03715,0.0177,0.17925,0.7659
0.03705,0.0175,0.17845,0.767
0.0359,0.01745,0.1792,0.76745
0.0358,0.01745,0.1803,0.76645
0.0368,0.0168,0.18045,0.76595
0.03495,0.0184,0.17985,0.7668
0.0366,0.01625,0.18055,0.7666
0.0359,0.01675,0.18095,0.7664
0.0354,0.0163,0.18125,0.76705
0.03475,0.01715,0.18135,0.76675
0.0347,0.01715,0.1812,0.76695
0.03575,0.0171,0.18145,0.7657
0.036,0.0162,0.18225,0.76555
0.03615,0.01585,0.1826,0.7654
0.03545,0.01565,0.1825,0.7664
0.03495,0.01585,0.18325,0.76595
0.03435,0.0168,0.18285,0.766
0.03485,0.0178,0.181,0.76635
0.0344,0.0181,0.1811,0.7664
0.0342,0.0176,0.1822,0.766
0.03505,0.0167,0.18245,0.7658
0.0341,0.0167,0.1828,0.7664
0.0331,0.0174,0.1826,0.7669
0.0344,0.01655,0.18315,0.7659
0.03365,0.01795,0.1824,0.766
0.0339,0.01745,0.1831,0.76555
0.0338,0.0172,0.18355,0.76545
0.03425,0.0169,0.1835,0.76535
0.0341,0.018,0.18245,0.76545
0.0345,0.01735,0.18295,0.7652
0.0348,0.01665,0.1837,0.76485
0.03475,0.0175,0.18315,0.7646
0.03445,0.01835,0.1834,0.7638
0.03365,0.0188,0.1833,0.76425
0.03445,0.01785,0.18315,0.76455
0.03475,0.018,0.1814,0.76585
0.0349,0.01725,0.18185,0.766
0.03605,0.0181,0.18085,0.765
0.03725,0.01725,0.18245,0.76305
0.0368,0.0174,0.18395,0.76185
0.03575,0.0172,0.18315,0.7639
0.0348,0.01765,0.18335,0.7642
0.0342,0.01725,0.18355,0.765
0.03435,0.0183,0.1831,0.76425
0.03525,0.0183,0.18245,0.764
0.03485,0.018,0.18225,0.7649
0.03535,0.01825,0.1819,0.7645
0.03575,0.0183,0.18205,0.7639
0.03525,0.01725,0.183,0.7645
0.03425,0.01745,0.18235,0.76595
0.03475,0.01725,0.1834,0.7646
0.0353,0.01675,0.1833,0.76465
0.03525,0.0162,0.1839,0.76465
0.0353,0.0163,0.1837,0.7647
0.03515,0.01645,0.18475,0.76365
0.0355,0.01645,0.18575,0.7623
0.0357,0.01615,0.18575,0.7624
0.0364,0.01595,0.1862,0.76145
0.0362,0.0176,0.1843,0.7619
0.03725,0.0161,0.18425,0.7624
0.03715,0.0171,0.18335,0.7624
0.03735,0.01835,0.1835,0.7608
0.0359,0.01895,0.18305,0.7621
0.0351,0.0191,0.18275,0.76305
0.0364,0.0186,0.1838,0.7612
0.03615,0.01905,0.1838,0.761
0.03635,0.01935,0.1835,0.7608
0.0361,0.0184,0.18515,0.76035
0.0355,0.0184,0.18585,0.76025
0.03605,0.018,0.1854,0.76055
0.03595,0.01795,0.1852,0.7609
0.03625,0.0181,0.18495,0.7607
0.0359,0.01845,0.18545,0.7602
0.037,0.01815,0.18585,0.759
0.03765,0.0188,0.18475,0.7588
0.0386,0.0174,0.18505,0.75895
0.03805,0.01795,0.1861,0.7579
0.038,0.01765,0.1852,0.75915
0.03875,0.01835,0.18435,0.75855
0.03815,0.01845,0.18385,0.75955
0.03815,0.0179,0.18435,0.7596
0.03845,0.0181,0.18455,0.7589
0.0386,0.0173,0.18535,0.75875
0.03885,0.01775,0.1846,0.7588
0.03875,0.0185,0.1825,0.76025
0.03835,0.01925,0.1818,0.7606
0.03925,0.0189,0.1809,0.76095
0.03895,0.01965,0.1802,0.7612
0.03925,0.01965,0.18,0.7611
0.03875,0.0195,0.17955,0.7622
0.03875,0.0188,0.1797,0.76275
0.0391,0.0187,0.1789,0.7633
0.03765,0.0193,0.17835,0.7647
0.03855,0.01965,0.17755,0.76425
0.03825,0.01895,0.1778,0.765
0.03825,0.0191,0.17815,0.7645
0.0385,0.0178,0.1782,0.7655
0.0379,0.0172,0.17885,0.76605
0.0369,0.01825,0.1779,0.76695
0.03745,0.0172,0.17845,0.7669
0.0374,0.01695,0.17845,0.7672
0.0369,0.01695,0.17855,0.7676
0.03555,0.0178,0.17965,0.767
0.0368,0.01765,0.1791,0.76645
0.03595,0.0179,0.17875,0.7674
0.0357,0.01805,0.1794,0.76685
0.03515,0.01755,0.17995,0.76735
0.0361,0.01715,0.17935,0.7674
0.0357,0.01745,0.1795,0.76735
0.0368,0.017,0.17965,0.76655
0.03695,0.01785,0.17895,0.76625
0.03795,0.0182,0.1774,0.76645
0.0395,0.0172,0.1773,0.766
0.039,0.01815,0.17685,0.766
0.03855,0.0172,0.177,0.76725
0.0382,0.01735,0.1755,0.76895
0.0383,0.01795,0.1748,0.76895
0.03775,0.01765,0.17365,0.77095
0.03835,0.0167,0.174,0.77095
0.03745,0.0178,0.17395,0.7708
0.03775,0.01845,0.17295,0.77085
0.0387,0.0177,0.173,0.7706
0.0382,0.0187,0.1725,0.7706
0.03855,0.01785,0.17195,0.77165
0.0373,0.0183,0.17145,0.77295
0.0376,0.01695,0.17185,0.7736
0.03785,0.01655,0.1723,0.7733
0.0367,0.0176,0.17195,0.77375
0.03615,0.01725,0.1725,0.7741
0.0358,0.01685,0.17195,0.7754
0.03455,0.0167,0.17175,0.777
0.03405,0.01755,0.1729,0.7755
0.03415,0.017,0.1745,0.77435
0.03325,0.0172,0.17545,0.7741
0.0329,0.01665,0.17535,0.7751
0.03265,0.01725,0.17585,0.77425
0.0339,0.01745,0.1757,0.77295
0.03285,0.0179,0.1749,0.77435
0.0328,0.01845,0.17465,0.7741
0.03355,0.01805,0.1752,0.7732
0.0336,0.01865,0.17515,0.7726
0.03385,0.01775,0.17515,0.77325
0.0344,0.01805,0.1745,0.77305
0.03505,0.0169,0.17555,0.7725
0.03505,0.01785,0.17495,0.77215
0.0356,0.0176,0.17465,0.77215
0.0356,0.0182,0.1745,0.7717
0.0354,0.0197,0.17345,0.77145
0.0363,0.0184,0.17355,0.77175
0.0374,0.01825,0.1734,0.77095
0.03795,0.017,0.1735,0.77155
0.0381,0.01685,0.1744,0.77065
0.0384,0.01655,0.17405,0.771
0.03865,0.017,0.17325,0.7711
0.03815,0.01725,0.17375,0.77085
0.03765,0.01795,0.17295,0.77145
0.03845,0.01725,0.17255,0.77175
0.03805,0.0174,0.17245,0.7721
0.0369,0.01785,0.17205,0.7732
0.0374,0.0175,0.172,0.7731
0.0372,0.01695,0.17205,0.7738
0.0366,0.017,0.1715,0.7749
0.0359,0.01715,0.1723,0.77465
