21.264000 21.429600 21.595200 21.760800 21.926400 22.092000 22.257600 22.423200
22.902400 23.080800 23.259200 23.437600 23.616000 23.794400 23.972800 24.151200
24.540800 24.732000 24.923200 25.114400 25.305600 25.496800 25.688000 25.879200
26.179200 26.383200 26.587200 26.791200 26.995200 27.199200 27.403200 27.607200
27.817600 28.034400 28.251200 28.468000 28.684800 28.901600 29.118400 29.335200
29.456000 29.685600 29.915200 30.144800 30.374400 30.604000 30.833600 31.063200
31.094400 31.336800 31.579200 31.821600 32.064000 32.306400 32.548800 32.791200
32.732800 32.988000 33.243200 33.498400 33.753600 34.008800 34.264000 34.519200


