
real	0m11,962s
user	0m11,933s
sys	0m0,028s

real	0m12,415s
user	0m12,407s
sys	0m0,008s

real	0m11,903s
user	0m11,899s
sys	0m0,004s

real	0m11,724s
user	0m11,708s
sys	0m0,016s

real	0m11,900s
user	0m11,886s
sys	0m0,012s

real	0m12,071s
user	0m12,059s
sys	0m0,012s

real	0m12,073s
user	0m12,061s
sys	0m0,012s

real	0m11,733s
user	0m11,709s
sys	0m0,024s

real	0m11,870s
user	0m11,866s
sys	0m0,004s

real	0m11,835s
user	0m11,827s
sys	0m0,008s

real	0m11,781s
user	0m11,773s
sys	0m0,008s

real	0m12,013s
user	0m12,007s
sys	0m0,004s

real	0m11,957s
user	0m11,949s
sys	0m0,008s

real	0m12,062s
user	0m12,053s
sys	0m0,008s

real	0m11,992s
user	0m11,988s
sys	0m0,004s

real	0m12,001s
user	0m12,000s
sys	0m0,000s
f.rb:2:in `fibb': Interrupt
	from f.rb:4:in `fibb'
	from f.rb:4:in `fibb'
	from f.rb:4:in `fibb'
	from f.rb:4:in `fibb'
	from f.rb:4:in `fibb'
	from f.rb:4:in `fibb'
	from f.rb:4:in `fibb'
	from f.rb:4:in `fibb'
	from f.rb:4:in `fibb'
	from f.rb:4:in `fibb'
	from f.rb:4:in `fibb'
	from f.rb:4:in `fibb'
	from f.rb:4:in `fibb'
	from f.rb:4:in `fibb'
	from f.rb:4:in `fibb'
	from f.rb:4:in `fibb'
	from f.rb:4:in `fibb'
	from f.rb:4:in `fibb'
	from f.rb:4:in `fibb'
	from f.rb:4:in `fibb'
	from f.rb:4:in `fibb'
	from f.rb:4:in `fibb'
	from f.rb:4:in `fibb'
	from f.rb:4:in `fibb'
	from f.rb:4:in `fibb'
	from f.rb:4:in `fibb'
	from f.rb:4:in `fibb'
	from f.rb:4:in `fibb'
	from f.rb:4:in `fibb'
	from f.rb:7:in `<main>'
