
real	1m58,749s
user	1m58,730s
sys	0m0,012s

real	1m58,858s
user	1m58,835s
sys	0m0,016s

real	1m58,758s
user	1m58,737s
sys	0m0,012s

real	1m58,973s
user	1m58,955s
sys	0m0,008s

real	1m58,483s
user	1m58,463s
sys	0m0,012s

real	1m58,780s
user	1m58,750s
sys	0m0,020s

real	1m59,072s
user	1m59,053s
sys	0m0,012s

real	1m58,734s
user	1m58,722s
sys	0m0,004s

real	1m58,493s
user	1m58,477s
sys	0m0,008s

real	1m58,987s
user	1m58,968s
sys	0m0,008s
