I,E,S,R
0.001,0.0006,0.9984,0
0.00105,0.0014,0.99745,0.0001
0.0013,0.0022,0.9963,0.0002
0.0017,0.00255,0.9954,0.00035
0.00225,0.00295,0.9943,0.0005
0.0029,0.00425,0.99205,0.0008
0.00395,0.0064,0.98875,0.0009
0.00495,0.0083,0.98535,0.0014
0.00695,0.0102,0.98085,0.002
0.00845,0.01385,0.9746,0.0031
0.0113,0.01665,0.9675,0.00455
0.0142,0.02225,0.9575,0.00605
0.0184,0.0293,0.94465,0.00765
0.0242,0.03905,0.92685,0.0099
0.0331,0.0481,0.9055,0.0133
0.04345,0.0615,0.87785,0.0172
0.05535,0.07665,0.8452,0.0228
0.0693,0.09665,0.8032,0.03085
0.0883,0.11825,0.7545,0.03895
0.11185,0.1397,0.69795,0.0505
0.1377,0.1637,0.6342,0.0644
0.16525,0.1873,0.564,0.08345
0.19565,0.20845,0.4915,0.1044
0.2298,0.2246,0.41565,0.12995
0.2643,0.23235,0.3432,0.16015
0.29675,0.23135,0.278,0.1939
0.3216,0.22705,0.21855,0.2328
0.34355,0.2103,0.17045,0.2757
0.35795,0.1913,0.13035,0.3204
0.3648,0.16935,0.09835,0.3675
0.3639,0.1461,0.074,0.416
0.35615,0.1239,0.05575,0.4642
0.34445,0.1014,0.04395,0.5102
0.329,0.08285,0.03485,0.5533
0.3106,0.067,0.0288,0.5936
0.2886,0.05335,0.02425,0.6338
0.26645,0.0428,0.02115,0.6696
0.2433,0.0355,0.0184,0.7028
0.22325,0.0277,0.01775,0.7313
0.2008,0.0226,0.01715,0.75945
0.18285,0.01945,0.017,0.7807
0.1626,0.01585,0.01745,0.8041
0.1469,0.0131,0.01785,0.82215
0.12985,0.01015,0.02025,0.83975
0.1139,0.0097,0.0216,0.8548
0.1014,0.0086,0.0222,0.8678
0.08935,0.00705,0.024,0.8796
0.07825,0.0063,0.02555,0.8899
0.06885,0.00565,0.02775,0.89775
0.06075,0.00505,0.03005,0.90415
0.0545,0.0053,0.0324,0.9078
0.0478,0.00525,0.03395,0.913
0.04345,0.0052,0.03555,0.9158
0.0394,0.0046,0.03695,0.91905
0.03525,0.00375,0.0396,0.9214
0.03115,0.0035,0.04295,0.9224
0.0269,0.0031,0.04535,0.92465
0.0238,0.003,0.04795,0.92525
0.02145,0.0028,0.05135,0.9244
0.019,0.00265,0.05415,0.9242
0.01655,0.00255,0.0564,0.9245
0.01525,0.0022,0.05905,0.9235
0.01355,0.0021,0.06205,0.9223
0.0119,0.0024,0.0653,0.9204
0.01125,0.0023,0.0685,0.91795
0.01055,0.0022,0.07105,0.9162
0.0094,0.00205,0.0738,0.91475
0.0089,0.0021,0.0767,0.9123
0.00825,0.0022,0.07915,0.9104
0.00775,0.002,0.08245,0.9078
0.00705,0.00175,0.0854,0.9058
0.0065,0.0017,0.0878,0.904
0.00585,0.0018,0.0903,0.90205
0.00575,0.0016,0.09315,0.8995
0.00505,0.00185,0.0951,0.898
0.00505,0.00165,0.0973,0.896
0.00485,0.0018,0.0999,0.89345
0.0047,0.0016,0.10285,0.89085
0.00435,0.0018,0.1046,0.88925
0.00435,0.00145,0.1079,0.8863
0.0041,0.0014,0.11095,0.88355
0.00415,0.0012,0.1138,0.88085
0.004,0.0013,0.1168,0.8779
0.00385,0.00125,0.1196,0.8753
0.00365,0.0012,0.1217,0.87345
0.0035,0.0011,0.1245,0.8709
0.00275,0.0014,0.12655,0.8693
0.00265,0.0016,0.1292,0.86655
0.00255,0.00155,0.1313,0.8646
0.00245,0.0013,0.13345,0.8628
0.0024,0.0013,0.13615,0.86015
0.0024,0.00125,0.13815,0.8582
0.0021,0.00115,0.1404,0.85635
0.0022,0.00105,0.1429,0.85385
0.00215,0.001,0.14505,0.8518
0.00195,0.0009,0.14765,0.8495
0.00205,0.001,0.14995,0.847
0.0019,0.0009,0.1528,0.8444
0.00175,0.001,0.1553,0.84195
0.00205,0.0007,0.15765,0.8396
0.002,0.00065,0.16035,0.837
0.00175,0.00085,0.16235,0.83505
0.00195,0.0007,0.16445,0.8329
0.0018,0.0012,0.1666,0.8304
0.00185,0.0012,0.16925,0.8277
0.00175,0.00105,0.17105,0.82615
0.00175,0.0011,0.173,0.82415
0.0019,0.00095,0.17565,0.8215
0.00185,0.0013,0.17735,0.8195
0.002,0.0013,0.18,0.8167
0.0022,0.00105,0.1818,0.81495
0.00235,0.00095,0.1841,0.8126
0.00205,0.0011,0.1861,0.81075
0.0022,0.001,0.188,0.8088
0.0021,0.0011,0.19005,0.80675
0.0023,0.00085,0.192,0.80485
0.00205,0.00125,0.1943,0.8024
0.00205,0.00135,0.1964,0.8002
0.00215,0.00115,0.19905,0.79765
0.00235,0.001,0.2018,0.79485
0.00215,0.00135,0.2037,0.7928
0.00215,0.0013,0.20575,0.7908
0.00215,0.00135,0.20675,0.78975
0.00205,0.0013,0.20905,0.7876
0.00225,0.0013,0.21095,0.7855
0.0023,0.0012,0.21325,0.78325
0.0023,0.0015,0.21535,0.78085
0.00235,0.0014,0.21735,0.7789
0.0025,0.00125,0.21925,0.777
0.00255,0.00125,0.22125,0.77495
0.00235,0.00125,0.2228,0.7736
0.0025,0.00095,0.2246,0.77195
0.0024,0.00115,0.2263,0.77015
0.00275,0.00105,0.2283,0.7679
0.00275,0.0013,0.2302,0.76575
0.0024,0.0017,0.23245,0.76345
0.00275,0.00195,0.23415,0.76115
0.00295,0.0017,0.23575,0.7596
0.00305,0.00165,0.2376,0.7577
0.0033,0.0017,0.2399,0.7551
0.00305,0.00205,0.2416,0.7533
0.00355,0.002,0.24315,0.7513
0.00315,0.0023,0.24485,0.7497
0.00325,0.0022,0.2468,0.74775
0.0041,0.00195,0.24775,0.7462
0.00355,0.0021,0.24905,0.7453
0.0037,0.00205,0.25075,0.7435
0.00365,0.002,0.25255,0.7418
0.0038,0.00215,0.2539,0.74015
0.0036,0.0021,0.2555,0.7388
0.00355,0.0028,0.2562,0.73745
0.00375,0.0028,0.25765,0.7358
0.0039,0.00255,0.2592,0.73435
0.004,0.00235,0.26,0.73365
0.00405,0.0027,0.26115,0.7321
0.00385,0.00295,0.2619,0.7313
0.00395,0.0027,0.26305,0.7303
0.00425,0.00265,0.26505,0.72805
0.00475,0.00255,0.2665,0.7262
0.00465,0.00265,0.26795,0.72475
0.00475,0.0027,0.2693,0.72325
0.0053,0.0024,0.2706,0.7217
0.00535,0.00305,0.2719,0.7197
0.00535,0.0032,0.27295,0.7185
0.00625,0.0036,0.2735,0.71665
0.0062,0.00395,0.2739,0.71595
0.00685,0.0038,0.27485,0.7145
0.0072,0.0042,0.2759,0.7127
0.008,0.0035,0.2777,0.7108
0.0079,0.0041,0.2789,0.7091
0.00835,0.00495,0.2786,0.7081
0.00875,0.0049,0.2796,0.70675
0.009,0.0054,0.2796,0.706
0.01005,0.00605,0.27885,0.70505
0.0097,0.00645,0.27915,0.7047
0.0106,0.0066,0.2794,0.7034
0.01105,0.0073,0.27935,0.7023
0.011,0.00885,0.27845,0.7017
0.0125,0.00915,0.277,0.70135
0.0141,0.00905,0.27615,0.7007
0.0149,0.01,0.27485,0.70025
0.01665,0.00995,0.27385,0.69955
0.01695,0.01045,0.273,0.6996
0.01725,0.0117,0.271,0.70005
0.01845,0.01135,0.26965,0.70055
0.0189,0.01205,0.2685,0.70055
0.0206,0.01195,0.26615,0.7013
0.0215,0.013,0.265,0.7005
0.0222,0.01415,0.2617,0.70195
0.02395,0.01475,0.2596,0.7017
0.0242,0.01435,0.2585,0.70295
0.02465,0.01585,0.25625,0.70325
0.0255,0.01685,0.25315,0.7045
0.02645,0.0174,0.24925,0.7069
0.028,0.0172,0.2466,0.7082
0.0297,0.0179,0.24305,0.70935
0.03075,0.01825,0.23965,0.71135
0.03295,0.0186,0.23615,0.7123
0.03325,0.0194,0.2336,0.71375
0.03595,0.0202,0.2287,0.71515
0.03615,0.0207,0.22495,0.7182
0.0352,0.02195,0.2215,0.72135
0.0366,0.02025,0.21975,0.7234
0.0383,0.0203,0.216,0.7254
0.03855,0.0211,0.2124,0.72795
0.0403,0.02205,0.20695,0.7307
0.0417,0.02275,0.202,0.73355
0.0438,0.02245,0.1983,0.73545
0.04485,0.02295,0.19505,0.73715
0.04465,0.0234,0.1916,0.74035
0.04515,0.0239,0.1873,0.74365
0.0452,0.02445,0.1842,0.74615
0.0454,0.0249,0.18,0.7497
0.04715,0.02375,0.1766,0.7525
0.04815,0.02195,0.1743,0.7556
0.0477,0.0222,0.17085,0.75925
0.0493,0.02135,0.16725,0.7621
0.0496,0.02075,0.16425,0.7654
0.0494,0.021,0.16035,0.76925
0.04835,0.02075,0.159,0.7719
0.04805,0.02075,0.15655,0.77465
0.04675,0.02005,0.15515,0.77805
0.04635,0.0194,0.15365,0.7806
0.0458,0.0185,0.15205,0.78365
0.04555,0.01875,0.1497,0.786
0.0439,0.01895,0.1493,0.78785
0.04325,0.02005,0.1473,0.7894
0.04405,0.01855,0.1459,0.7915
0.04375,0.01765,0.14495,0.79365
0.0425,0.0181,0.14375,0.79565
0.0415,0.01775,0.143,0.79775
0.04165,0.0181,0.1411,0.79915
0.04125,0.01655,0.1415,0.8007
0.04005,0.01685,0.1406,0.8025
0.03965,0.01625,0.14095,0.80315
0.0373,0.0154,0.14175,0.80555
0.0363,0.0157,0.1413,0.8067
0.03575,0.0152,0.1411,0.80795
0.0351,0.0142,0.14155,0.80915
0.03435,0.01365,0.14175,0.81025
0.03395,0.01225,0.14195,0.81185
0.0325,0.0117,0.1434,0.8124
0.0319,0.0121,0.1433,0.8127
0.03075,0.01225,0.14395,0.81305
0.03005,0.0109,0.145,0.81405
0.02895,0.01055,0.14615,0.81435
0.02855,0.01055,0.14755,0.81335
0.0278,0.01085,0.14795,0.8134
0.02735,0.0104,0.15025,0.812
0.0266,0.0101,0.15275,0.81055
0.0253,0.0097,0.15485,0.81015
0.0254,0.0096,0.15635,0.80865
0.02415,0.01025,0.15675,0.80885
0.02375,0.01015,0.15855,0.80755
0.023,0.0106,0.15905,0.80735
0.0229,0.00975,0.161,0.80635
0.02315,0.00935,0.1622,0.8053
0.0224,0.00935,0.1649,0.80335
0.02205,0.0094,0.1657,0.80285
0.02245,0.00995,0.16745,0.80015
0.02155,0.01005,0.1697,0.7987
0.0217,0.00985,0.1713,0.79715
0.0217,0.0095,0.17355,0.79525
0.02205,0.00945,0.17605,0.79245
0.02085,0.0097,0.1781,0.79135
0.021,0.0095,0.17985,0.78965
0.0208,0.0096,0.1812,0.7884
0.02125,0.01,0.18285,0.7859
0.0208,0.0098,0.18455,0.78485
0.02,0.00945,0.18685,0.7837
0.0204,0.0095,0.1882,0.7819
0.0208,0.0091,0.1896,0.7805
0.02045,0.00895,0.1919,0.7787
0.02075,0.00925,0.1929,0.7771
0.01975,0.01035,0.19335,0.77655
0.02015,0.00955,0.1954,0.7749
0.02085,0.0103,0.1955,0.77335
0.0212,0.0101,0.197,0.7717
0.0215,0.00995,0.1981,0.77045
0.02065,0.01045,0.199,0.7699
0.02105,0.00975,0.2011,0.7681
0.0207,0.0103,0.2017,0.7673
0.02065,0.0103,0.2034,0.76565
0.02115,0.01005,0.20405,0.76475
0.0209,0.01015,0.20555,0.7634
0.02135,0.0105,0.2062,0.76195
0.0214,0.0113,0.2065,0.7608
0.0215,0.0111,0.20835,0.75905
0.02155,0.0114,0.2097,0.75735
0.02185,0.01125,0.21075,0.75615
0.02195,0.0119,0.21165,0.7545
0.02265,0.01225,0.2121,0.753
0.02275,0.0125,0.213,0.75175
0.0224,0.01275,0.21445,0.7504
0.0229,0.0126,0.21595,0.74855
0.02275,0.0135,0.2156,0.74815
0.02405,0.01245,0.21595,0.74755
0.0248,0.01215,0.2164,0.74665
0.02485,0.01275,0.21725,0.74515
0.02505,0.0131,0.21825,0.7436
0.02535,0.01345,0.2184,0.7428
0.02555,0.0131,0.2185,0.74285
0.0249,0.01385,0.2188,0.74245
0.02545,0.01525,0.2175,0.7418
0.02535,0.017,0.2167,0.74095
0.0269,0.017,0.216,0.7401
0.02825,0.0162,0.2163,0.73925
0.02945,0.0166,0.216,0.73795
0.03035,0.0166,0.21565,0.7374
0.03045,0.0168,0.2149,0.73785
0.03105,0.01745,0.2145,0.737
0.0327,0.0172,0.2122,0.7379
0.033,0.017,0.2107,0.7393
0.03375,0.01715,0.20845,0.74065
0.03385,0.01785,0.20745,0.74085
0.0352,0.0177,0.2062,0.7409
0.03595,0.01685,0.20615,0.74105
0.03675,0.0164,0.2053,0.74155
0.036,0.01735,0.20395,0.7427
0.0351,0.0186,0.2031,0.7432
0.03635,0.0193,0.20145,0.7429
0.03755,0.0183,0.2006,0.74355
0.03675,0.0187,0.2004,0.74415
0.03815,0.01845,0.2003,0.7431
0.0375,0.0187,0.1989,0.7449
0.0366,0.01935,0.19795,0.7461
0.0383,0.01905,0.1961,0.74655
0.03975,0.0194,0.1942,0.74665
0.03925,0.02,0.1931,0.74765
0.0398,0.01965,0.19265,0.7479
0.03995,0.01875,0.19245,0.74885
0.04075,0.0194,0.1898,0.75005
0.04065,0.02,0.18835,0.751
0.0411,0.02055,0.18705,0.7513
0.04075,0.0217,0.18505,0.7525
0.04065,0.02165,0.1835,0.7542
0.04155,0.022,0.18145,0.755
0.04175,0.02125,0.1813,0.7557
0.0428,0.02065,0.1804,0.75615
0.04255,0.02045,0.18005,0.75695
0.0419,0.0214,0.1782,0.7585
0.04185,0.0213,0.17695,0.7599
0.0434,0.02025,0.1774,0.75895
0.04375,0.0201,0.1766,0.75955
0.04205,0.02065,0.17635,0.76095
0.042,0.0202,0.1765,0.7613
0.0424,0.0194,0.17675,0.76145
0.04215,0.02,0.1758,0.76205
0.0418,0.01975,0.17475,0.7637
0.0416,0.02045,0.1733,0.76465
0.04105,0.0208,0.1717,0.76645
0.04165,0.01995,0.1714,0.767
0.0418,0.02015,0.17115,0.7669
0.04145,0.0194,0.17085,0.7683
0.0406,0.01985,0.1709,0.76865
0.0413,0.01885,0.17035,0.7695
0.0418,0.0198,0.1705,0.7679
0.042,0.01845,0.1711,0.76845
0.04165,0.0183,0.17005,0.77
0.0416,0.01735,0.16995,0.7711
0.04215,0.01615,0.16905,0.77265
0.0403,0.01815,0.16765,0.7739
0.04025,0.01735,0.168,0.7744
0.0397,0.0176,0.1674,0.7753
0.03905,0.0174,0.16725,0.7763
0.0386,0.01715,0.16715,0.7771
0.03775,0.0181,0.16785,0.7763
0.03675,0.01925,0.1659,0.7781
0.0376,0.0182,0.16615,0.77805
0.03785,0.0178,0.1671,0.77725
0.03835,0.0175,0.16705,0.7771
0.0384,0.0178,0.16695,0.77685
0.03935,0.017,0.16685,0.7768
0.0387,0.0173,0.16645,0.77755
0.0388,0.01815,0.16585,0.7772
0.039,0.018,0.1668,0.7762
0.039,0.0182,0.1668,0.776
0.04025,0.0176,0.1661,0.77605
0.0386,0.01765,0.1667,0.77705
0.0378,0.01915,0.16625,0.7768
0.03785,0.01855,0.1662,0.7774
0.03825,0.01845,0.1656,0.7777
0.03715,0.01805,0.16625,0.77855
0.03675,0.0169,0.1679,0.77845
0.03565,0.0163,0.1695,0.77855
0.035,0.0159,0.16985,0.77925
0.03545,0.0157,0.1701,0.77875
0.0352,0.015,0.17045,0.77935
0.0352,0.01515,0.17145,0.7782
0.03555,0.0151,0.1712,0.77815
0.03565,0.01465,0.17135,0.77835
0.03495,0.0146,0.17195,0.7785
0.03455,0.01505,0.17275,0.77765
0.0336,0.0153,0.17425,0.77685
0.0333,0.01525,0.17515,0.7763
0.03255,0.01595,0.17485,0.77665
0.0328,0.01455,0.17625,0.7764
0.0322,0.01445,0.1769,0.77645
0.0316,0.0148,0.17795,0.77565
0.03115,0.0157,0.1784,0.77475
0.0316,0.0151,0.17885,0.77445
0.03195,0.01425,0.17985,0.77395
0.0314,0.01465,0.18025,0.7737
0.03075,0.01525,0.18055,0.77345
0.0302,0.0161,0.18075,0.77295
0.03135,0.0149,0.18165,0.7721
0.03235,0.01455,0.1814,0.7717
0.03225,0.0155,0.18135,0.7709
0.03265,0.0154,0.18085,0.7711
0.03245,0.01625,0.18055,0.77075
0.03305,0.0166,0.18045,0.7699
0.0338,0.01575,0.18175,0.7687
0.0347,0.01605,0.18135,0.7679
0.0345,0.01685,0.1817,0.76695
0.033,0.0172,0.18195,0.76785
0.0331,0.0165,0.1827,0.7677
0.03305,0.01745,0.18295,0.76655
0.03365,0.0179,0.18295,0.7655
0.0342,0.01795,0.1829,0.76495
0.03555,0.0169,0.18305,0.7645
0.03555,0.0174,0.1822,0.76485
0.0344,0.01825,0.1815,0.76585
0.0346,0.0192,0.1818,0.7644
0.0355,0.0184,0.18205,0.76405
0.03685,0.0178,0.18225,0.7631
0.03695,0.0162,0.1832,0.76365
0.0363,0.0166,0.18275,0.76435
0.0367,0.01675,0.1823,0.76425
0.03685,0.01735,0.1816,0.7642
0.03695,0.01775,0.18005,0.76525
0.03725,0.0186,0.17835,0.7658
0.0374,0.0186,0.1777,0.7663
0.03825,0.0167,0.17835,0.7667
0.03805,0.01655,0.1773,0.7681
0.038,0.0162,0.1765,0.7693
0.03855,0.01715,0.17565,0.76865
0.03855,0.01725,0.1742,0.77
0.03845,0.0175,0.1741,0.76995
0.03795,0.01885,0.17295,0.77025
0.03795,0.01865,0.17295,0.77045
0.038,0.0197,0.172,0.7703
0.03815,0.0194,0.17225,0.7702
0.0392,0.019,0.17165,0.77015
0.0392,0.0193,0.17105,0.77045
0.0396,0.0185,0.1711,0.7708
0.0398,0.0181,0.1701,0.772
0.03985,0.0186,0.16845,0.7731
0.03945,0.0196,0.1665,0.77445
0.03915,0.01975,0.16635,0.77475
0.0403,0.01835,0.1662,0.77515
0.03985,0.01745,0.1666,0.7761
0.0401,0.01765,0.16575,0.7765
0.0402,0.01705,0.16565,0.7771
0.04015,0.0174,0.1649,0.77755
0.0403,0.017,0.16465,0.77805
0.0387,0.01785,0.16355,0.7799
0.03925,0.01715,0.164,0.7796
0.03905,0.01685,0.16435,0.77975
0.03895,0.01735,0.1637,0.78
0.037,0.0177,0.16375,0.78155
0.0371,0.01695,0.164,0.78195
0.0361,0.01695,0.1643,0.78265
0.0346,0.0176,0.1635,0.7843
0.03365,0.0176,0.16385,0.7849
0.034,0.01705,0.16395,0.785
0.0351,0.0157,0.16415,0.78505
0.0335,0.01675,0.165,0.78475
0.0338,0.0159,0.1656,0.7847
0.03285,0.0158,0.16625,0.7851
0.03325,0.016,0.16595,0.7848
0.03375,0.0157,0.16605,0.7845
0.03365,0.0152,0.16645,0.7847
0.0332,0.01615,0.1672,0.78345
0.034,0.01485,0.16875,0.7824
0.033,0.0159,0.16845,0.78265
0.03395,0.0157,0.1699,0.78045
0.0332,0.01605,0.17065,0.7801
0.0332,0.01585,0.17065,0.7803
0.0327,0.01655,0.1711,0.77965
0.03335,0.0173,0.1705,0.77885
0.0334,0.0179,0.1702,0.7785
0.03475,0.0169,0.16935,0.779
0.03525,0.01645,0.1707,0.7776
0.03505,0.016,0.1706,0.77835
0.0354,0.01635,0.1712,0.77705
0.03475,0.01625,0.17165,0.77735
0.0351,0.01595,0.17225,0.7767
0.0343,0.01615,0.17245,0.7771
0.03375,0.01575,0.17295,0.77755
0.0339,0.0151,0.1747,0.7763
0.03345,0.01515,0.1758,0.7756
0.0334,0.0159,0.1769,0.7738
0.03255,0.01575,0.1767,0.775
0.03215,0.01515,0.17805,0.77465
0.0325,0.01475,0.1785,0.77425
0.03275,0.015,0.1792,0.77305
0.03385,0.0145,0.1789,0.77275
0.0342,0.0145,0.17955,0.77175
0.03325,0.01505,0.18055,0.77115
0.034,0.0151,0.18055,0.77035
0.033,0.01565,0.18045,0.7709
0.03235,0.01525,0.18115,0.77125
0.03245,0.01555,0.1803,0.7717
0.0326,0.0166,0.1801,0.7707
0.0342,0.0155,0.18005,0.77025
0.033,0.0156,0.18035,0.77105
0.03385,0.0147,0.18125,0.7702
0.0336,0.0165,0.18,0.7699
0.03435,0.0152,0.1808,0.76965
0.03335,0.01505,0.1817,0.7699
0.0337,0.01575,0.18095,0.7696
0.03285,0.0168,0.1806,0.76975
0.03355,0.01695,0.1807,0.7688
0.03455,0.0155,0.182,0.76795
0.0343,0.0154,0.18325,0.76705
0.0337,0.01655,0.183,0.76675
0.034,0.01505,0.18475,0.7662
0.03365,0.0148,0.18565,0.7659
0.03365,0.0144,0.18605,0.7659
0.0335,0.01485,0.1861,0.76555
0.03235,0.0169,0.18575,0.765
0.0329,0.01605,0.18575,0.7653
0.03195,0.01645,0.18605,0.76555
0.03245,0.01595,0.1865,0.7651
0.03315,0.01545,0.18575,0.76565
0.0335,0.01555,0.18585,0.7651
0.03275,0.0153,0.18625,0.7657
0.03225,0.01615,0.18595,0.76565
0.0326,0.0174,0.1847,0.7653
0.03295,0.01675,0.18535,0.76495
0.0337,0.01675,0.18515,0.7644
0.0338,0.0169,0.18555,0.76375
0.03505,0.0167,0.1846,0.76365
0.03385,0.0179,0.1839,0.76435
0.0344,0.017,0.18285,0.76575
0.03355,0.0175,0.182,0.76695
0.03485,0.0167,0.18235,0.7661
0.0357,0.01595,0.18295,0.7654
0.0353,0.0168,0.18175,0.76615
0.0355,0.018,0.18095,0.76555
0.0363,0.01775,0.1802,0.76575
0.0365,0.01725,0.18125,0.765
0.0364,0.017,0.1815,0.7651
0.03695,0.01645,0.1814,0.7652
0.0356,0.01625,0.183,0.76515
0.03515,0.016,0.18385,0.765
0.03545,0.0151,0.1837,0.76575
0.03385,0.0162,0.1834,0.76655
0.03315,0.01605,0.18395,0.76685
0.03395,0.0152,0.18525,0.7656
0.0329,0.0158,0.1864,0.7649
0.03265,0.0157,0.18735,0.7643
0.0333,0.0158,0.1868,0.7641
0.03315,0.0159,0.18745,0.7635
0.03275,0.015,0.18775,0.7645
0.03305,0.0147,0.18895,0.7633
0.0333,0.01565,0.1896,0.76145
0.03295,0.01625,0.1894,0.7614
0.0338,0.0161,0.18915,0.76095
0.03385,0.01605,0.18945,0.76065
0.0344,0.01595,0.1896,0.76005
0.03485,0.01665,0.1885,0.76
0.03645,0.01545,0.18975,0.75835
0.0362,0.0158,0.1898,0.7582
0.03555,0.0153,0.1906,0.75855
0.03545,0.01665,0.19035,0.75755
0.0349,0.0181,0.18985,0.75715
0.03545,0.01795,0.19035,0.75625
0.03575,0.0184,0.1889,0.75695
0.03535,0.0177,0.1887,0.75825
0.03565,0.0175,0.18815,0.7587
0.03505,0.0178,0.1883,0.75885
0.03595,0.01665,0.19,0.7574
0.0353,0.01675,0.1895,0.75845
0.03455,0.0175,0.1887,0.75925
0.03445,0.0189,0.1877,0.75895
0.0356,0.01775,0.1877,0.75895
0.03655,0.0176,0.18835,0.7575
0.03685,0.01725,0.1877,0.7582
0.03655,0.01765,0.18745,0.75835
0.03655,0.01795,0.1867,0.7588
0.0368,0.01855,0.18555,0.7591
0.0378,0.018,0.1854,0.7588
0.038,0.01775,0.18505,0.7592
0.0378,0.01685,0.18615,0.7592
0.0369,0.0185,0.18495,0.75965
0.03745,0.0175,0.18575,0.7593
0.0378,0.0174,0.1859,0.7589
0.0375,0.01735,0.18575,0.7594
0.0376,0.0171,0.1864,0.7589
0.0376,0.0175,0.18645,0.75845
0.03765,0.0175,0.18695,0.7579
0.03755,0.01875,0.18655,0.75715
0.038,0.01885,0.1865,0.75665
0.0379,0.0189,0.1862,0.757
0.0396,0.01895,0.18615,0.7553
0.0393,0.01875,0.1858,0.75615
0.04015,0.0178,0.18535,0.7567
0.04,0.0182,0.18565,0.75615
0.03995,0.0183,0.1862,0.75555
0.0399,0.0177,0.1862,0.7562
0.0394,0.01865,0.1851,0.75685
0.03955,0.0183,0.18555,0.7566
0.03885,0.0195,0.185,0.75665
0.03935,0.0203,0.18275,0.7576
0.04065,0.0204,0.18125,0.7577
0.0404,0.02015,0.1817,0.75775
0.04075,0.0196,0.1815,0.75815
0.04075,0.0194,0.1805,0.75935
0.0413,0.01965,0.17955,0.7595
0.04215,0.0194,0.17835,0.7601
0.0417,0.02005,0.17625,0.762
0.04225,0.01955,0.176,0.7622
0.04315,0.0186,0.17525,0.763
0.04175,0.0192,0.1744,0.76465
0.04105,0.0194,0.1741,0.76545
0.04075,0.02,0.173,0.76625
0.04075,0.01945,0.1741,0.7657
0.0409,0.01885,0.17445,0.7658
0.0423,0.01815,0.17285,0.7667
0.0416,0.01825,0.1724,0.76775
0.0417,0.0189,0.17155,0.76785
0.04165,0.01835,0.1708,0.7692
0.04045,0.01975,0.16965,0.77015
0.0403,0.019,0.16895,0.77175
0.0405,0.0199,0.1679,0.7717
0.0403,0.02,0.16715,0.77255
0.041,0.0194,0.16715,0.77245
0.0392,0.01965,0.16665,0.7745
0.03895,0.01925,0.1667,0.7751
0.03845,0.01905,0.16775,0.77475
0.03865,0.01815,0.16875,0.77445
0.03805,0.0183,0.1682,0.77545
0.03795,0.01845,0.16775,0.77585
0.03825,0.0181,0.1678,0.77585
0.03755,0.01925,0.1667,0.7765
0.03865,0.0187,0.16675,0.7759
0.04005,0.0181,0.16685,0.775
0.0388,0.01815,0.16675,0.7763
0.0387,0.0176,0.1679,0.7758
0.039,0.0181,0.1671,0.7758
0.03785,0.01725,0.16785,0.77705
0.0382,0.01715,0.1684,0.77625
0.03865,0.01675,0.16845,0.77615
0.039,0.01545,0.1697,0.77585
0.0384,0.01485,0.1703,0.77645
0.0375,0.01505,0.1702,0.77725
0.03735,0.017,0.16865,0.777
0.0373,0.0175,0.16865,0.77655
0.03795,0.01685,0.169,0.7762
0.0387,0.01695,0.16855,0.7758
0.03815,0.01705,0.1692,0.7756
0.0378,0.01695,0.16825,0.777
0.0376,0.01615,0.1685,0.77775
0.0375,0.01605,0.16895,0.7775
0.0364,0.0168,0.1694,0.7774
0.03665,0.01585,0.17065,0.77685
0.03575,0.01605,0.171,0.7772
0.0358,0.01615,0.171,0.77705
0.03605,0.01555,0.1711,0.7773
0.03555,0.0164,0.1712,0.77685
0.0351,0.016,0.17175,0.77715
0.0352,0.01645,0.17165,0.7767
0.0343,0.01685,0.1726,0.77625
0.03385,0.0173,0.17335,0.7755
0.03385,0.0172,0.17385,0.7751
0.03515,0.0167,0.1739,0.77425
0.0356,0.01575,0.17525,0.7734
0.035,0.01665,0.17505,0.7733
0.0348,0.0168,0.174,0.7744
0.03505,0.0164,0.1756,0.77295
0.03535,0.0155,0.17595,0.7732
0.03515,0.01575,0.17695,0.77215
0.03415,0.01775,0.1773,0.7708
0.0348,0.0175,0.1774,0.7703
0.03575,0.01645,0.17805,0.76975
0.0343,0.01755,0.17815,0.77
0.034,0.0173,0.1789,0.7698
0.03495,0.01625,0.17895,0.76985
0.0342,0.0171,0.17895,0.76975
0.0358,0.01535,0.17925,0.7696
0.0351,0.01545,0.17905,0.7704
0.0347,0.017,0.17925,0.76905
0.03435,0.0176,0.1794,0.76865
0.0345,0.0183,0.17905,0.76815
0.0351,0.01825,0.17915,0.7675
0.0356,0.01795,0.17765,0.7688
0.0355,0.01775,0.1781,0.76865
0.0363,0.0178,0.1773,0.7686
0.0361,0.01695,0.17765,0.7693
0.0357,0.01685,0.1781,0.76935
0.03505,0.017,0.1776,0.77035
0.0352,0.0182,0.17805,0.76855
0.0341,0.0193,0.17795,0.76865
0.0348,0.0186,0.17705,0.76955
0.0361,0.01875,0.1773,0.76785
0.03645,0.01855,0.17815,0.76685
0.0365,0.01855,0.1774,0.76755
0.03565,0.01705,0.1782,0.7691
0.0361,0.0169,0.17805,0.76895
0.0359,0.01655,0.17815,0.7694
0.0357,0.01695,0.17815,0.7692
0.0357,0.0174,0.1772,0.7697
0.0354,0.01695,0.1764,0.77125
0.03505,0.0173,0.1763,0.77135
0.0354,0.0163,0.17605,0.77225
0.0357,0.0165,0.1753,0.7725
0.0356,0.0169,0.1741,0.7734
0.03535,0.0167,0.17455,0.7734
0.03645,0.0155,0.17605,0.772
0.03495,0.0161,0.1757,0.77325
0.0353,0.0162,0.1754,0.7731
0.0354,0.01615,0.17535,0.7731
0.03465,0.01655,0.17645,0.77235
0.035,0.01655,0.17605,0.7724
0.0346,0.0156,0.1775,0.7723
0.03405,0.0163,0.1775,0.77215
0.03335,0.0172,0.17735,0.7721
0.03435,0.01715,0.1771,0.7714
0.0351,0.01595,0.1778,0.77115
0.0349,0.01565,0.17755,0.7719
0.03455,0.01695,0.1769,0.7716
0.03575,0.01665,0.1765,0.7711
0.0354,0.0179,0.1759,0.7708
0.0353,0.0177,0.1775,0.7695
0.03515,0.0174,0.1771,0.77035
0.0362,0.0167,0.1783,0.7688
0.03655,0.01675,0.1785,0.7682
0.0366,0.017,0.17805,0.76835
0.037,0.01715,0.1769,0.76895
