I,E,S,R
0.001000,0.000800,0.998200,0.000000
0.000950,0.001250,0.997450,0.000350
0.001250,0.001800,0.996450,0.000500
0.001250,0.002300,0.995550,0.000900
0.001700,0.002600,0.994750,0.000950
0.001950,0.003700,0.993050,0.001300
0.002850,0.004400,0.991250,0.001500
0.004050,0.005400,0.988850,0.001700
0.004950,0.007900,0.984900,0.002250
0.006700,0.009900,0.980600,0.002800
0.008800,0.014200,0.973450,0.003550
0.012250,0.017500,0.965550,0.004700
0.015700,0.022800,0.955100,0.006400
0.020200,0.030900,0.940250,0.008650
0.026700,0.040400,0.921700,0.011200
0.035400,0.051600,0.898500,0.014500
0.045450,0.063350,0.871950,0.019250
0.056800,0.079500,0.839250,0.024450
0.072350,0.099500,0.796000,0.032150
0.092150,0.118550,0.748550,0.040750
0.110300,0.145600,0.689600,0.054500
0.137950,0.167250,0.626950,0.067850
0.166050,0.192900,0.555150,0.085900
0.201700,0.212200,0.479300,0.106800
0.236450,0.227750,0.402400,0.133400
0.268000,0.233250,0.333550,0.165200
0.296200,0.234200,0.266950,0.202650
0.321800,0.222800,0.211650,0.243750
0.339000,0.209900,0.162950,0.288150
0.353300,0.190500,0.124550,0.331650
0.359400,0.169850,0.093650,0.377100
0.360450,0.142950,0.073150,0.423450
0.353950,0.120950,0.055450,0.469650
0.343150,0.099000,0.043650,0.514200
0.326150,0.081550,0.035100,0.557200
0.303500,0.065950,0.029650,0.600900
0.282150,0.054000,0.025700,0.638150
0.261800,0.042950,0.022800,0.672450
0.240200,0.034800,0.019950,0.705050
0.215750,0.027500,0.019750,0.737000
0.193800,0.021700,0.019800,0.764700
0.173650,0.017600,0.019650,0.789100
0.156600,0.015250,0.019950,0.808200
0.139750,0.012350,0.020750,0.827150
0.123900,0.010350,0.022050,0.843700
0.109300,0.009700,0.022200,0.858800
0.097250,0.008250,0.023850,0.870650
0.087300,0.007300,0.024800,0.880600
0.077700,0.007000,0.025550,0.889750
0.068650,0.006300,0.028200,0.896850
0.059900,0.005750,0.030550,0.903800
0.052850,0.005250,0.032750,0.909150
0.047300,0.005550,0.033550,0.913600
0.042700,0.004750,0.035950,0.916600
0.037900,0.004350,0.038000,0.919750
0.033850,0.004250,0.041200,0.920700
0.029600,0.004650,0.043900,0.921850
0.026950,0.004000,0.047000,0.922050
0.024550,0.003350,0.049450,0.922650
0.021800,0.003350,0.051450,0.923400
0.019950,0.002750,0.054250,0.923050
0.017100,0.003000,0.056100,0.923800
0.015900,0.002800,0.058250,0.923050
0.014250,0.002250,0.062200,0.921300
0.012600,0.002200,0.065000,0.920200
0.011500,0.002250,0.067850,0.918400
0.010200,0.002000,0.070900,0.916900
0.009400,0.002000,0.073300,0.915300
0.008000,0.001800,0.075500,0.914700
0.007450,0.001550,0.078400,0.912600
0.006700,0.002000,0.081300,0.910000
0.006350,0.002050,0.084400,0.907200
0.005550,0.002300,0.086700,0.905450
0.004950,0.002200,0.089450,0.903400
0.005100,0.002000,0.092200,0.900700
0.004950,0.001600,0.095050,0.898400
0.004950,0.001500,0.097500,0.896050
0.004500,0.001600,0.100600,0.893300
0.004250,0.001300,0.103450,0.891000
0.003400,0.001150,0.107050,0.888400
0.003250,0.001050,0.110200,0.885500
0.002650,0.000950,0.113850,0.882550
0.002600,0.000850,0.117000,0.879550
0.002050,0.000850,0.120200,0.876900
0.001600,0.000800,0.122950,0.874650
0.001850,0.000500,0.125850,0.871800
0.001650,0.000650,0.128950,0.868750
0.001500,0.000600,0.131600,0.866300
0.001550,0.000450,0.134100,0.863900
0.001400,0.000400,0.136850,0.861350
0.001300,0.000400,0.139350,0.858950
0.001300,0.000350,0.141900,0.856450
0.001050,0.000400,0.144900,0.853650
0.001050,0.000650,0.147300,0.851000
0.001150,0.000500,0.150100,0.848250
0.001150,0.000550,0.152400,0.845900
0.001150,0.000550,0.155200,0.843100
0.001100,0.000650,0.158400,0.839850
0.000950,0.000750,0.160500,0.837800
0.001100,0.000400,0.163900,0.834600
0.001200,0.000350,0.166050,0.832400
0.001000,0.000500,0.167550,0.830950
0.001000,0.000700,0.169400,0.828900
0.001250,0.000550,0.172000,0.826200
0.001250,0.000500,0.174050,0.824200
0.001300,0.000500,0.177100,0.821100
0.001200,0.000600,0.179250,0.818950
0.000950,0.000650,0.181850,0.816550
0.001000,0.000500,0.183900,0.814600
0.001150,0.000400,0.185600,0.812850
0.001400,0.000500,0.187950,0.810150
0.001150,0.000550,0.190600,0.807700
0.001200,0.000550,0.192750,0.805500
0.001400,0.000400,0.194500,0.803700
0.001300,0.000450,0.196600,0.801650
0.001350,0.000300,0.199100,0.799250
0.001250,0.000350,0.201200,0.797200
0.001200,0.000350,0.203350,0.795100
0.001100,0.000750,0.205700,0.792450
0.001300,0.000800,0.208200,0.789700
0.001300,0.000700,0.210650,0.787350
0.001450,0.000650,0.212600,0.785300
0.001550,0.000600,0.214700,0.783150
0.001550,0.000600,0.217050,0.780800
0.001500,0.000600,0.219500,0.778400
0.001800,0.000500,0.221300,0.776400
0.001750,0.000600,0.223100,0.774550
0.001800,0.000550,0.224550,0.773100
0.001700,0.000700,0.225850,0.771750
0.001550,0.000750,0.227550,0.770150
0.001700,0.000600,0.229500,0.768200
0.001650,0.000650,0.231150,0.766550
0.001750,0.000700,0.232850,0.764700
0.001650,0.001150,0.234450,0.762750
0.001650,0.001300,0.236950,0.760100
0.001800,0.001200,0.239200,0.757800
0.001900,0.001150,0.241350,0.755600
0.001950,0.000950,0.243600,0.753500
0.002200,0.000900,0.245350,0.751550
0.001950,0.001100,0.246950,0.750000
0.001900,0.001350,0.248400,0.748350
0.001950,0.001350,0.250450,0.746250
0.001900,0.001450,0.252050,0.744600
0.001950,0.001800,0.253900,0.742350
0.002250,0.001550,0.255400,0.740800
0.002900,0.001200,0.257000,0.738900
0.002900,0.001400,0.258850,0.736850
0.003050,0.001600,0.260650,0.734700
0.003050,0.001750,0.262400,0.732800
0.002650,0.002150,0.263700,0.731500
0.002650,0.002200,0.265250,0.729900
0.002850,0.002150,0.267550,0.727450
0.003250,0.002150,0.268950,0.725650
0.003200,0.002350,0.270750,0.723700
0.003500,0.001850,0.273000,0.721650
0.003800,0.002050,0.274150,0.720000
0.004050,0.002300,0.275200,0.718450
0.004650,0.002000,0.276150,0.717200
0.005100,0.001900,0.277300,0.715700
0.005200,0.002700,0.277900,0.714200
0.005600,0.002850,0.279050,0.712500
0.006050,0.002600,0.279800,0.711550
0.006050,0.003000,0.280500,0.710450
0.006000,0.003500,0.281700,0.708800
0.006150,0.003550,0.283000,0.707300
0.006400,0.003900,0.283000,0.706700
0.006600,0.004300,0.283400,0.705700
0.007250,0.003850,0.284000,0.704900
0.007700,0.004350,0.284400,0.703550
0.007650,0.004600,0.285450,0.702300
0.007200,0.005550,0.286100,0.701150
0.006950,0.005900,0.286600,0.700550
0.007600,0.005650,0.287100,0.699650
0.008300,0.005300,0.287950,0.698450
0.008700,0.005650,0.288550,0.697100
0.009350,0.006300,0.288150,0.696200
0.009700,0.006500,0.288500,0.695300
0.010300,0.006400,0.288800,0.694500
0.011000,0.006100,0.289300,0.693600
0.011400,0.007250,0.288600,0.692750
0.013050,0.006900,0.288000,0.692050
0.013500,0.006800,0.287850,0.691850
0.013650,0.008000,0.287150,0.691200
0.014600,0.008050,0.286200,0.691150
0.014800,0.009500,0.284800,0.690900
0.014500,0.010200,0.283800,0.691500
0.016050,0.010550,0.282250,0.691150
0.016350,0.011100,0.282050,0.690500
0.016850,0.011150,0.280850,0.691150
0.017400,0.012000,0.279400,0.691200
0.018750,0.012550,0.277650,0.691050
0.019300,0.013000,0.276300,0.691400
0.020100,0.013550,0.274450,0.691900
0.021750,0.014300,0.271750,0.692200
0.022300,0.014550,0.269700,0.693450
0.024500,0.014600,0.267350,0.693550
0.024500,0.015500,0.265400,0.694600
0.024500,0.016050,0.263800,0.695650
0.026150,0.016500,0.261300,0.696050
0.027800,0.016650,0.259450,0.696100
0.028800,0.017050,0.256250,0.697900
0.029100,0.017250,0.253350,0.700300
0.029550,0.018350,0.250800,0.701300
0.031850,0.018350,0.247500,0.702300
0.033400,0.018200,0.243750,0.704650
0.034400,0.019950,0.239850,0.705800
0.034350,0.021300,0.236550,0.707800
0.035750,0.021800,0.232000,0.710450
0.036100,0.022550,0.228250,0.713100
0.037600,0.022700,0.224600,0.715100
0.038850,0.022150,0.221700,0.717300
0.038800,0.023050,0.217850,0.720300
0.040950,0.023100,0.213450,0.722500
0.042450,0.024350,0.207750,0.725450
0.044400,0.023600,0.203200,0.728800
0.045300,0.023950,0.198700,0.732050
0.046150,0.023600,0.194650,0.735600
0.046450,0.024100,0.191250,0.738200
0.047250,0.025550,0.186700,0.740500
0.048250,0.025450,0.182050,0.744250
0.048350,0.025350,0.178550,0.747750
0.049450,0.022950,0.176400,0.751200
0.049450,0.023300,0.172650,0.754600
0.049500,0.022100,0.171100,0.757300
0.049000,0.021700,0.168100,0.761200
0.048350,0.022850,0.164650,0.764150
0.047400,0.022650,0.162150,0.767800
0.046850,0.022100,0.159350,0.771700
0.047650,0.022150,0.156500,0.773700
0.047700,0.021650,0.154100,0.776550
0.046900,0.022100,0.152350,0.778650
0.045000,0.021900,0.151600,0.781500
0.045950,0.020850,0.150250,0.782950
0.044450,0.021300,0.146950,0.787300
0.044950,0.019850,0.145750,0.789450
0.043900,0.020300,0.144100,0.791700
0.043050,0.019750,0.142700,0.794500
0.042700,0.017400,0.142700,0.797200
0.041350,0.016700,0.142100,0.799850
0.040800,0.016450,0.141750,0.801000
0.040050,0.016650,0.140600,0.802700
0.038900,0.016100,0.140700,0.804300
0.038650,0.015400,0.140800,0.805150
0.037650,0.015700,0.139900,0.806750
0.036450,0.015000,0.140800,0.807750
0.036000,0.014150,0.141100,0.808750
0.036300,0.013450,0.141000,0.809250
0.034750,0.013500,0.142250,0.809500
0.033250,0.013950,0.142750,0.810050
0.033200,0.014100,0.142350,0.810350
0.032500,0.014150,0.142500,0.810850
0.033300,0.012950,0.143950,0.809800
0.033600,0.012000,0.145450,0.808950
0.031350,0.011650,0.146850,0.810150
0.030600,0.011400,0.148100,0.809900
0.030050,0.011150,0.149100,0.809700
0.029200,0.010900,0.150300,0.809600
0.028200,0.010650,0.152200,0.808950
0.027050,0.010350,0.154000,0.808600
0.026700,0.010400,0.155950,0.806950
0.025300,0.010800,0.157300,0.806600
0.024100,0.010900,0.158050,0.806950
0.024700,0.010850,0.159200,0.805250
0.024350,0.010550,0.159700,0.805400
0.023700,0.010600,0.161500,0.804200
0.023000,0.010600,0.163000,0.803400
0.021900,0.010700,0.164000,0.803400
0.021800,0.010450,0.165750,0.802000
0.021100,0.010950,0.167350,0.800600
0.021450,0.010100,0.169100,0.799350
0.020950,0.009800,0.170250,0.799000
0.020850,0.009900,0.171350,0.797900
0.020550,0.008900,0.173600,0.796950
0.020050,0.008550,0.175750,0.795650
0.020300,0.008350,0.179200,0.792150
0.020050,0.008450,0.180900,0.790600
0.019950,0.008150,0.183050,0.788850
0.019850,0.007750,0.184800,0.787600
0.019350,0.008700,0.186400,0.785550
0.019700,0.008400,0.188800,0.783100
0.019300,0.009350,0.190900,0.780450
0.019200,0.009200,0.191950,0.779650
0.019450,0.009400,0.193400,0.777750
0.018650,0.010100,0.194800,0.776450
0.019400,0.009950,0.196400,0.774250
0.020000,0.009800,0.198250,0.771950
0.020600,0.008750,0.201100,0.769550
0.020800,0.009700,0.202650,0.766850
0.020550,0.009800,0.204050,0.765600
0.020550,0.011000,0.204150,0.764300
0.020500,0.010450,0.205900,0.763150
0.019950,0.011000,0.206950,0.762100
0.020400,0.011100,0.207700,0.760800
0.020600,0.011100,0.208000,0.760300
0.021150,0.011900,0.208100,0.758850
0.021050,0.012350,0.208500,0.758100
0.022200,0.012500,0.209800,0.755500
0.022200,0.012700,0.210550,0.754550
0.022450,0.013400,0.211650,0.752500
0.023450,0.012800,0.212800,0.750950
0.023800,0.012200,0.213400,0.750600
0.024150,0.012350,0.214250,0.749250
0.024900,0.013050,0.214350,0.747700
0.025250,0.013750,0.213800,0.747200
0.026450,0.013150,0.215100,0.745300
0.026450,0.014150,0.214900,0.744500
0.027200,0.014050,0.215450,0.743300
0.027000,0.014450,0.215300,0.743250
0.026500,0.015150,0.214950,0.743400
0.026800,0.014200,0.214900,0.744100
0.026500,0.015450,0.214750,0.743300
0.026900,0.015100,0.214850,0.743150
0.027500,0.015850,0.214550,0.742100
0.029300,0.015200,0.214800,0.740700
0.029750,0.014650,0.215750,0.739850
0.031250,0.014050,0.217050,0.737650
0.030450,0.014750,0.217300,0.737500
0.030200,0.016300,0.216300,0.737200
0.029600,0.016900,0.215250,0.738250
0.030500,0.017200,0.215450,0.736850
0.030700,0.016900,0.214600,0.737800
0.031750,0.016350,0.214950,0.736950
0.031300,0.017350,0.213500,0.737850
0.031400,0.017050,0.212850,0.738700
0.032100,0.017950,0.210450,0.739500
0.033600,0.017500,0.210000,0.738900
0.034300,0.017350,0.210350,0.738000
0.035250,0.018700,0.209200,0.736850
0.036350,0.018200,0.208350,0.737100
0.037900,0.019100,0.206850,0.736150
0.037750,0.019600,0.204900,0.737750
0.037150,0.021100,0.201900,0.739850
0.037900,0.021100,0.199900,0.741100
0.038300,0.022300,0.198200,0.741200
0.039650,0.021150,0.196750,0.742450
0.041750,0.019700,0.196150,0.742400
0.041350,0.021000,0.193500,0.744150
0.042150,0.021250,0.191050,0.745550
0.043350,0.020300,0.190050,0.746300
0.043000,0.022500,0.186450,0.748050
0.043100,0.021950,0.183800,0.751150
0.042650,0.021600,0.182800,0.752950
0.043000,0.021550,0.181500,0.753950
0.044100,0.021150,0.179650,0.755100
0.044550,0.020700,0.178350,0.756400
0.045050,0.020900,0.176650,0.757400
0.043900,0.021250,0.177100,0.757750
0.043650,0.019950,0.177200,0.759200
0.043700,0.019700,0.175800,0.760800
0.043150,0.019800,0.175100,0.761950
0.042150,0.019350,0.175650,0.762850
0.040650,0.020050,0.173750,0.765550
0.040550,0.020250,0.172900,0.766300
0.042350,0.019450,0.171750,0.766450
0.041950,0.019800,0.171200,0.767050
0.041650,0.020450,0.170400,0.767500
0.040650,0.021000,0.170800,0.767550
0.040500,0.020000,0.172150,0.767350
0.040950,0.018750,0.172200,0.768100
0.040150,0.019650,0.171600,0.768600
0.040000,0.021300,0.169950,0.768750
0.041650,0.019500,0.169450,0.769400
0.041500,0.020000,0.168100,0.770400
0.041600,0.019300,0.167750,0.771350
0.041200,0.019850,0.167450,0.771500
0.040950,0.018550,0.166600,0.773900
0.041600,0.017050,0.166850,0.774500
0.040900,0.017150,0.166700,0.775250
0.039600,0.018350,0.166950,0.775100
0.039800,0.019150,0.166400,0.774650
0.040250,0.018600,0.166750,0.774400
0.040000,0.017600,0.167000,0.775400
0.038850,0.017600,0.167100,0.776450
0.037750,0.017300,0.168200,0.776750
0.037750,0.017550,0.167800,0.776900
0.037200,0.017500,0.167750,0.777550
0.037000,0.017450,0.168900,0.776650
0.037550,0.016750,0.169650,0.776050
0.037250,0.017300,0.169750,0.775700
0.037600,0.017450,0.169400,0.775550
0.036550,0.018150,0.168700,0.776600
0.037700,0.017500,0.168350,0.776450
0.037100,0.017250,0.168150,0.777500
0.037900,0.016550,0.167550,0.778000
0.038450,0.015900,0.167900,0.777750
0.038200,0.015600,0.168000,0.778200
0.037450,0.015550,0.168500,0.778500
0.035300,0.015700,0.170450,0.778550
0.033850,0.016150,0.170550,0.779450
0.032900,0.015750,0.170600,0.780750
0.032750,0.015650,0.171950,0.779650
0.031850,0.015650,0.173250,0.779250
0.031750,0.015150,0.174450,0.778650
0.032250,0.014400,0.176400,0.776950
0.031500,0.014550,0.176850,0.777100
0.031300,0.015200,0.177700,0.775800
0.031050,0.015450,0.177700,0.775800
0.031000,0.015700,0.178550,0.774750
0.031350,0.015300,0.179900,0.773450
0.031750,0.016000,0.179800,0.772450
0.031750,0.015150,0.181300,0.771800
0.031250,0.015100,0.183250,0.770400
0.030400,0.014800,0.184950,0.769850
0.031000,0.015350,0.184800,0.768850
0.030800,0.015650,0.185200,0.768350
0.031050,0.016150,0.184950,0.767850
0.031600,0.015450,0.186500,0.766450
0.031900,0.015150,0.187500,0.765450
0.031000,0.015800,0.187300,0.765900
0.031900,0.016550,0.186750,0.764800
0.032700,0.016050,0.186950,0.764300
0.032200,0.016200,0.187100,0.764500
0.031950,0.015650,0.188050,0.764350
0.032550,0.016250,0.189050,0.762150
0.033350,0.016100,0.189650,0.760900
0.033000,0.017150,0.188550,0.761300
0.033000,0.016300,0.189100,0.761600
0.032500,0.016950,0.187550,0.763000
0.033450,0.015950,0.187900,0.762700
0.033950,0.015450,0.188750,0.761850
0.033550,0.015450,0.189450,0.761550
0.033900,0.015650,0.188650,0.761800
0.033050,0.015700,0.189750,0.761500
0.033600,0.016350,0.188550,0.761500
0.032900,0.016250,0.191500,0.759350
0.033500,0.015550,0.192700,0.758250
0.033650,0.015950,0.192750,0.757650
0.033750,0.016450,0.192050,0.757750
0.033400,0.015400,0.193200,0.758000
0.033300,0.016050,0.192600,0.758050
0.033500,0.016050,0.192300,0.758150
0.032550,0.016050,0.193650,0.757750
0.032850,0.016750,0.193300,0.757100
0.033950,0.016150,0.193700,0.756200
0.034100,0.016850,0.193150,0.755900
0.034450,0.017350,0.192200,0.756000
0.034100,0.019550,0.190050,0.756300
0.035400,0.019250,0.190250,0.755100
0.036550,0.018550,0.189900,0.755000
0.036550,0.018150,0.190700,0.754600
0.037150,0.017800,0.190050,0.755000
0.037200,0.018250,0.188750,0.755800
0.037600,0.018100,0.189700,0.754600
0.037800,0.017650,0.189100,0.755450
0.037700,0.017000,0.189350,0.755950
0.036900,0.017550,0.188650,0.756900
0.036600,0.018800,0.187550,0.757050
0.037700,0.018400,0.186350,0.757550
0.037850,0.018650,0.185500,0.758000
0.037950,0.018050,0.185050,0.758950
0.037850,0.018450,0.184600,0.759100
0.038700,0.018200,0.183650,0.759450
0.038150,0.018250,0.183850,0.759750
0.037550,0.018350,0.183550,0.760550
0.037100,0.018900,0.181850,0.762150
0.037300,0.018500,0.181350,0.762850
0.036450,0.018000,0.181250,0.764300
0.036500,0.018500,0.180900,0.764100
0.036950,0.017400,0.181250,0.764400
0.036300,0.017550,0.181050,0.765100
0.036050,0.017700,0.180650,0.765600
0.035550,0.017150,0.181650,0.765650
0.035900,0.017500,0.181550,0.765050
0.034800,0.018600,0.181150,0.765450
0.034700,0.017200,0.181800,0.766300
0.033950,0.017800,0.181150,0.767100
0.034250,0.017550,0.181200,0.767000
0.035550,0.018000,0.180800,0.765650
0.034950,0.017900,0.180450,0.766700
0.034450,0.019050,0.178800,0.767700
0.035400,0.019100,0.178050,0.767450
0.035700,0.018850,0.177700,0.767750
0.036500,0.017850,0.177900,0.767750
0.036900,0.017800,0.177600,0.767700
0.036300,0.018950,0.177300,0.767450
0.037100,0.018250,0.177300,0.767350
0.036500,0.019050,0.176800,0.767650
0.036900,0.019000,0.176950,0.767150
0.037350,0.018200,0.176700,0.767750
0.037750,0.017050,0.177400,0.767800
0.035800,0.017450,0.177350,0.769400
0.035300,0.017650,0.176850,0.770200
0.034950,0.017200,0.177500,0.770350
0.034600,0.017150,0.177200,0.771050
0.034650,0.016150,0.178300,0.770900
0.033850,0.015050,0.178650,0.772450
0.033150,0.016400,0.177750,0.772700
0.032700,0.015000,0.178800,0.773500
0.031600,0.014750,0.179100,0.774550
0.030850,0.014750,0.178950,0.775450
0.030700,0.014550,0.180050,0.774700
0.031100,0.013250,0.181650,0.774000
0.030550,0.013350,0.181300,0.774800
0.030850,0.012650,0.182550,0.773950
0.030300,0.013400,0.182850,0.773450
0.031450,0.013300,0.183050,0.772200
0.031200,0.014350,0.182350,0.772100
0.032150,0.015300,0.181950,0.770600
0.032350,0.016100,0.182050,0.769500
0.032100,0.016750,0.181700,0.769450
0.032200,0.016000,0.182250,0.769550
0.033050,0.015500,0.183050,0.768400
0.033350,0.015800,0.184100,0.766750
0.033950,0.015450,0.184300,0.766300
0.033450,0.015200,0.184050,0.767300
0.033200,0.015350,0.183400,0.768050
0.032900,0.015500,0.183400,0.768200
0.033100,0.016150,0.183100,0.767650
0.032550,0.015850,0.184400,0.767200
0.033000,0.014500,0.184300,0.768200
0.032900,0.015900,0.183800,0.767400
0.033350,0.015650,0.183850,0.767150
0.033850,0.015100,0.185450,0.765600
0.033250,0.014150,0.186150,0.766450
0.032250,0.015150,0.186400,0.766200
0.031950,0.014800,0.186950,0.766300
0.032150,0.014550,0.188250,0.765050
0.032000,0.014600,0.189000,0.764400
0.031850,0.015000,0.189700,0.763450
0.031050,0.015350,0.190200,0.763400
0.031550,0.015050,0.190250,0.763150
0.030750,0.015400,0.189750,0.764100
0.030500,0.015850,0.190600,0.763050
0.031450,0.015500,0.191250,0.761800
0.031600,0.016100,0.190550,0.761750
0.032100,0.015550,0.191350,0.761000
0.033200,0.015150,0.190600,0.761050
0.032500,0.016000,0.191200,0.760300
0.032550,0.015900,0.191650,0.759900
0.031800,0.016650,0.191250,0.760300
0.032300,0.016000,0.191100,0.760600
0.031850,0.017250,0.191050,0.759850
0.031900,0.018100,0.190000,0.760000
0.033300,0.017200,0.190500,0.759000
0.034150,0.017050,0.189750,0.759050
0.033350,0.018450,0.188550,0.759650
0.033750,0.017600,0.188200,0.760450
0.035250,0.017200,0.187500,0.760050
0.035950,0.017700,0.186950,0.759400
0.035400,0.017750,0.187200,0.759650
0.035850,0.018250,0.186450,0.759450
0.036550,0.018500,0.186050,0.758900
0.037650,0.017750,0.185850,0.758750
0.038100,0.017100,0.184900,0.759900
0.038250,0.017750,0.184550,0.759450
0.038650,0.019800,0.182400,0.759150
0.040000,0.019100,0.181400,0.759500
0.040250,0.018150,0.180700,0.760900
0.040650,0.018100,0.180300,0.760950
0.040350,0.018500,0.180550,0.760600
0.039400,0.018750,0.180500,0.761350
0.038300,0.019350,0.179950,0.762400
0.038700,0.018850,0.179800,0.762650
0.039150,0.018700,0.179200,0.762950
0.038700,0.019800,0.178550,0.762950
0.039700,0.019050,0.178700,0.762550
0.039900,0.018250,0.179700,0.762150
0.040350,0.017850,0.180300,0.761500
0.038350,0.019900,0.178400,0.763350
0.038000,0.018650,0.178900,0.764450
0.039050,0.018400,0.178150,0.764400
0.039300,0.017700,0.178300,0.764700
0.039500,0.019000,0.176550,0.764950
0.039500,0.018800,0.176550,0.765150
0.040300,0.017200,0.176700,0.765800
0.038650,0.018100,0.176900,0.766350
0.039150,0.018200,0.175900,0.766750
0.038000,0.018150,0.175700,0.768150
0.037200,0.019150,0.176150,0.767500
0.036650,0.018950,0.176200,0.768200
0.036500,0.018550,0.176850,0.768100
0.037050,0.018600,0.177100,0.767250
0.036250,0.018150,0.178550,0.767050
0.037250,0.017800,0.178400,0.766550
0.037700,0.017200,0.177550,0.767550
0.038550,0.016850,0.177500,0.767100
0.037600,0.017950,0.177350,0.767100
0.037900,0.017300,0.177500,0.767300
0.036550,0.018000,0.178250,0.767200
0.036750,0.017650,0.178350,0.767250
0.036200,0.018200,0.179250,0.766350
0.037400,0.017000,0.180200,0.765400
0.036700,0.017700,0.179400,0.766200
0.035650,0.018250,0.179650,0.766450
0.036100,0.018000,0.179900,0.766000
0.035450,0.018450,0.180250,0.765850
0.036950,0.017000,0.180800,0.765250
0.037600,0.016950,0.181300,0.764150
0.036650,0.018150,0.181200,0.764000
0.036800,0.018050,0.180400,0.764750
0.036400,0.018750,0.180750,0.764100
0.036300,0.018150,0.181350,0.764200
0.035250,0.019200,0.181150,0.764400
0.036150,0.019600,0.180450,0.763800
0.037200,0.019600,0.180200,0.763000
0.038350,0.018450,0.180600,0.762600
0.037600,0.019050,0.179750,0.763600
0.036900,0.018600,0.180750,0.763750
0.037550,0.018250,0.180100,0.764100
0.038100,0.018250,0.179350,0.764300
0.038400,0.016950,0.181350,0.763300
0.036950,0.017600,0.181700,0.763750
0.037500,0.018550,0.180450,0.763500
0.037450,0.018400,0.180100,0.764050
0.037050,0.018050,0.180650,0.764250
0.035700,0.017600,0.180500,0.766200
0.034800,0.017500,0.182150,0.765550
0.035000,0.017300,0.182400,0.765300
0.035000,0.016500,0.182950,0.765550
0.033550,0.016650,0.183750,0.766050
0.034000,0.015550,0.185200,0.765250
0.033400,0.016600,0.184400,0.765600
0.034100,0.015800,0.186200,0.763900
0.034350,0.016450,0.186500,0.762700
0.034950,0.015650,0.187350,0.762050
0.035900,0.014450,0.187500,0.762150
0.034300,0.015700,0.187700,0.762300
0.035300,0.015550,0.187850,0.761300
0.033950,0.017050,0.187800,0.761200
0.033650,0.017350,0.187900,0.761100
0.033800,0.017300,0.188700,0.760200
0.034650,0.016700,0.188850,0.759800
0.035300,0.016300,0.189800,0.758600
0.035250,0.016700,0.190300,0.757750
0.034350,0.017800,0.189950,0.757900
0.034450,0.018150,0.190150,0.757250
0.035400,0.018300,0.189450,0.756850
0.035600,0.018000,0.189200,0.757200
0.036450,0.017250,0.189400,0.756900
0.037950,0.018000,0.189150,0.754900
0.038050,0.018850,0.187550,0.755550
0.038200,0.017450,0.187550,0.756800
0.038800,0.017300,0.186350,0.757550
0.037750,0.018100,0.185950,0.758200
0.038050,0.018500,0.185100,0.758350
0.038350,0.018400,0.184550,0.758700
0.036650,0.018500,0.185050,0.759800
0.037400,0.018050,0.185750,0.758800
0.037300,0.018850,0.185700,0.758150
0.037650,0.018000,0.186100,0.758250
0.037500,0.018000,0.186200,0.758300
0.038200,0.017300,0.187100,0.757400
0.038600,0.016500,0.187100,0.757800
0.037550,0.016800,0.187400,0.758250
0.035300,0.017200,0.187000,0.760500
0.036300,0.017200,0.186750,0.759750
0.035950,0.018950,0.186400,0.758700
0.037600,0.017450,0.186900,0.758050
0.037300,0.018450,0.186750,0.757500
0.037150,0.017900,0.186450,0.758500
0.036400,0.019000,0.186200,0.758400
0.036200,0.019000,0.186000,0.758800
0.036050,0.018850,0.187800,0.757300
0.036100,0.017000,0.188700,0.758200
0.036050,0.016850,0.189100,0.758000
0.036100,0.016550,0.189500,0.757850
0.034750,0.017050,0.188550,0.759650
0.034950,0.017500,0.188300,0.759250
0.035250,0.017300,0.189350,0.758100
0.035700,0.016950,0.188800,0.758550
0.036400,0.017350,0.188400,0.757850
0.036000,0.017950,0.188700,0.757350
0.036750,0.018450,0.188700,0.756100
0.037500,0.017950,0.188850,0.755700
0.037050,0.018500,0.188600,0.755850
0.037300,0.018300,0.188250,0.756150
0.037750,0.017550,0.189750,0.754950
0.038600,0.018000,0.188950,0.754450
0.038250,0.017950,0.188800,0.755000
0.037600,0.018400,0.188700,0.755300
0.038700,0.018950,0.187600,0.754750
0.037800,0.018900,0.187650,0.755650
0.037900,0.019150,0.186950,0.756000
0.037500,0.018950,0.186650,0.756900
0.038350,0.018700,0.185800,0.757150
0.039300,0.019050,0.185550,0.756100
0.038700,0.019300,0.185550,0.756450
0.039450,0.019350,0.184950,0.756250
0.040300,0.019550,0.183550,0.756600
0.041250,0.018100,0.183500,0.757150
0.040050,0.019300,0.182600,0.758050
0.040050,0.019000,0.181100,0.759850
0.039900,0.018850,0.180050,0.761200
0.041350,0.018050,0.179250,0.761350
0.041550,0.018850,0.178300,0.761300
0.041050,0.019800,0.177600,0.761550
0.040700,0.019950,0.176900,0.762450
0.041500,0.018800,0.176550,0.763150
0.041300,0.018850,0.175700,0.764150
0.041250,0.020300,0.173900,0.764550
0.039900,0.021000,0.173000,0.766100
0.039450,0.019900,0.174150,0.766500
0.039150,0.020050,0.174450,0.766350
0.039000,0.019550,0.172500,0.768950
0.038700,0.019000,0.171700,0.770600
0.038250,0.018650,0.171550,0.771550
0.039000,0.018950,0.170300,0.771750
0.038750,0.018350,0.170400,0.772500
0.037200,0.018600,0.170150,0.774050
0.037050,0.018300,0.169600,0.775050
0.036750,0.018450,0.170150,0.774650
0.037700,0.017550,0.169850,0.774900
0.038050,0.017100,0.171000,0.773850
0.037250,0.017150,0.170300,0.775300
0.036600,0.016500,0.170050,0.776850
0.036200,0.017050,0.170500,0.776250
0.036250,0.017950,0.169300,0.776500
0.036200,0.016850,0.170450,0.776500
0.035350,0.016900,0.171950,0.775800
0.035850,0.016350,0.172200,0.775600
0.036000,0.016900,0.172750,0.774350
0.035200,0.017250,0.172550,0.775000
0.035550,0.016250,0.173550,0.774650
0.035300,0.016100,0.174000,0.774600
0.034350,0.016550,0.173900,0.775200
0.034750,0.016850,0.173300,0.775100
0.034450,0.016400,0.172700,0.776450
0.034900,0.015550,0.173900,0.775650
0.034050,0.016150,0.173800,0.776000
0.032950,0.017200,0.174750,0.775100
0.033750,0.016600,0.174150,0.775500
0.034400,0.016000,0.174650,0.774950
0.034600,0.015100,0.174350,0.775950
0.034150,0.014950,0.174750,0.776150
0.032700,0.015100,0.175250,0.776950
0.031600,0.015600,0.176600,0.776200
0.030850,0.015850,0.178000,0.775300
0.031600,0.015700,0.177150,0.775550
0.031750,0.014900,0.178700,0.774650
0.031200,0.014900,0.179650,0.774250
