I,E,S,R
0.001,0.0005,0.9985,0
0.00105,0.0012,0.99765,0.0001
0.00115,0.0015,0.99705,0.0003
0.0014,0.0018,0.99625,0.00055
0.00185,0.0025,0.99505,0.0006
0.00235,0.0037,0.99325,0.0007
0.00345,0.005,0.99065,0.0009
0.0045,0.00635,0.98755,0.0016
0.0058,0.0081,0.9837,0.0024
0.00685,0.01145,0.9784,0.0033
0.00945,0.01445,0.972,0.0041
0.0124,0.01885,0.9636,0.00515
0.01615,0.0246,0.9525,0.00675
0.02075,0.0319,0.9386,0.00875
0.0275,0.03985,0.9211,0.01155
0.0341,0.0518,0.89885,0.01525
0.0461,0.06335,0.8708,0.01975
0.0574,0.08085,0.83585,0.0259
0.07225,0.1019,0.79215,0.0337
0.09295,0.1247,0.7394,0.04295
0.1166,0.14525,0.68295,0.0552
0.14335,0.16855,0.6171,0.071
0.1698,0.1931,0.54595,0.09115
0.2015,0.21125,0.47495,0.1123
0.23735,0.2224,0.40225,0.138
0.2687,0.2333,0.3302,0.1678
0.30025,0.2282,0.2678,0.20375
0.327,0.22085,0.2099,0.24225
0.3486,0.2029,0.164,0.2845
0.362,0.18275,0.126,0.32925
0.3639,0.1649,0.09395,0.37725
0.3623,0.14055,0.0717,0.42545
0.3529,0.1154,0.0565,0.4752
0.34,0.09395,0.04475,0.5213
0.3179,0.0801,0.0359,0.5661
0.29815,0.0654,0.02965,0.6068
0.2757,0.0524,0.0262,0.6457
0.25235,0.04195,0.0238,0.6819
0.22965,0.03375,0.022,0.7146
0.2067,0.02825,0.02155,0.7435
0.188,0.0228,0.02105,0.76815
0.1699,0.0189,0.0211,0.7901
0.1522,0.01575,0.0215,0.81055
0.13825,0.0127,0.0223,0.82675
0.1242,0.01025,0.0235,0.84205
0.11065,0.00935,0.0246,0.8554
0.098,0.0084,0.026,0.8676
0.0878,0.00685,0.02785,0.8775
0.0765,0.00645,0.0294,0.88765
0.069,0.0062,0.03085,0.89395
0.0614,0.0058,0.03255,0.90025
0.0538,0.0047,0.0351,0.9064
0.04705,0.00475,0.03705,0.91115
0.0418,0.00465,0.03845,0.9151
0.03765,0.00485,0.03975,0.91775
0.0344,0.0042,0.04275,0.91865
0.03095,0.00365,0.0461,0.9193
0.02805,0.00325,0.0485,0.9202
0.02485,0.00315,0.05065,0.92135
0.02205,0.00295,0.05355,0.92145
0.01945,0.0034,0.0556,0.92155
0.0178,0.00305,0.0582,0.92095
0.0155,0.0032,0.061,0.9203
0.01445,0.0025,0.06395,0.9191
0.0127,0.00265,0.0663,0.91835
0.0117,0.00275,0.0688,0.91675
0.0114,0.0023,0.07195,0.91435
0.01045,0.00225,0.07425,0.91305
0.0093,0.00205,0.0769,0.91175
0.0082,0.00225,0.07965,0.9099
0.0075,0.00195,0.08315,0.9074
0.00735,0.00175,0.08585,0.90505
0.0067,0.00155,0.08925,0.9025
0.0068,0.00135,0.0918,0.90005
0.006,0.0015,0.09405,0.89845
0.0056,0.00155,0.0963,0.89655
0.0054,0.0015,0.09895,0.89415
0.0048,0.0019,0.10145,0.89185
0.00455,0.0015,0.10335,0.8906
0.00425,0.0014,0.1059,0.88845
0.00405,0.00135,0.1087,0.8859
0.0042,0.0013,0.11115,0.88335
0.00395,0.00105,0.1139,0.8811
0.00345,0.00125,0.1168,0.8785
0.00285,0.0013,0.1196,0.87625
0.00265,0.001,0.12245,0.8739
0.0028,0.00125,0.12495,0.871
0.00305,0.001,0.12825,0.8677
0.00295,0.00095,0.1312,0.8649
0.0027,0.0009,0.13405,0.86235
0.00255,0.00075,0.1367,0.86
0.00255,0.00065,0.13935,0.85745
0.00215,0.0008,0.1418,0.85525
0.0022,0.00075,0.1443,0.85275
0.00185,0.00075,0.14655,0.85085
0.0018,0.0005,0.14935,0.84835
0.0015,0.0005,0.15235,0.84565
0.0014,0.00055,0.1541,0.84395
0.0015,0.0005,0.1564,0.8416
0.00135,0.0006,0.15845,0.8396
0.00125,0.00045,0.16135,0.83695
0.00115,0.00035,0.1637,0.8348
0.0011,0.00035,0.1663,0.83225
0.0011,0.00035,0.1688,0.82975
0.00105,0.0003,0.1713,0.82735
0.00105,0.0005,0.17305,0.8254
0.0012,0.0005,0.1751,0.8232
0.00125,0.00045,0.1771,0.8212
0.00135,0.0004,0.17925,0.819
0.00115,0.0005,0.18155,0.8168
0.0012,0.00055,0.18415,0.8141
0.00105,0.00065,0.18675,0.81155
0.00115,0.0007,0.189,0.80915
0.0014,0.00065,0.1909,0.80705
0.0015,0.0007,0.1925,0.8053
0.0014,0.00085,0.1943,0.80345
0.00125,0.00085,0.1964,0.8015
0.00155,0.0007,0.1984,0.79935
0.00145,0.0007,0.2008,0.79705
0.0014,0.001,0.2023,0.7953
0.00135,0.001,0.20465,0.793
0.0016,0.0009,0.20655,0.79095
0.00165,0.00095,0.2085,0.7889
0.00185,0.0009,0.2105,0.78675
0.00185,0.00095,0.21245,0.78475
0.0019,0.0009,0.2146,0.7826
0.00185,0.00095,0.21665,0.78055
0.0017,0.0011,0.2185,0.7787
0.0014,0.00115,0.2205,0.77695
0.0015,0.0011,0.22285,0.77455
0.00175,0.0011,0.22485,0.7723
0.00175,0.0009,0.22705,0.7703
0.00195,0.0006,0.22945,0.768
0.00185,0.0009,0.2315,0.76575
0.0019,0.00095,0.23395,0.7632
0.00195,0.001,0.23635,0.7607
0.0021,0.0012,0.2384,0.7583
0.0021,0.00125,0.2403,0.75635
0.0022,0.00105,0.2423,0.75445
0.00245,0.001,0.24425,0.7523
0.00255,0.001,0.2461,0.75035
0.00265,0.0015,0.2482,0.74765
0.0028,0.00175,0.2497,0.74575
0.0029,0.00155,0.25175,0.7438
0.00305,0.00175,0.2532,0.742
0.0031,0.00195,0.2547,0.74025
0.0036,0.0015,0.2562,0.7387
0.0034,0.002,0.257,0.7376
0.00305,0.00235,0.2586,0.736
0.0028,0.00265,0.26035,0.7342
0.00325,0.00245,0.2617,0.7326
0.00355,0.00215,0.2633,0.731
0.00385,0.00245,0.26435,0.72935
0.00405,0.00265,0.266,0.7273
0.00425,0.00275,0.26735,0.72565
0.00445,0.00225,0.2691,0.7242
0.0048,0.0025,0.27035,0.72235
0.00505,0.00265,0.2717,0.7206
0.00505,0.0034,0.27225,0.7193
0.00535,0.0034,0.27315,0.7181
0.0053,0.00365,0.27405,0.717
0.00595,0.00345,0.27495,0.71565
0.00655,0.0035,0.27565,0.7143
0.00675,0.0046,0.27575,0.7129
0.007,0.00475,0.2764,0.71185
0.0075,0.0048,0.27675,0.71095
0.00785,0.00505,0.27725,0.70985
0.0083,0.00515,0.27715,0.7094
0.00845,0.00575,0.277,0.7088
0.00965,0.00535,0.2776,0.7074
0.0102,0.0057,0.2782,0.7059
0.0101,0.00715,0.27725,0.7055
0.01085,0.0068,0.27795,0.7044
0.01085,0.00735,0.27705,0.70475
0.01195,0.0071,0.27675,0.7042
0.0125,0.0072,0.27665,0.70365
0.0127,0.00775,0.27645,0.7031
0.01285,0.0087,0.2757,0.70275
0.01365,0.009,0.2753,0.70205
0.0143,0.0099,0.27355,0.70225
0.0158,0.0101,0.272,0.7021
0.0159,0.0106,0.27175,0.70175
0.016,0.01105,0.2713,0.70165
0.0176,0.01085,0.2696,0.70195
0.0189,0.01135,0.26765,0.7021
0.0203,0.01195,0.2658,0.70195
0.0215,0.01325,0.2631,0.70215
0.02235,0.01385,0.2607,0.7031
0.0236,0.01335,0.2588,0.70425
0.02355,0.01435,0.25655,0.70555
0.02485,0.01505,0.25435,0.70575
0.0256,0.01535,0.2519,0.70715
0.0268,0.0159,0.24825,0.70905
0.0281,0.0159,0.2458,0.7102
0.02855,0.01785,0.24215,0.71145
0.0303,0.01795,0.2386,0.71315
0.0305,0.01965,0.2351,0.71475
0.0316,0.01945,0.23265,0.7163
0.0324,0.02155,0.22845,0.7176
0.03445,0.02165,0.22275,0.72115
0.0346,0.02215,0.21895,0.7243
0.03695,0.02115,0.2155,0.7264
0.03895,0.0214,0.21185,0.7278
0.0407,0.02155,0.2082,0.72955
0.0417,0.02155,0.20475,0.732
0.04125,0.02175,0.20115,0.73585
0.0412,0.0217,0.19835,0.73875
0.04065,0.0212,0.19525,0.7429
0.04165,0.021,0.1919,0.74545
0.04295,0.02005,0.18845,0.74855
0.04215,0.0205,0.18535,0.752
0.0422,0.02115,0.1827,0.75395
0.04305,0.02045,0.17945,0.75705
0.0433,0.02035,0.1766,0.75975
0.0429,0.01975,0.17365,0.7637
0.0416,0.02,0.17105,0.76735
0.0424,0.02065,0.16815,0.7688
0.04335,0.021,0.16475,0.7709
0.04365,0.02045,0.16255,0.77335
0.0425,0.0188,0.16155,0.77715
0.04265,0.018,0.15965,0.7797
0.04155,0.01825,0.1574,0.7828
0.04205,0.0176,0.15585,0.7845
0.0419,0.0177,0.1545,0.7859
0.04095,0.01825,0.15285,0.78795
0.04045,0.0185,0.1514,0.78965
0.03985,0.01925,0.1497,0.7912
0.0399,0.0185,0.14885,0.79275
0.0398,0.01745,0.14945,0.7933
0.0408,0.01635,0.1484,0.79445
0.03995,0.0152,0.14815,0.7967
0.03895,0.01495,0.14805,0.79805
0.03695,0.0142,0.14945,0.7994
0.03555,0.01415,0.1484,0.8019
0.0341,0.0146,0.1469,0.8044
0.03415,0.0142,0.1472,0.80445
0.03305,0.0143,0.14745,0.8052
0.0326,0.01265,0.14845,0.8063
0.0305,0.01265,0.1491,0.80775
0.02965,0.01225,0.14965,0.80845
0.03055,0.0111,0.1503,0.80805
0.0294,0.01155,0.1502,0.80885
0.0283,0.0118,0.1508,0.8091
0.02825,0.01125,0.1532,0.8073
0.02745,0.0111,0.1543,0.80715
0.02675,0.01165,0.15555,0.80605
0.02745,0.01105,0.15625,0.80525
0.0264,0.01095,0.15765,0.805
0.0256,0.01005,0.16035,0.804
0.0242,0.01155,0.16045,0.8038
0.0245,0.0104,0.16165,0.80345
0.02385,0.01065,0.16385,0.80165
0.023,0.0093,0.16685,0.80085
0.0222,0.0099,0.1689,0.799
0.02205,0.0086,0.1714,0.79795
0.02125,0.0089,0.1727,0.79715
0.0215,0.00955,0.17325,0.7957
0.0219,0.0093,0.1757,0.7931
0.02225,0.01,0.1776,0.79015
0.0222,0.0099,0.1794,0.7885
0.02195,0.0105,0.1807,0.78685
0.0224,0.0106,0.1824,0.7846
0.02205,0.0114,0.18385,0.7827
0.0217,0.01115,0.1847,0.78245
0.02135,0.01065,0.1862,0.7818
0.02095,0.01175,0.1863,0.781
0.0212,0.0115,0.18695,0.78035
0.02095,0.0118,0.18805,0.7792
0.0211,0.0118,0.1891,0.778
0.0216,0.01215,0.1903,0.77595
0.02255,0.01125,0.192,0.7742
0.02245,0.01095,0.1935,0.7731
0.02315,0.00965,0.1953,0.7719
0.0231,0.0107,0.19475,0.77145
0.0227,0.01175,0.19525,0.7703
0.02245,0.01145,0.19615,0.76995
0.0228,0.01195,0.19655,0.7687
0.0225,0.01185,0.19885,0.7668
0.0227,0.0115,0.2012,0.7646
0.02305,0.01165,0.20145,0.76385
0.0234,0.01175,0.20195,0.7629
0.0235,0.01205,0.2021,0.76235
0.0232,0.01265,0.202,0.76215
0.0244,0.01265,0.20165,0.7613
0.0246,0.01375,0.2011,0.76055
0.02585,0.0136,0.20195,0.7586
0.0263,0.01345,0.2023,0.75795
0.02615,0.01455,0.2029,0.7564
0.02695,0.0141,0.2042,0.75475
0.02755,0.01265,0.20495,0.75485
0.028,0.0135,0.20515,0.75335
0.0276,0.0144,0.205,0.753
0.0281,0.0145,0.2051,0.7523
0.02915,0.0146,0.20445,0.7518
0.02995,0.0153,0.20395,0.7508
0.0301,0.01595,0.20355,0.7504
0.0308,0.016,0.20335,0.74985
0.03095,0.01695,0.2015,0.7506
0.0318,0.01625,0.2013,0.75065
0.03165,0.01635,0.2018,0.7502
0.03165,0.01605,0.2015,0.7508
0.03185,0.0157,0.2005,0.75195
0.0312,0.01615,0.2001,0.75255
0.0317,0.0168,0.19935,0.75215
0.03175,0.01695,0.198,0.7533
0.0319,0.01725,0.19725,0.7536
0.0326,0.0171,0.1971,0.7532
0.03295,0.01645,0.19805,0.75255
0.0327,0.01705,0.19745,0.7528
0.0331,0.01735,0.19695,0.7526
0.03285,0.0174,0.1968,0.75295
0.03425,0.0165,0.1969,0.75235
0.03455,0.017,0.1949,0.75355
0.0348,0.01605,0.195,0.75415
0.034,0.01625,0.19445,0.7553
0.03375,0.0174,0.1938,0.75505
0.03455,0.01755,0.1931,0.7548
0.03505,0.01665,0.19285,0.75545
0.03545,0.0174,0.1922,0.75495
0.0366,0.01675,0.193,0.75365
0.0371,0.0171,0.1917,0.7541
0.037,0.01765,0.1922,0.75315
0.03755,0.0185,0.1911,0.75285
0.0362,0.01925,0.1901,0.75445
0.0375,0.0191,0.18885,0.75455
0.03755,0.01935,0.1868,0.7563
0.0387,0.0181,0.1874,0.7558
0.0384,0.0188,0.1857,0.7571
0.03785,0.01785,0.1859,0.7584
0.0378,0.01735,0.18525,0.7596
0.03755,0.018,0.1841,0.76035
0.03825,0.01765,0.18405,0.76005
0.03845,0.01735,0.18375,0.76045
0.03805,0.01815,0.18355,0.76025
0.03835,0.01775,0.1831,0.7608
0.03845,0.01785,0.18245,0.76125
0.03795,0.0188,0.1823,0.76095
0.03885,0.01775,0.18255,0.76085
0.0382,0.01805,0.1825,0.76125
0.03975,0.0168,0.1819,0.76155
0.0384,0.0166,0.1827,0.7623
0.03835,0.01725,0.1828,0.7616
0.0375,0.0172,0.1823,0.763
0.03605,0.0181,0.1829,0.76295
0.03695,0.0181,0.182,0.76295
0.03715,0.0177,0.18185,0.7633
0.03685,0.0181,0.18115,0.7639
0.0358,0.01815,0.1809,0.76515
0.03685,0.01755,0.18145,0.76415
0.03675,0.01745,0.1808,0.765
0.0366,0.017,0.1804,0.766
0.0372,0.017,0.18025,0.76555
0.0372,0.01745,0.17915,0.7662
0.0366,0.01755,0.1789,0.76695
0.03505,0.01735,0.17955,0.76805
0.03525,0.01705,0.1803,0.7674
0.0341,0.01815,0.17965,0.7681
0.0347,0.0179,0.17895,0.76845
0.0349,0.01795,0.1784,0.76875
0.03555,0.01855,0.1777,0.7682
0.0366,0.017,0.1781,0.7683
0.03625,0.01785,0.17785,0.76805
0.03635,0.01725,0.17795,0.76845
0.0365,0.01845,0.1767,0.76835
0.03685,0.0192,0.17585,0.7681
0.0366,0.0197,0.17545,0.76825
0.03765,0.0187,0.1759,0.76775
0.03775,0.0171,0.1761,0.76905
0.0374,0.0177,0.17605,0.76885
0.03815,0.0172,0.17605,0.7686
0.03745,0.01855,0.175,0.769
0.03755,0.01775,0.1743,0.7704
0.0375,0.01805,0.1743,0.77015
0.0374,0.0176,0.1752,0.7698
0.0369,0.01785,0.1748,0.77045
0.0375,0.0167,0.17535,0.77045
0.03705,0.0165,0.176,0.77045
0.03655,0.01695,0.1753,0.7712
0.0364,0.01575,0.17685,0.771
0.0358,0.0159,0.17815,0.77015
0.036,0.0156,0.17805,0.77035
0.03615,0.0161,0.1778,0.76995
0.03565,0.01685,0.17715,0.77035
0.0359,0.0163,0.1779,0.7699
0.03505,0.01615,0.17885,0.76995
0.03415,0.017,0.17825,0.7706
0.0343,0.01655,0.17755,0.7716
0.0344,0.01535,0.17885,0.7714
0.0346,0.01485,0.17865,0.7719
0.0338,0.0155,0.1784,0.7723
0.0331,0.0159,0.17885,0.77215
0.0331,0.01645,0.17875,0.7717
0.03285,0.01575,0.17805,0.77335
0.03345,0.01605,0.17915,0.77135
0.0332,0.0158,0.1797,0.7713
0.0328,0.016,0.1793,0.7719
0.03295,0.0148,0.17935,0.7729
0.032,0.0159,0.1796,0.7725
0.0326,0.01705,0.17915,0.7712
0.0327,0.01615,0.1798,0.77135
0.0326,0.0163,0.1798,0.7713
0.03195,0.0168,0.1799,0.77135
0.0318,0.01645,0.18135,0.7704
0.03115,0.017,0.18245,0.7694
0.0326,0.0164,0.1821,0.7689
0.0332,0.01635,0.1816,0.76885
0.03325,0.0164,0.18175,0.7686
0.0333,0.01685,0.181,0.76885
0.0337,0.01725,0.18035,0.7687
0.03385,0.0165,0.1805,0.76915
0.03415,0.01615,0.18035,0.76935
0.0341,0.0167,0.18085,0.76835
0.03345,0.0166,0.18135,0.7686
0.0346,0.01635,0.18085,0.7682
0.0347,0.0167,0.1801,0.7685
0.03515,0.01645,0.17965,0.76875
0.03545,0.0154,0.1797,0.76945
0.0358,0.0148,0.1811,0.7683
0.0353,0.0151,0.18175,0.76785
0.035,0.01555,0.1825,0.76695
0.03485,0.0156,0.1824,0.76715
0.03365,0.01595,0.18265,0.76775
0.03305,0.01665,0.18185,0.76845
0.033,0.0164,0.18195,0.76865
0.03325,0.0169,0.18125,0.7686
0.03395,0.0167,0.1809,0.76845
0.0337,0.016,0.18155,0.76875
0.034,0.0154,0.18135,0.76925
0.03415,0.01505,0.18135,0.76945
0.0333,0.01475,0.1828,0.76915
0.034,0.0162,0.18115,0.76865
0.0335,0.0169,0.1805,0.7691
0.03415,0.01715,0.1798,0.7689
0.03485,0.0174,0.1787,0.76905
0.0339,0.016,0.1805,0.7696
0.03435,0.01635,0.17975,0.76955
0.0351,0.0152,0.1808,0.7689
0.03345,0.0162,0.18115,0.7692
0.0337,0.0163,0.18195,0.76805
0.0344,0.0156,0.18235,0.76765
0.0344,0.01645,0.18125,0.7679
0.0339,0.01655,0.18155,0.768
0.0337,0.017,0.18125,0.76805
0.03375,0.0168,0.18185,0.7676
0.03355,0.0174,0.1807,0.76835
0.03305,0.0161,0.18285,0.768
0.03395,0.0161,0.18325,0.7667
0.03405,0.01645,0.1833,0.7662
0.033,0.01705,0.18385,0.7661
0.0335,0.01785,0.1833,0.76535
0.03375,0.0176,0.18385,0.7648
0.03495,0.01715,0.1836,0.7643
0.03525,0.01715,0.1828,0.7648
0.03495,0.01695,0.1827,0.7654
0.03565,0.0163,0.1827,0.76535
0.03675,0.0166,0.18185,0.7648
0.03595,0.01655,0.18045,0.76705
0.03635,0.0178,0.17915,0.7667
0.0352,0.0183,0.1788,0.7677
0.03535,0.0187,0.17745,0.7685
0.0365,0.0179,0.1775,0.7681
0.0373,0.01725,0.17755,0.7679
0.03755,0.0187,0.1761,0.76765
0.03675,0.01805,0.176,0.7692
0.03635,0.018,0.1752,0.77045
0.0369,0.01645,0.17595,0.7707
0.0375,0.016,0.17585,0.77065
0.0359,0.01635,0.17615,0.7716
0.0349,0.0157,0.1777,0.7717
0.0347,0.01625,0.17575,0.7733
0.0354,0.0158,0.1755,0.7733
0.0362,0.01605,0.1761,0.77165
0.0357,0.0159,0.1763,0.7721
0.03585,0.0151,0.1764,0.77265
0.0341,0.0152,0.17735,0.77335
0.0349,0.0159,0.17595,0.77325
0.0338,0.01615,0.17575,0.7743
0.03375,0.0159,0.17535,0.775
0.0338,0.016,0.1758,0.7744
0.0341,0.01635,0.175,0.77455
0.0343,0.0165,0.1754,0.7738
0.0331,0.01635,0.1762,0.77435
0.03355,0.0158,0.17555,0.7751
0.0326,0.0169,0.1751,0.7754
0.03305,0.01655,0.17545,0.77495
0.03375,0.01695,0.174,0.7753
0.0335,0.0172,0.17385,0.77545
0.0338,0.0164,0.17395,0.77585
0.03395,0.0168,0.1737,0.77555
0.0342,0.01595,0.1742,0.77565
0.0334,0.0159,0.17555,0.77515
0.0342,0.0155,0.17615,0.77415
0.03385,0.0157,0.1766,0.77385
0.03465,0.01495,0.17755,0.77285
0.03295,0.0164,0.17855,0.7721
0.03255,0.0148,0.17925,0.7734
0.0335,0.01435,0.18035,0.7718
0.03235,0.01495,0.1801,0.7726
0.03255,0.01535,0.17975,0.77235
0.03215,0.015,0.18045,0.7724
0.03225,0.015,0.1806,0.77215
0.0325,0.01475,0.1817,0.77105
0.03245,0.01515,0.1831,0.7693
0.03185,0.0147,0.18395,0.7695
0.03195,0.01465,0.185,0.7684
0.03175,0.01585,0.18475,0.76765
0.032,0.01555,0.1856,0.76685
0.03045,0.0175,0.18495,0.7671
0.0314,0.0165,0.18615,0.76595
0.0322,0.01545,0.1868,0.76555
0.0323,0.0152,0.18715,0.76535
0.0325,0.0158,0.18695,0.76475
0.0331,0.0166,0.187,0.7633
0.03305,0.01585,0.18665,0.76445
0.03385,0.016,0.1871,0.76305
0.0336,0.0163,0.1868,0.7633
0.0333,0.0158,0.18855,0.76235
0.0334,0.01635,0.18865,0.7616
0.0336,0.0168,0.1889,0.7607
0.03345,0.017,0.18915,0.7604
0.03305,0.01715,0.1902,0.7596
0.03355,0.0188,0.1894,0.75825
0.03455,0.01815,0.18975,0.75755
0.0359,0.0171,0.19035,0.75665
0.03585,0.018,0.18945,0.7567
0.0357,0.01755,0.1887,0.75805
0.03605,0.01715,0.18745,0.75935
0.03545,0.0169,0.1881,0.75955
0.0352,0.01795,0.18665,0.7602
0.03545,0.01825,0.1852,0.7611
0.036,0.01805,0.1849,0.76105
0.03605,0.0176,0.1851,0.76125
0.0364,0.01715,0.185,0.76145
0.03715,0.01815,0.18395,0.76075
0.0378,0.01775,0.1833,0.76115
0.0375,0.0183,0.18285,0.76135
0.03685,0.0184,0.18265,0.7621
0.0365,0.0177,0.1828,0.763
0.036,0.01915,0.18105,0.7638
0.0367,0.01885,0.1812,0.76325
0.037,0.01825,0.18035,0.7644
0.0373,0.0185,0.17955,0.76465
0.03835,0.0181,0.17865,0.7649
0.03885,0.01825,0.17745,0.76545
0.0393,0.01665,0.17795,0.7661
0.0383,0.01675,0.1778,0.76715
0.03635,0.01825,0.17775,0.76765
0.0361,0.02035,0.176,0.76755
0.03715,0.02055,0.1761,0.7662
0.03705,0.0198,0.1768,0.76635
0.03745,0.02,0.1753,0.76725
0.0375,0.0188,0.1756,0.7681
0.03805,0.0183,0.1761,0.76755
0.0372,0.0183,0.17725,0.76725
0.03855,0.017,0.17745,0.767
0.03795,0.01685,0.1764,0.7688
0.03655,0.0177,0.1764,0.76935
0.03765,0.01685,0.17685,0.76865
0.03705,0.01775,0.17605,0.76915
0.0374,0.01825,0.17585,0.7685
0.0373,0.01765,0.1758,0.76925
0.0374,0.01765,0.17565,0.7693
0.0377,0.01835,0.1763,0.76765
0.0377,0.0184,0.1763,0.7676
0.03785,0.01835,0.1757,0.7681
0.0371,0.01815,0.17465,0.7701
0.0371,0.01755,0.1747,0.77065
0.03675,0.01765,0.17475,0.77085
0.0372,0.01725,0.1751,0.77045
0.0372,0.0165,0.17475,0.77155
0.0369,0.01725,0.1745,0.77135
0.03665,0.01745,0.17385,0.77205
0.0364,0.01795,0.1744,0.77125
0.036,0.0179,0.17545,0.77065
0.0366,0.0166,0.1753,0.7715
0.03625,0.01635,0.1762,0.7712
0.0367,0.0161,0.17655,0.77065
0.03585,0.0155,0.17755,0.7711
0.03495,0.0157,0.1776,0.77175
0.03445,0.0162,0.1781,0.77125
0.03465,0.01635,0.17805,0.77095
0.03415,0.01605,0.17815,0.77165
0.0343,0.016,0.1785,0.7712
0.0341,0.0161,0.17925,0.77055
0.0339,0.0158,0.1805,0.7698
0.03395,0.0158,0.18135,0.7689
0.03305,0.0167,0.18165,0.7686
0.03405,0.0154,0.1825,0.76805
0.0335,0.015,0.18405,0.76745
0.03295,0.0152,0.18545,0.7664
0.032,0.0153,0.1867,0.766
0.03205,0.01645,0.18655,0.76495
0.03275,0.01615,0.18805,0.76305
0.03325,0.01595,0.18975,0.76105
0.0333,0.0159,0.1897,0.7611
0.03315,0.01595,0.19005,0.76085
0.03355,0.01685,0.1888,0.7608
0.0335,0.01665,0.1893,0.76055
0.03365,0.0174,0.18925,0.7597
0.03495,0.0175,0.189,0.75855
0.0365,0.01765,0.18835,0.7575
0.03695,0.0182,0.1871,0.75775
0.0368,0.0176,0.1874,0.7582
0.0369,0.0167,0.18725,0.75915
0.03705,0.0178,0.18695,0.7582
0.03765,0.0176,0.18735,0.7574
0.0381,0.01725,0.18685,0.7578
0.0388,0.01695,0.1871,0.75715
0.03815,0.01755,0.1871,0.7572
0.03755,0.01795,0.1876,0.7569
0.0372,0.01765,0.1871,0.75805
0.03705,0.01825,0.1867,0.758
0.0377,0.0191,0.1859,0.7573
0.0378,0.01875,0.18565,0.7578
0.0378,0.01895,0.1847,0.75855
0.03855,0.01915,0.1833,0.759
0.0394,0.01825,0.1822,0.76015
0.04055,0.01885,0.1817,0.7589
0.03905,0.0185,0.1813,0.76115
0.0397,0.01765,0.18245,0.7602
0.04005,0.01785,0.18165,0.76045
0.0398,0.01845,0.18115,0.7606
0.0401,0.01855,0.18075,0.7606
0.04085,0.01795,0.18045,0.76075
0.04015,0.01785,0.17985,0.76215
0.0392,0.01845,0.179,0.76335
0.03765,0.01865,0.1795,0.7642
0.0368,0.01795,0.1806,0.76465
0.0357,0.0191,0.18005,0.76515
0.03605,0.02005,0.17885,0.76505
0.03695,0.0193,0.17885,0.7649
0.0391,0.0185,0.1788,0.7636
0.0384,0.01815,0.1793,0.76415
0.0379,0.0187,0.17875,0.76465
0.0383,0.01795,0.17845,0.7653
0.03745,0.01775,0.1787,0.7661
0.0378,0.01695,0.17965,0.7656
0.037,0.01795,0.17915,0.7659
0.03755,0.0173,0.17825,0.7669
0.03795,0.0175,0.17805,0.7665
0.03775,0.01695,0.17755,0.76775
0.03805,0.0159,0.17715,0.7689
0.0377,0.0156,0.1774,0.7693
0.03665,0.01595,0.1772,0.7702
0.03595,0.0173,0.1772,0.76955
0.0363,0.01695,0.17715,0.7696
0.0363,0.01725,0.17775,0.7687
0.03715,0.01715,0.1773,0.7684
0.037,0.01805,0.17605,0.7689
0.03745,0.01745,0.1761,0.769
0.03805,0.01795,0.1753,0.7687
0.0385,0.0172,0.17645,0.76785
0.0387,0.0162,0.1766,0.7685
0.03785,0.01645,0.17695,0.76875
0.0374,0.016,0.17735,0.76925
0.03695,0.0164,0.17815,0.7685
0.03555,0.0174,0.1779,0.76915
0.03575,0.01665,0.1785,0.7691
0.03595,0.01685,0.17745,0.76975
0.0358,0.0164,0.1773,0.7705
0.0357,0.0161,0.1776,0.7706
0.0349,0.01605,0.17805,0.771
0.03485,0.0161,0.1781,0.77095
0.0345,0.0157,0.1779,0.7719
0.03425,0.01635,0.1779,0.7715
0.0337,0.0168,0.1773,0.7722
0.03395,0.0159,0.17785,0.7723
0.0333,0.0161,0.17815,0.77245
0.03275,0.01515,0.18085,0.77125
0.0328,0.01455,0.1825,0.77015
0.0322,0.01555,0.1825,0.76975
0.0306,0.0166,0.1835,0.7693
0.0307,0.0155,0.18475,0.76905
0.03195,0.01475,0.1848,0.7685
0.0317,0.0142,0.1871,0.767
0.032,0.01415,0.1879,0.76595
0.0303,0.0157,0.18695,0.76705
0.03025,0.01525,0.18715,0.76735
0.03035,0.0155,0.18735,0.7668
0.02985,0.01555,0.1886,0.766
0.0307,0.01555,0.1892,0.76455
0.03125,0.01555,0.18945,0.76375
0.03195,0.01545,0.1895,0.7631
0.0306,0.01685,0.1895,0.76305
0.03195,0.01625,0.18915,0.76265
0.03245,0.0156,0.18865,0.7633
0.03255,0.0156,0.1892,0.76265
0.03325,0.016,0.1886,0.76215
0.03295,0.0163,0.18945,0.7613
0.0336,0.01635,0.19085,0.7592
0.0335,0.01635,0.19145,0.7587
0.03315,0.0172,0.19145,0.7582
0.0332,0.01725,0.19105,0.7585
0.03425,0.01655,0.19115,0.75805
0.03475,0.0161,0.1907,0.75845
0.0343,0.0171,0.19005,0.75855
0.0341,0.01725,0.1893,0.75935
0.0341,0.01765,0.1888,0.75945
0.0338,0.0179,0.18735,0.76095
0.0349,0.01755,0.18675,0.7608
0.0355,0.01815,0.18575,0.7606
0.0352,0.0185,0.1856,0.7607
0.0362,0.01855,0.1849,0.76035
0.03755,0.01845,0.1851,0.7589
0.0391,0.0169,0.18565,0.75835
0.039,0.0173,0.18455,0.75915
0.03895,0.0175,0.1835,0.76005
0.0387,0.01795,0.18385,0.7595
0.0384,0.01825,0.18425,0.7591
0.03865,0.01835,0.18455,0.75845
0.03855,0.01965,0.18345,0.75835
0.03895,0.02095,0.18115,0.75895
0.03925,0.02075,0.18055,0.75945
0.04005,0.02025,0.17875,0.76095
0.04055,0.0202,0.1772,0.76205
0.03945,0.0202,0.177,0.76335
0.03985,0.01925,0.17735,0.76355
0.04035,0.0182,0.178,0.76345
0.0398,0.0187,0.17705,0.76445
0.03955,0.0185,0.17665,0.7653
0.03935,0.01755,0.1764,0.7667
0.0387,0.0169,0.1763,0.7681
0.0381,0.0165,0.17695,0.76845
0.03765,0.0172,0.1783,0.76685
0.0368,0.01765,0.17815,0.7674
0.0361,0.01825,0.17735,0.7683
0.0358,0.01865,0.177,0.76855
0.0368,0.01745,0.17665,0.7691
0.03675,0.018,0.1757,0.76955
0.03725,0.01735,0.1756,0.7698
