I,E,S,R
0.001000,0.000700,0.998300,0.000000
0.000800,0.001300,0.997550,0.000350
0.001000,0.001900,0.996600,0.000500
0.001250,0.002200,0.996000,0.000550
0.001600,0.002750,0.995050,0.000600
0.002400,0.003250,0.993650,0.000700
0.003000,0.004300,0.991750,0.000950
0.003900,0.005550,0.989200,0.001350
0.005550,0.007400,0.985350,0.001700
0.006850,0.008800,0.981700,0.002650
0.009250,0.012300,0.975000,0.003450
0.012050,0.016200,0.967500,0.004250
0.014450,0.020700,0.958250,0.006600
0.018600,0.027450,0.945700,0.008250
0.024300,0.036550,0.928550,0.010600
0.030550,0.047650,0.908300,0.013500
0.038150,0.060800,0.882950,0.018100
0.050900,0.073500,0.852400,0.023200
0.064700,0.091500,0.813850,0.029950
0.083600,0.112050,0.767050,0.037300
0.104050,0.137450,0.710650,0.047850
0.130600,0.160650,0.647300,0.061450
0.158250,0.184050,0.578900,0.078800
0.188000,0.204650,0.505750,0.101600
0.221950,0.222200,0.429800,0.126050
0.254950,0.234700,0.356850,0.153500
0.291800,0.238800,0.286000,0.183400
0.323200,0.231950,0.223800,0.221050
0.344000,0.219000,0.171250,0.265750
0.363650,0.197450,0.129250,0.309650
0.375350,0.173850,0.097250,0.353550
0.373700,0.149950,0.072550,0.403800
0.364400,0.125950,0.056250,0.453400
0.346500,0.105650,0.044850,0.503000
0.328500,0.086300,0.036300,0.548900
0.308300,0.070150,0.030650,0.590900
0.285450,0.057450,0.026700,0.630400
0.262750,0.047100,0.022000,0.668150
0.240600,0.038200,0.020550,0.700650
0.218050,0.031400,0.018400,0.732150
0.198250,0.025350,0.017950,0.758450
0.178750,0.021100,0.018600,0.781550
0.159100,0.017250,0.018400,0.805250
0.145850,0.014000,0.018600,0.821550
0.130350,0.011300,0.019350,0.839000
0.116650,0.009750,0.021050,0.852550
0.103700,0.008450,0.022750,0.865100
0.091250,0.007650,0.023850,0.877250
0.081400,0.007400,0.024850,0.886350
0.070750,0.006950,0.026300,0.896000
0.064850,0.005700,0.029000,0.900450
0.057950,0.005450,0.031150,0.905450
0.051250,0.005250,0.033250,0.910250
0.045400,0.004650,0.035200,0.914750
0.040950,0.004350,0.036600,0.918100
0.036100,0.004450,0.038700,0.920750
0.033150,0.003500,0.041700,0.921650
0.029400,0.002950,0.044800,0.922850
0.026500,0.003200,0.047050,0.923250
0.022900,0.003150,0.048700,0.925250
0.020750,0.002850,0.051500,0.924900
0.019500,0.002950,0.053350,0.924200
0.018200,0.002700,0.056150,0.922950
0.016000,0.002650,0.058600,0.922750
0.014900,0.002550,0.061400,0.921150
0.013400,0.002500,0.064400,0.919700
0.012300,0.002200,0.067800,0.917700
0.011250,0.002050,0.071000,0.915700
0.009850,0.001900,0.073450,0.914800
0.008750,0.001850,0.075400,0.914000
0.007400,0.001700,0.078100,0.912800
0.006800,0.001350,0.081450,0.910400
0.006050,0.001350,0.084000,0.908600
0.005950,0.001350,0.086750,0.905950
0.005050,0.001000,0.089650,0.904300
0.004550,0.001150,0.092050,0.902250
0.004250,0.001050,0.095100,0.899600
0.003900,0.000900,0.097950,0.897250
0.003750,0.000850,0.100000,0.895400
0.003600,0.001000,0.102600,0.892800
0.003400,0.000850,0.105450,0.890300
0.002950,0.000800,0.108800,0.887450
0.002600,0.000900,0.111550,0.884950
0.002700,0.000800,0.113850,0.882650
0.002500,0.000800,0.116500,0.880200
0.002500,0.000700,0.119450,0.877350
0.002300,0.000750,0.122350,0.874600
0.002200,0.000850,0.124800,0.872150
0.002200,0.000750,0.127400,0.869650
0.002050,0.000600,0.130050,0.867300
0.001900,0.000650,0.132200,0.865250
0.001900,0.000600,0.134850,0.862650
0.001800,0.000700,0.137250,0.860250
0.001700,0.000550,0.139700,0.858050
0.001550,0.000650,0.142200,0.855600
0.001450,0.000600,0.144500,0.853450
0.001150,0.000550,0.147200,0.851100
0.000950,0.000700,0.149700,0.848650
0.000950,0.000600,0.151850,0.846600
0.001050,0.000400,0.153850,0.844700
0.001100,0.000300,0.156650,0.841950
0.000950,0.000350,0.158900,0.839800
0.000900,0.000400,0.160850,0.837850
0.000950,0.000250,0.163250,0.835550
0.000800,0.000350,0.165700,0.833150
0.000750,0.000500,0.168000,0.830750
0.000550,0.000400,0.170050,0.829000
0.000650,0.000300,0.172500,0.826550
0.000750,0.000250,0.174850,0.824150
0.000700,0.000350,0.177000,0.821950
0.000750,0.000250,0.179150,0.819850
0.000750,0.000350,0.181900,0.817000
0.000850,0.000300,0.184100,0.814750
0.000900,0.000250,0.186950,0.811900
0.000750,0.000400,0.188700,0.810150
0.000850,0.000350,0.191350,0.807450
0.000800,0.000250,0.194000,0.804950
0.000750,0.000350,0.195900,0.803000
0.000850,0.000250,0.198600,0.800300
0.000750,0.000300,0.200800,0.798150
0.000750,0.000400,0.203150,0.795700
0.000900,0.000200,0.206000,0.792900
0.000850,0.000550,0.208100,0.790500
0.000800,0.000600,0.210000,0.788600
0.001000,0.000600,0.212150,0.786250
0.001100,0.000600,0.214350,0.783950
0.001000,0.000650,0.216100,0.782250
0.001150,0.000650,0.217600,0.780600
0.001250,0.000600,0.219650,0.778500
0.001300,0.000550,0.222100,0.776050
0.001100,0.000550,0.224550,0.773800
0.001200,0.000700,0.226700,0.771400
0.001400,0.000700,0.228950,0.768950
0.001350,0.000750,0.231150,0.766750
0.001550,0.000800,0.233000,0.764650
0.001600,0.000800,0.234950,0.762650
0.001650,0.000850,0.236650,0.760850
0.001550,0.000850,0.237950,0.759650
0.001300,0.000950,0.239700,0.758050
0.001300,0.001000,0.241600,0.756100
0.001500,0.000850,0.243250,0.754400
0.001600,0.000850,0.245150,0.752400
0.001750,0.000850,0.246800,0.750600
0.001950,0.001100,0.248850,0.748100
0.001950,0.001350,0.250500,0.746200
0.002150,0.001250,0.252200,0.744400
0.001950,0.001600,0.253550,0.742900
0.002150,0.001950,0.254900,0.741000
0.002150,0.001800,0.256750,0.739300
0.002250,0.001750,0.258900,0.737100
0.002600,0.002150,0.259350,0.735900
0.002650,0.002150,0.261150,0.734050
0.002900,0.002350,0.262400,0.732350
0.002750,0.002200,0.264750,0.730300
0.003050,0.002250,0.266150,0.728550
0.003450,0.001800,0.267750,0.727000
0.003600,0.001550,0.269650,0.725200
0.003200,0.001750,0.271400,0.723650
0.003300,0.002400,0.272100,0.722200
0.003550,0.001900,0.274050,0.720500
0.003500,0.002050,0.275300,0.719150
0.003550,0.002400,0.277000,0.717050
0.003350,0.002400,0.278150,0.716100
0.003750,0.002200,0.279900,0.714150
0.003850,0.002150,0.281100,0.712900
0.003750,0.002500,0.282400,0.711350
0.004050,0.002250,0.283950,0.709750
0.003850,0.002750,0.285250,0.708150
0.004100,0.002550,0.287050,0.706300
0.003850,0.003250,0.288000,0.704900
0.004200,0.003300,0.289150,0.703350
0.004150,0.003600,0.289650,0.702600
0.004300,0.003500,0.291150,0.701050
0.004800,0.003550,0.292350,0.699300
0.004800,0.004250,0.293050,0.697900
0.005550,0.004000,0.293900,0.696550
0.006000,0.003700,0.294950,0.695350
0.006300,0.003650,0.295500,0.694550
0.006700,0.004000,0.296050,0.693250
0.006650,0.004450,0.295850,0.693050
0.006550,0.004500,0.296550,0.692400
0.006700,0.005000,0.296800,0.691500
0.007050,0.004900,0.297600,0.690450
0.007600,0.005250,0.297250,0.689900
0.007700,0.005200,0.297300,0.689800
0.008250,0.005300,0.298350,0.688100
0.008900,0.005500,0.298000,0.687600
0.009700,0.005650,0.298050,0.686600
0.009350,0.006600,0.298100,0.685950
0.009950,0.007300,0.297650,0.685100
0.010700,0.007950,0.297850,0.683500
0.011650,0.008150,0.297250,0.682950
0.012850,0.008250,0.296850,0.682050
0.013350,0.008550,0.296100,0.682000
0.014500,0.008600,0.295300,0.681600
0.015000,0.009650,0.294050,0.681300
0.015350,0.010450,0.292500,0.681700
0.016050,0.011450,0.291250,0.681250
0.018000,0.012400,0.288500,0.681100
0.019150,0.014000,0.285350,0.681500
0.020200,0.013850,0.283100,0.682850
0.021250,0.014300,0.281100,0.683350
0.022850,0.015650,0.278350,0.683150
0.023600,0.016600,0.275700,0.684100
0.025000,0.017200,0.272350,0.685450
0.025950,0.017700,0.269000,0.687350
0.027700,0.017450,0.266050,0.688800
0.029750,0.017550,0.262900,0.689800
0.030350,0.019200,0.258200,0.692250
0.032100,0.020550,0.254300,0.693050
0.033600,0.021050,0.250350,0.695000
0.034550,0.021500,0.246800,0.697150
0.036000,0.023400,0.241950,0.698650
0.037850,0.024750,0.236900,0.700500
0.039400,0.025550,0.231650,0.703400
0.040750,0.025350,0.226650,0.707250
0.043450,0.025900,0.221650,0.709000
0.044700,0.026250,0.216950,0.712100
0.045150,0.027000,0.211400,0.716450
0.047200,0.026050,0.206650,0.720100
0.048350,0.026200,0.201100,0.724350
0.048600,0.027550,0.195650,0.728200
0.049350,0.028650,0.189150,0.732850
0.051000,0.028050,0.184600,0.736350
0.053500,0.026900,0.179650,0.739950
0.053350,0.026100,0.174500,0.746050
0.053950,0.026250,0.169850,0.749950
0.054400,0.025350,0.166500,0.753750
0.054550,0.025350,0.162600,0.757500
0.055050,0.024250,0.158500,0.762200
0.054000,0.024850,0.154950,0.766200
0.054300,0.023350,0.152000,0.770350
0.053950,0.022050,0.149100,0.774900
0.053650,0.022200,0.146050,0.778100
0.052900,0.022100,0.143200,0.781800
0.052950,0.021800,0.139650,0.785600
0.052500,0.022200,0.136900,0.788400
0.049700,0.022400,0.134850,0.793050
0.048000,0.022000,0.133000,0.797000
0.047100,0.021800,0.130700,0.800400
0.045900,0.021200,0.129250,0.803650
0.045650,0.019500,0.127950,0.806900
0.045450,0.018500,0.128650,0.807400
0.043700,0.016950,0.129100,0.810250
0.042500,0.015700,0.129050,0.812750
0.040600,0.015100,0.129750,0.814550
0.038700,0.015200,0.129800,0.816300
0.038150,0.013850,0.130400,0.817600
0.036050,0.013300,0.130400,0.820250
0.034450,0.012750,0.131500,0.821300
0.033400,0.012100,0.132850,0.821650
0.031100,0.012100,0.133700,0.823100
0.031350,0.010250,0.136150,0.822250
0.029950,0.011000,0.137450,0.821600
0.029300,0.010800,0.138200,0.821700
0.027850,0.011050,0.139600,0.821500
0.027400,0.010600,0.141000,0.821000
0.026100,0.010550,0.142100,0.821250
0.025200,0.010750,0.143600,0.820450
0.024350,0.010450,0.144650,0.820550
0.023850,0.010050,0.146300,0.819800
0.023050,0.010250,0.147750,0.818950
0.022150,0.009800,0.148450,0.819600
0.021950,0.009450,0.151800,0.816800
0.021000,0.009350,0.153200,0.816450
0.021150,0.008800,0.155700,0.814350
0.020600,0.009200,0.158250,0.811950
0.020800,0.008850,0.159750,0.810600
0.021650,0.008600,0.161300,0.808450
0.020950,0.008950,0.162800,0.807300
0.019850,0.008750,0.165400,0.806000
0.019300,0.009050,0.167150,0.804500
0.019050,0.008950,0.169100,0.802900
0.019150,0.009200,0.170050,0.801600
0.019450,0.009000,0.172050,0.799500
0.019750,0.008300,0.174650,0.797300
0.019650,0.007850,0.176900,0.795600
0.019350,0.008750,0.177950,0.793950
0.019000,0.009650,0.178250,0.793100
0.019500,0.009450,0.179450,0.791600
0.019050,0.009450,0.180550,0.790950
0.018800,0.008450,0.182600,0.790150
0.017900,0.009250,0.184050,0.788800
0.017250,0.010100,0.185600,0.787050
0.017900,0.009300,0.187550,0.785250
0.017100,0.009100,0.189750,0.784050
0.017200,0.009100,0.191950,0.781750
0.017200,0.009100,0.193800,0.779900
0.017250,0.008750,0.195750,0.778250
0.017700,0.008450,0.197950,0.775900
0.018600,0.008350,0.199650,0.773400
0.018650,0.008200,0.202000,0.771150
0.018350,0.008500,0.203200,0.769950
0.018650,0.009350,0.204550,0.767450
0.018950,0.008950,0.206850,0.765250
0.018500,0.009050,0.208500,0.763950
0.018050,0.009450,0.210100,0.762400
0.018050,0.009900,0.210800,0.761250
0.018450,0.010300,0.211950,0.759300
0.018700,0.011300,0.212800,0.757200
0.019400,0.011650,0.213650,0.755300
0.019950,0.012000,0.213850,0.754200
0.020300,0.011100,0.214850,0.753750
0.020400,0.011400,0.215500,0.752700
0.021250,0.011050,0.216100,0.751600
0.021400,0.011650,0.216100,0.750850
0.021850,0.011250,0.218250,0.748650
0.022300,0.011400,0.219350,0.746950
0.023100,0.011600,0.219850,0.745450
0.022150,0.012650,0.220700,0.744500
0.022750,0.012800,0.221700,0.742750
0.023450,0.012900,0.223200,0.740450
0.023100,0.013100,0.224700,0.739100
0.023900,0.013050,0.224550,0.738500
0.024350,0.013000,0.224300,0.738350
0.024200,0.013500,0.224050,0.738250
0.025200,0.014350,0.223900,0.736550
0.025750,0.015500,0.223100,0.735650
0.028100,0.014700,0.222400,0.734800
0.028300,0.015850,0.221550,0.734300
0.028650,0.017200,0.219950,0.734200
0.030550,0.016250,0.220450,0.732750
0.030350,0.016250,0.219750,0.733650
0.031000,0.016900,0.219150,0.732950
0.031750,0.017100,0.217250,0.733900
0.032250,0.017450,0.216000,0.734300
0.034400,0.017500,0.214450,0.733650
0.035350,0.017850,0.213850,0.732950
0.034650,0.018750,0.212050,0.734550
0.036000,0.018900,0.210400,0.734700
0.035250,0.020150,0.208900,0.735700
0.035800,0.021050,0.207350,0.735800
0.036900,0.021200,0.205550,0.736350
0.037050,0.022050,0.203200,0.737700
0.038000,0.021650,0.202100,0.738250
0.039050,0.021350,0.201100,0.738500
0.039900,0.021700,0.199250,0.739150
0.040500,0.022750,0.197150,0.739600
0.042250,0.021400,0.196200,0.740150
0.043250,0.021700,0.193850,0.741200
0.043150,0.023600,0.191600,0.741650
0.045050,0.023150,0.189050,0.742750
0.044750,0.023700,0.187100,0.744450
0.043950,0.024900,0.184700,0.746450
0.044900,0.024300,0.182600,0.748200
0.044700,0.024400,0.180950,0.749950
0.045150,0.023550,0.179500,0.751800
0.045650,0.023500,0.177400,0.753450
0.046300,0.024200,0.175800,0.753700
0.047250,0.023850,0.172950,0.755950
0.046700,0.024350,0.170750,0.758200
0.047300,0.022850,0.170250,0.759600
0.046850,0.022850,0.168250,0.762050
0.046850,0.023450,0.165700,0.764000
0.046650,0.021950,0.164750,0.766650
0.045900,0.022650,0.162900,0.768550
0.047600,0.021500,0.160600,0.770300
0.047350,0.020850,0.160600,0.771200
0.047450,0.019750,0.160100,0.772700
0.045150,0.020700,0.159500,0.774650
0.044350,0.020600,0.158550,0.776500
0.044550,0.020000,0.158450,0.777000
0.045100,0.018700,0.157700,0.778500
0.043750,0.019000,0.157700,0.779550
0.042500,0.018200,0.158200,0.781100
0.041000,0.018550,0.157800,0.782650
0.042050,0.018000,0.157850,0.782100
0.040900,0.018100,0.158450,0.782550
0.040050,0.017950,0.157950,0.784050
0.039400,0.018200,0.157950,0.784450
0.039200,0.018350,0.156950,0.785500
0.039400,0.018450,0.156200,0.785950
0.039300,0.017450,0.156650,0.786600
0.039150,0.017300,0.156150,0.787400
0.038450,0.017800,0.156250,0.787500
0.038550,0.017250,0.157550,0.786650
0.038350,0.017450,0.158200,0.786000
0.037350,0.017000,0.158100,0.787550
0.036500,0.016850,0.159250,0.787400
0.036600,0.016150,0.159700,0.787550
0.036750,0.014950,0.160650,0.787650
0.036700,0.014200,0.161950,0.787150
0.035950,0.014450,0.162250,0.787350
0.033950,0.015600,0.162550,0.787900
0.033500,0.015750,0.163150,0.787600
0.032750,0.015000,0.164400,0.787850
0.033000,0.014250,0.165700,0.787050
0.032000,0.015050,0.166300,0.786650
0.032300,0.015200,0.167800,0.784700
0.031800,0.015900,0.168500,0.783800
0.031900,0.015300,0.169850,0.782950
0.032000,0.014400,0.171500,0.782100
0.031150,0.013550,0.173300,0.782000
0.031500,0.014100,0.174300,0.780100
0.031750,0.014550,0.174150,0.779550
0.032100,0.013800,0.175800,0.778300
0.031150,0.014600,0.176100,0.778150
0.031300,0.014250,0.176350,0.778100
0.030750,0.014850,0.175300,0.779100
0.031750,0.014300,0.176750,0.777200
0.031050,0.015100,0.177900,0.775950
0.030250,0.015550,0.178650,0.775550
0.030200,0.015600,0.180250,0.773950
0.030500,0.015200,0.180900,0.773400
0.030500,0.015050,0.181650,0.772800
0.031300,0.014150,0.182850,0.771700
0.030850,0.015450,0.182500,0.771200
0.032050,0.015700,0.183400,0.768850
0.032200,0.016300,0.182900,0.768600
0.032650,0.016450,0.183350,0.767550
0.033150,0.016400,0.184350,0.766100
0.033250,0.016050,0.184300,0.766400
0.033050,0.015250,0.185100,0.766600
0.033500,0.015000,0.186200,0.765300
0.031750,0.016650,0.186450,0.765150
0.031050,0.016950,0.187000,0.765000
0.031600,0.017250,0.187100,0.764050
0.032150,0.016900,0.187900,0.763050
0.032350,0.017900,0.187100,0.762650
0.033450,0.017400,0.187550,0.761600
0.034000,0.015900,0.187650,0.762450
0.033250,0.016950,0.188050,0.761750
0.034500,0.017500,0.187200,0.760800
0.034500,0.017300,0.187150,0.761050
0.035300,0.017300,0.186300,0.761100
0.034850,0.017750,0.185000,0.762400
0.034750,0.017350,0.185350,0.762550
0.034200,0.015850,0.186700,0.763250
0.034350,0.016300,0.185400,0.763950
0.033400,0.017650,0.184100,0.764850
0.033450,0.017450,0.184550,0.764550
0.033900,0.017500,0.183950,0.764650
0.033850,0.017500,0.183050,0.765600
0.034550,0.017650,0.182500,0.765300
0.035100,0.017250,0.183100,0.764550
0.034600,0.018750,0.182550,0.764100
0.034650,0.019700,0.180700,0.764950
0.035150,0.019100,0.179600,0.766150
0.034600,0.019650,0.179300,0.766450
0.035350,0.018850,0.178600,0.767200
0.034900,0.018600,0.179100,0.767400
0.034900,0.017950,0.179500,0.767650
0.035800,0.017700,0.179500,0.767000
0.034900,0.018650,0.178500,0.767950
0.035750,0.017550,0.179700,0.767000
0.036300,0.017650,0.178800,0.767250
0.036100,0.015900,0.179850,0.768150
0.035900,0.016850,0.178450,0.768800
0.036050,0.017000,0.178800,0.768150
0.035850,0.017050,0.180100,0.767000
0.036300,0.015900,0.180600,0.767200
0.036250,0.016850,0.179800,0.767100
0.036250,0.016550,0.180800,0.766400
0.036200,0.016400,0.181350,0.766050
0.035750,0.017250,0.180650,0.766350
0.035350,0.017350,0.180950,0.766350
0.035250,0.016950,0.180300,0.767500
0.035000,0.017650,0.179450,0.767900
0.035250,0.016750,0.179150,0.768850
0.033750,0.018450,0.178850,0.768950
0.034750,0.017000,0.178500,0.769750
0.034300,0.017750,0.177400,0.770550
0.034050,0.017800,0.177650,0.770500
0.033600,0.017400,0.177300,0.771700
0.034100,0.016950,0.178050,0.770900
0.033800,0.017000,0.179150,0.770050
0.034850,0.016250,0.179800,0.769100
0.033350,0.017200,0.179650,0.769800
0.033650,0.017300,0.180350,0.768700
0.034650,0.016700,0.179600,0.769050
0.034200,0.017300,0.178250,0.770250
0.034300,0.017200,0.177100,0.771400
0.035150,0.016900,0.177550,0.770400
0.035550,0.016300,0.177900,0.770250
0.035100,0.016300,0.178350,0.770250
0.035750,0.016400,0.178800,0.769050
0.035800,0.016400,0.178300,0.769500
0.035050,0.017150,0.179000,0.768800
0.033300,0.017200,0.178550,0.770950
0.033000,0.018150,0.178450,0.770400
0.033900,0.017000,0.178150,0.770950
0.033950,0.015900,0.178700,0.771450
0.033500,0.017550,0.177250,0.771700
0.035050,0.017350,0.175900,0.771700
0.034100,0.017100,0.176450,0.772350
0.034100,0.016450,0.177900,0.771550
0.033350,0.017050,0.177600,0.772000
0.032400,0.017650,0.176550,0.773400
0.033300,0.016950,0.176700,0.773050
0.033900,0.015850,0.177150,0.773100
0.033900,0.015500,0.178250,0.772350
0.033350,0.015550,0.178900,0.772200
0.033750,0.014700,0.179600,0.771950
0.033400,0.015950,0.178500,0.772150
0.033400,0.015600,0.177750,0.773250
0.033100,0.014950,0.177600,0.774350
0.032600,0.015450,0.177900,0.774050
0.031950,0.015550,0.177950,0.774550
0.032550,0.014350,0.179200,0.773900
0.031850,0.014600,0.179750,0.773800
0.031750,0.015350,0.179500,0.773400
0.031450,0.016200,0.179150,0.773200
0.032250,0.015600,0.179100,0.773050
0.033050,0.015350,0.179000,0.772600
0.033100,0.014950,0.178500,0.773450
0.032750,0.014350,0.180200,0.772700
0.031700,0.014750,0.181750,0.771800
0.032050,0.014750,0.181600,0.771600
0.031300,0.015500,0.182600,0.770600
0.032500,0.014450,0.182500,0.770550
0.031750,0.014750,0.182400,0.771100
0.031600,0.015000,0.181950,0.771450
0.032700,0.014900,0.181850,0.770550
0.033250,0.015650,0.181400,0.769700
0.032400,0.015650,0.181400,0.770550
0.032000,0.016450,0.180850,0.770700
0.031900,0.016850,0.179900,0.771350
0.032900,0.015900,0.181250,0.769950
0.032500,0.016900,0.180650,0.769950
0.032050,0.017900,0.179800,0.770250
0.032600,0.016550,0.180650,0.770200
0.032650,0.017250,0.181200,0.768900
0.032850,0.017250,0.181600,0.768300
0.033450,0.017500,0.181900,0.767150
0.033600,0.017350,0.180950,0.768100
0.033800,0.016850,0.180450,0.768900
0.034750,0.016800,0.180300,0.768150
0.035650,0.017100,0.179400,0.767850
0.035550,0.018300,0.178300,0.767850
0.036050,0.017050,0.179100,0.767800
0.036450,0.015900,0.179900,0.767750
0.035300,0.016100,0.179850,0.768750
0.034600,0.016550,0.180100,0.768750
0.035200,0.016750,0.179450,0.768600
0.035100,0.016300,0.179650,0.768950
0.033600,0.016950,0.179150,0.770300
0.033250,0.016600,0.179250,0.770900
0.032700,0.015700,0.180300,0.771300
0.032550,0.014600,0.181150,0.771700
0.032850,0.014450,0.181450,0.771250
0.032450,0.014550,0.181150,0.771850
0.031950,0.015700,0.180550,0.771800
0.031900,0.015400,0.181200,0.771500
0.032150,0.014300,0.180900,0.772650
0.031400,0.014950,0.180600,0.773050
0.031500,0.015900,0.180500,0.772100
0.031400,0.014650,0.181900,0.772050
0.030000,0.015100,0.182250,0.772650
0.028800,0.015400,0.183100,0.772700
0.029450,0.014350,0.185250,0.770950
0.029350,0.014750,0.185750,0.770150
0.028550,0.014950,0.186050,0.770450
0.029550,0.014950,0.187600,0.767900
0.029800,0.014700,0.188550,0.766950
0.029300,0.015450,0.188300,0.766950
0.030000,0.014600,0.189500,0.765900
0.030500,0.014800,0.189550,0.765150
0.031450,0.014800,0.190100,0.763650
0.032500,0.015200,0.190000,0.762300
0.032000,0.015850,0.189900,0.762250
0.031900,0.016150,0.190050,0.761900
0.032550,0.016150,0.189750,0.761550
0.032750,0.016550,0.189350,0.761350
0.034600,0.016100,0.189000,0.760300
0.034950,0.017000,0.187600,0.760450
0.035750,0.016400,0.188050,0.759800
0.034950,0.017050,0.188150,0.759850
0.034700,0.018000,0.187950,0.759350
0.034750,0.017850,0.187800,0.759600
0.034800,0.017650,0.187950,0.759600
0.034400,0.018000,0.187800,0.759800
0.035850,0.016800,0.187500,0.759850
0.036200,0.017650,0.186400,0.759750
0.035350,0.017350,0.186350,0.760950
0.035100,0.016900,0.186150,0.761850
0.035600,0.016100,0.186900,0.761400
0.034500,0.017150,0.186250,0.762100
0.034650,0.017400,0.186700,0.761250
0.034600,0.017850,0.186450,0.761100
0.034750,0.016700,0.187350,0.761200
0.035200,0.017150,0.188050,0.759600
0.035300,0.017200,0.187950,0.759550
0.034850,0.017350,0.188650,0.759150
0.034700,0.017050,0.189150,0.759100
0.034100,0.016800,0.189450,0.759650
0.033350,0.016850,0.189200,0.760600
0.033800,0.015950,0.190000,0.760250
0.032950,0.016750,0.190100,0.760200
0.032100,0.017800,0.189900,0.760200
0.032350,0.017300,0.191250,0.759100
0.032900,0.017850,0.190900,0.758350
0.033600,0.017500,0.190750,0.758150
0.034900,0.015550,0.191700,0.757850
0.033600,0.016600,0.191750,0.758050
0.033900,0.017350,0.191600,0.757150
0.034150,0.017600,0.190800,0.757450
0.034800,0.016950,0.190900,0.757350
0.034600,0.016750,0.191150,0.757500
0.033950,0.018150,0.189800,0.758100
0.035650,0.017200,0.190000,0.757150
0.036150,0.017650,0.189800,0.756400
0.036250,0.017500,0.190650,0.755600
0.036000,0.017900,0.191650,0.754450
0.035850,0.018800,0.190750,0.754600
0.036100,0.018450,0.190800,0.754650
0.036950,0.017700,0.190550,0.754800
0.037950,0.018500,0.188950,0.754600
0.038550,0.018950,0.188600,0.753900
0.039300,0.018050,0.188850,0.753800
0.039500,0.018900,0.187250,0.754350
0.038950,0.020500,0.186550,0.754000
0.039700,0.019700,0.186100,0.754500
0.039250,0.019200,0.185850,0.755700
0.038350,0.020100,0.184950,0.756600
0.038250,0.019800,0.185150,0.756800
0.037850,0.019150,0.185450,0.757550
0.038350,0.018800,0.184900,0.757950
0.037350,0.020100,0.184550,0.758000
0.037750,0.019900,0.183150,0.759200
0.038000,0.018950,0.183450,0.759600
0.038850,0.018950,0.182600,0.759600
0.038100,0.019500,0.182150,0.760250
0.036350,0.020000,0.182000,0.761650
0.037700,0.019550,0.181250,0.761500
0.037700,0.019300,0.182500,0.760500
0.038150,0.019250,0.181750,0.760850
0.038000,0.018750,0.182600,0.760650
0.037850,0.019100,0.182500,0.760550
0.038700,0.019300,0.182150,0.759850
0.039350,0.020650,0.180750,0.759250
0.039450,0.019650,0.180700,0.760200
0.039700,0.019350,0.180150,0.760800
0.040200,0.018150,0.180650,0.761000
0.038600,0.019500,0.180100,0.761800
0.039750,0.019750,0.179750,0.760750
0.039550,0.019100,0.179200,0.762150
0.038950,0.019100,0.179400,0.762550
0.039600,0.020200,0.178050,0.762150
0.039950,0.019950,0.177100,0.763000
0.039400,0.020100,0.177100,0.763400
0.040000,0.020350,0.175850,0.763800
0.039350,0.020150,0.175950,0.764550
0.040100,0.020000,0.175900,0.764000
0.040850,0.019500,0.174900,0.764750
0.041100,0.020200,0.173950,0.764750
0.042000,0.019550,0.173400,0.765050
0.041150,0.019900,0.172850,0.766100
0.041550,0.019150,0.172600,0.766700
0.042000,0.018500,0.172450,0.767050
0.041400,0.018950,0.171250,0.768400
0.041300,0.018850,0.170200,0.769650
0.040200,0.021050,0.167900,0.770850
0.039950,0.020200,0.167350,0.772500
0.040550,0.019950,0.167500,0.772000
0.040500,0.019500,0.167400,0.772600
0.040600,0.019300,0.167700,0.772400
0.039600,0.020150,0.166800,0.773450
0.040300,0.019050,0.166650,0.774000
0.039900,0.018200,0.167850,0.774050
0.039650,0.019200,0.166850,0.774300
0.040300,0.018300,0.168300,0.773100
0.040500,0.019250,0.166900,0.773350
0.041550,0.017750,0.167150,0.773550
0.039250,0.018750,0.166950,0.775050
0.037950,0.018300,0.167300,0.776450
0.038200,0.019400,0.166400,0.776000
0.038450,0.018400,0.166600,0.776550
0.038200,0.017100,0.166650,0.778050
0.038500,0.016800,0.166700,0.778000
0.037750,0.016100,0.167950,0.778200
0.037750,0.015250,0.168500,0.778500
0.037200,0.016450,0.167300,0.779050
0.036300,0.016300,0.167450,0.779950
0.035150,0.016850,0.167700,0.780300
0.035450,0.016000,0.168550,0.780000
0.035150,0.016200,0.169150,0.779500
0.035200,0.015950,0.170250,0.778600
0.034550,0.016100,0.170250,0.779100
0.033750,0.016300,0.171150,0.778800
0.033850,0.015400,0.172300,0.778450
0.033900,0.014750,0.173300,0.778050
0.033850,0.015300,0.174900,0.775950
0.034050,0.015250,0.175500,0.775200
0.032250,0.016800,0.176050,0.774900
0.032450,0.016700,0.175950,0.774900
0.031850,0.016650,0.175450,0.776050
0.032800,0.016350,0.175250,0.775600
0.032800,0.015900,0.175500,0.775800
0.033050,0.016450,0.175200,0.775300
0.033250,0.016300,0.175100,0.775350
0.033100,0.016400,0.176400,0.774100
0.033650,0.015600,0.177550,0.773200
0.033850,0.016600,0.177000,0.772550
0.034550,0.016600,0.177000,0.771850
0.034500,0.017250,0.175750,0.772500
0.034150,0.016550,0.175700,0.773600
0.035200,0.016250,0.175200,0.773350
0.034900,0.016250,0.175550,0.773300
0.034450,0.017500,0.174150,0.773900
0.033850,0.018000,0.174100,0.774050
0.035050,0.017200,0.175100,0.772650
0.035400,0.015700,0.176300,0.772600
0.035000,0.015800,0.176250,0.772950
0.034900,0.015700,0.176550,0.772850
0.033900,0.016150,0.177400,0.772550
0.033800,0.015600,0.178250,0.772350
0.033700,0.015700,0.179250,0.771350
0.033500,0.015400,0.178850,0.772250
0.032200,0.015150,0.180550,0.772100
0.032300,0.014850,0.181650,0.771200
0.033000,0.015700,0.180400,0.770900
0.032200,0.016800,0.180350,0.770650
0.031700,0.016950,0.180350,0.771000
0.032000,0.018050,0.179400,0.770550
0.031900,0.018100,0.180600,0.769400
0.033800,0.017400,0.180600,0.768200
0.035350,0.016100,0.180400,0.768150
0.034750,0.016850,0.180100,0.768300
0.035100,0.017200,0.180350,0.767350
0.034600,0.017600,0.180950,0.766850
0.035500,0.016950,0.180850,0.766700
0.036000,0.016100,0.180700,0.767200
0.034750,0.017800,0.179350,0.768100
0.034850,0.016400,0.179550,0.769200
0.034100,0.016700,0.179250,0.769950
0.034300,0.016900,0.178750,0.770050
0.034200,0.016900,0.178200,0.770700
0.035100,0.017050,0.176950,0.770900
0.035650,0.016400,0.176850,0.771100
0.035150,0.016650,0.177150,0.771050
