I,E,S,R
0.001000,0.000650,0.998350,0.000000
0.001150,0.001350,0.997450,0.000050
0.001450,0.001800,0.996600,0.000150
0.001750,0.002450,0.995300,0.000500
0.001900,0.003100,0.994050,0.000950
0.002950,0.003850,0.992100,0.001100
0.003600,0.006350,0.988650,0.001400
0.005250,0.007800,0.985250,0.001700
0.006250,0.010300,0.980950,0.002500
0.008850,0.012500,0.975600,0.003050
0.011400,0.016600,0.968100,0.003900
0.014550,0.022700,0.957400,0.005350
0.019000,0.029250,0.944550,0.007200
0.024900,0.038050,0.927650,0.009400
0.032950,0.046400,0.908150,0.012500
0.042850,0.060100,0.880750,0.016300
0.056000,0.076650,0.846050,0.021300
0.071300,0.094450,0.805750,0.028500
0.088900,0.117350,0.755700,0.038050
0.108450,0.142800,0.698250,0.050500
0.133750,0.166450,0.635300,0.064500
0.161800,0.189450,0.566600,0.082150
0.192450,0.210500,0.492650,0.104400
0.223950,0.226400,0.418600,0.131050
0.259200,0.232250,0.347600,0.160950
0.290250,0.233200,0.280200,0.196350
0.317550,0.229300,0.219350,0.233800
0.340450,0.214200,0.169900,0.275450
0.359050,0.192650,0.129350,0.318950
0.367650,0.168100,0.098300,0.365950
0.364950,0.145900,0.075150,0.414000
0.357450,0.122800,0.056900,0.462850
0.343000,0.103100,0.044550,0.509350
0.323800,0.085550,0.034650,0.556000
0.304400,0.070250,0.028550,0.596800
0.285000,0.053300,0.025100,0.636600
0.264000,0.043500,0.022500,0.670000
0.241050,0.033350,0.021350,0.704250
0.221200,0.027700,0.019300,0.731800
0.200000,0.022450,0.018700,0.758850
0.179150,0.018550,0.018500,0.783800
0.160150,0.015000,0.017900,0.806950
0.140600,0.012850,0.018500,0.828050
0.122750,0.011150,0.019400,0.846700
0.110300,0.008900,0.020850,0.859950
0.096850,0.007600,0.023000,0.872550
0.086000,0.007500,0.024100,0.882400
0.076500,0.006600,0.025600,0.891300
0.069200,0.006100,0.026800,0.897900
0.061000,0.005500,0.028400,0.905100
0.053300,0.005350,0.030350,0.911000
0.047650,0.005000,0.031500,0.915850
0.043850,0.004000,0.033600,0.918550
0.038600,0.003350,0.036350,0.921700
0.033750,0.003150,0.038100,0.925000
0.030150,0.003000,0.041400,0.925450
0.026050,0.003200,0.043550,0.927200
0.022650,0.003300,0.045400,0.928650
0.020900,0.002650,0.048850,0.927600
0.018600,0.002850,0.051350,0.927200
0.017050,0.002700,0.053750,0.926500
0.015450,0.002650,0.055400,0.926500
0.013550,0.002900,0.057850,0.925700
0.012300,0.002850,0.061100,0.923750
0.011550,0.001750,0.063600,0.923100
0.009600,0.001750,0.067150,0.921500
0.008500,0.001350,0.069650,0.920500
0.007650,0.001200,0.073950,0.917200
0.007050,0.001150,0.076550,0.915250
0.006250,0.001250,0.079050,0.913450
0.005600,0.001200,0.081500,0.911700
0.005150,0.000900,0.084450,0.909500
0.004550,0.001100,0.088000,0.906350
0.004400,0.001000,0.090300,0.904300
0.003750,0.001000,0.094000,0.901250
0.003350,0.001250,0.096350,0.899050
0.003500,0.001000,0.099200,0.896300
0.003350,0.000800,0.102000,0.893850
0.003250,0.000900,0.104350,0.891500
0.003200,0.000850,0.107450,0.888500
0.002850,0.000900,0.109600,0.886650
0.002700,0.000750,0.112400,0.884150
0.002300,0.000700,0.114900,0.882100
0.002100,0.000550,0.118500,0.878850
0.002150,0.000550,0.120800,0.876500
0.002050,0.000500,0.123300,0.874150
0.001950,0.000400,0.125900,0.871750
0.001700,0.000500,0.129000,0.868800
0.001700,0.000500,0.132000,0.865800
0.001500,0.000600,0.134100,0.863800
0.001500,0.000450,0.136350,0.861700
0.001300,0.000400,0.138700,0.859600
0.001250,0.000350,0.141050,0.857350
0.001250,0.000250,0.143200,0.855300
0.001250,0.000250,0.145950,0.852550
0.001150,0.000300,0.148700,0.849850
0.001150,0.000250,0.151200,0.847400
0.001100,0.000450,0.153450,0.845000
0.000950,0.000350,0.156050,0.842650
0.000900,0.000550,0.157900,0.840650
0.000950,0.000550,0.160050,0.838450
0.001000,0.000550,0.162450,0.836000
0.001150,0.000400,0.164550,0.833900
0.001150,0.000350,0.166750,0.831750
0.001000,0.000300,0.168600,0.830100
0.001000,0.000350,0.171250,0.827400
0.001050,0.000350,0.173500,0.825100
0.000950,0.000450,0.175350,0.823250
0.001050,0.000350,0.178100,0.820500
0.001050,0.000300,0.180200,0.818450
0.001050,0.000150,0.182650,0.816150
0.001100,0.000200,0.185350,0.813350
0.001000,0.000500,0.187550,0.810950
0.001150,0.000500,0.189600,0.808750
0.001300,0.000350,0.192000,0.806350
0.001000,0.000650,0.193650,0.804700
0.001000,0.000600,0.195850,0.802550
0.000850,0.000700,0.198300,0.800150
0.000900,0.000500,0.200900,0.797700
0.000950,0.000400,0.203350,0.795300
0.000950,0.000400,0.205700,0.792950
0.001000,0.000350,0.207300,0.791350
0.000950,0.000450,0.209900,0.788700
0.000950,0.000300,0.212500,0.786250
0.000850,0.000400,0.214800,0.783950
0.001000,0.000250,0.217450,0.781300
0.001100,0.000150,0.219400,0.779350
0.001100,0.000250,0.221500,0.777150
0.001050,0.000300,0.223900,0.774750
0.000900,0.000400,0.226100,0.772600
0.000900,0.000500,0.228350,0.770250
0.000950,0.000600,0.230150,0.768300
0.001100,0.000600,0.232450,0.765850
0.001150,0.000650,0.234850,0.763350
0.001150,0.000850,0.236550,0.761450
0.001300,0.000750,0.239050,0.758900
0.001450,0.000600,0.240700,0.757250
0.001350,0.000750,0.242900,0.755000
0.001550,0.000450,0.244750,0.753250
0.001400,0.000600,0.246400,0.751600
0.001200,0.000850,0.248000,0.749950
0.001250,0.000950,0.250150,0.747650
0.001400,0.000850,0.252250,0.745500
0.001250,0.000900,0.254350,0.743500
0.001450,0.000650,0.256300,0.741600
0.001450,0.000850,0.258350,0.739350
0.001650,0.000900,0.260400,0.737050
0.001550,0.000900,0.262450,0.735100
0.001500,0.001050,0.264400,0.733050
0.001700,0.000900,0.266000,0.731400
0.001750,0.000900,0.268050,0.729300
0.001850,0.000900,0.270100,0.727150
0.002000,0.000800,0.271550,0.725650
0.001800,0.001050,0.272950,0.724200
0.002000,0.001250,0.274500,0.722250
0.002200,0.001650,0.275900,0.720250
0.002200,0.001800,0.277750,0.718250
0.002300,0.002300,0.278950,0.716450
0.002750,0.002150,0.280300,0.714800
0.003150,0.002300,0.281050,0.713500
0.003750,0.002150,0.282850,0.711250
0.003900,0.002600,0.283150,0.710350
0.004150,0.002600,0.284700,0.708550
0.004450,0.002900,0.285250,0.707400
0.004800,0.002900,0.286900,0.705400
0.005100,0.003300,0.287500,0.704100
0.005200,0.003750,0.288550,0.702500
0.005650,0.003750,0.289150,0.701450
0.005850,0.004300,0.290050,0.699800
0.006150,0.003650,0.290900,0.699300
0.006350,0.004250,0.291850,0.697550
0.006500,0.004800,0.292500,0.696200
0.006650,0.004700,0.293350,0.695300
0.006500,0.005100,0.294300,0.694100
0.007050,0.005150,0.294850,0.692950
0.007450,0.005250,0.295000,0.692300
0.008550,0.004950,0.295500,0.691000
0.008600,0.005800,0.295900,0.689700
0.009100,0.006200,0.296100,0.688600
0.010400,0.006600,0.295700,0.687300
0.010800,0.006900,0.295950,0.686350
0.011350,0.008050,0.295400,0.685200
0.012250,0.008150,0.295200,0.684400
0.012700,0.008550,0.295150,0.683600
0.013850,0.009750,0.293600,0.682800
0.015050,0.010750,0.291450,0.682750
0.015750,0.011750,0.289150,0.683350
0.017350,0.011600,0.287800,0.683250
0.018150,0.012800,0.285850,0.683200
0.018750,0.013950,0.283250,0.684050
0.019400,0.015100,0.280800,0.684700
0.020600,0.015350,0.278650,0.685400
0.022450,0.016100,0.275550,0.685900
0.025250,0.015600,0.272100,0.687050
0.026300,0.016550,0.268850,0.688300
0.028200,0.016650,0.265700,0.689450
0.029550,0.017300,0.262200,0.690950
0.030900,0.018000,0.258600,0.692500
0.031700,0.018700,0.254700,0.694900
0.032500,0.017900,0.252150,0.697450
0.032950,0.019650,0.247700,0.699700
0.034300,0.019700,0.243850,0.702150
0.035250,0.021050,0.239200,0.704500
0.036700,0.021700,0.234350,0.707250
0.037800,0.021850,0.229800,0.710550
0.038800,0.022600,0.225250,0.713350
0.039300,0.023950,0.221250,0.715500
0.040300,0.023950,0.217700,0.718050
0.041700,0.024500,0.212250,0.721550
0.043500,0.023400,0.208900,0.724200
0.042850,0.025250,0.203200,0.728700
0.043550,0.023950,0.200100,0.732400
0.043850,0.022950,0.196600,0.736600
0.044100,0.022450,0.193100,0.740350
0.044000,0.023950,0.188500,0.743550
0.044450,0.023450,0.185250,0.746850
0.045700,0.024600,0.180400,0.749300
0.047050,0.023700,0.176100,0.753150
0.046600,0.023850,0.172700,0.756850
0.046500,0.023250,0.170500,0.759750
0.047800,0.021550,0.167300,0.763350
0.047250,0.021450,0.164750,0.766550
0.046150,0.020750,0.163350,0.769750
0.046000,0.020600,0.161350,0.772050
0.045900,0.019650,0.159050,0.775400
0.045200,0.019250,0.157250,0.778300
0.044150,0.018950,0.155150,0.781750
0.043650,0.018850,0.153000,0.784500
0.043100,0.018450,0.150450,0.788000
0.042100,0.018100,0.148500,0.791300
0.041500,0.017850,0.147700,0.792950
0.040550,0.017950,0.145800,0.795700
0.040400,0.016600,0.145650,0.797350
0.040000,0.015850,0.145500,0.798650
0.038650,0.015800,0.144950,0.800600
0.037050,0.016100,0.143600,0.803250
0.037650,0.016050,0.141800,0.804500
0.037000,0.015450,0.140700,0.806850
0.036150,0.016450,0.139900,0.807500
0.035750,0.016050,0.139450,0.808750
0.035550,0.014600,0.139400,0.810450
0.035100,0.014250,0.140400,0.810250
0.034150,0.014050,0.139650,0.812150
0.033550,0.013100,0.140450,0.812900
0.033400,0.014000,0.139950,0.812650
0.032650,0.013650,0.139800,0.813900
0.032450,0.013850,0.140700,0.813000
0.030650,0.013950,0.141500,0.813900
0.030700,0.012600,0.143400,0.813300
0.029050,0.012400,0.143800,0.814750
0.029000,0.011800,0.143250,0.815950
0.028500,0.010750,0.145500,0.815250
0.028300,0.011550,0.145450,0.814700
0.028250,0.010550,0.146450,0.814750
0.027450,0.010800,0.147250,0.814500
0.027000,0.010000,0.148150,0.814850
0.025750,0.010350,0.148950,0.814950
0.025200,0.010350,0.150100,0.814350
0.025500,0.009550,0.151250,0.813700
0.023550,0.010350,0.152650,0.813450
0.022950,0.009900,0.154100,0.813050
0.022600,0.010450,0.155550,0.811400
0.022350,0.009250,0.158250,0.810150
0.022050,0.009100,0.159250,0.809600
0.021200,0.010350,0.160400,0.808050
0.021500,0.009400,0.162100,0.807000
0.020500,0.009400,0.164450,0.805650
0.020400,0.009550,0.166050,0.804000
0.019950,0.010400,0.167750,0.801900
0.020100,0.010350,0.169950,0.799600
0.020750,0.010400,0.171150,0.797700
0.022000,0.010050,0.172050,0.795900
0.021850,0.009400,0.173650,0.795100
0.022750,0.009150,0.174500,0.793600
0.022500,0.009700,0.175300,0.792500
0.022750,0.009650,0.177000,0.790600
0.022550,0.009300,0.178400,0.789750
0.021900,0.009500,0.179100,0.789500
0.020800,0.009850,0.181100,0.788250
0.020000,0.010100,0.182900,0.787000
0.020050,0.010650,0.184050,0.785250
0.021150,0.009900,0.185300,0.783650
0.021150,0.010050,0.186800,0.782000
0.021300,0.009600,0.188250,0.780850
0.021100,0.009450,0.189750,0.779700
0.021350,0.010400,0.190200,0.778050
0.021000,0.010200,0.192300,0.776500
0.020350,0.010500,0.193100,0.776050
0.020300,0.010900,0.194350,0.774450
0.020850,0.009650,0.196800,0.772700
0.020600,0.009650,0.198000,0.771750
0.021100,0.009300,0.199600,0.770000
0.021150,0.010000,0.201650,0.767200
0.021200,0.009850,0.203900,0.765050
0.021250,0.010300,0.205100,0.763350
0.020850,0.010700,0.205950,0.762500
0.020550,0.010750,0.206700,0.762000
0.020850,0.010350,0.207800,0.761000
0.020750,0.011300,0.208700,0.759250
0.020900,0.011000,0.209700,0.758400
0.021300,0.010800,0.211450,0.756450
0.021250,0.012200,0.212200,0.754350
0.022700,0.011700,0.213100,0.752500
0.022800,0.012900,0.212650,0.751650
0.022800,0.013850,0.212700,0.750650
0.022650,0.015150,0.212500,0.749700
0.024550,0.014150,0.213100,0.748200
0.025300,0.014450,0.213750,0.746500
0.026200,0.015450,0.212600,0.745750
0.027850,0.015150,0.212050,0.744950
0.027650,0.016050,0.211600,0.744700
0.028200,0.017250,0.210300,0.744250
0.029650,0.016650,0.210350,0.743350
0.029850,0.016850,0.209450,0.743850
0.031200,0.015600,0.209650,0.743550
0.031250,0.017100,0.207850,0.743800
0.032050,0.016700,0.207250,0.744000
0.032050,0.017550,0.205000,0.745400
0.033000,0.018200,0.203800,0.745000
0.034300,0.017800,0.204600,0.743300
0.034950,0.018300,0.204100,0.742650
0.034650,0.018450,0.204100,0.742800
0.036100,0.018800,0.203000,0.742100
0.035800,0.019550,0.202150,0.742500
0.037000,0.018350,0.201850,0.742800
0.037100,0.017700,0.201800,0.743400
0.036850,0.018550,0.200600,0.744000
0.036400,0.018950,0.199700,0.744950
0.036200,0.018950,0.199100,0.745750
0.035850,0.020150,0.197500,0.746500
0.035450,0.020050,0.196650,0.747850
0.035600,0.019100,0.197450,0.747850
0.037600,0.018050,0.196950,0.747400
0.037500,0.018200,0.196850,0.747450
0.038200,0.018350,0.196500,0.746950
0.038550,0.017850,0.195350,0.748250
0.038100,0.018750,0.194500,0.748650
0.040250,0.018100,0.193350,0.748300
0.039050,0.019050,0.191600,0.750300
0.039050,0.019150,0.190750,0.751050
0.040350,0.019350,0.188650,0.751650
0.038250,0.019700,0.187150,0.754900
0.038250,0.019250,0.187350,0.755150
0.038050,0.018250,0.186200,0.757500
0.038350,0.017400,0.185150,0.759100
0.038300,0.017350,0.184900,0.759450
0.039100,0.018150,0.182700,0.760050
0.038800,0.019150,0.181500,0.760550
0.038900,0.019550,0.181100,0.760450
0.039300,0.018700,0.180250,0.761750
0.039350,0.018750,0.179950,0.761950
0.039750,0.019450,0.177450,0.763350
0.039350,0.018500,0.177450,0.764700
0.040050,0.018450,0.176750,0.764750
0.039500,0.018900,0.176050,0.765550
0.040600,0.017750,0.176250,0.765400
0.039700,0.017000,0.176650,0.766650
0.038600,0.017450,0.175800,0.768150
0.038550,0.017450,0.175400,0.768600
0.038150,0.017900,0.174500,0.769450
0.038500,0.018150,0.173850,0.769500
0.038550,0.017850,0.172450,0.771150
0.038800,0.016900,0.172550,0.771750
0.039150,0.016950,0.171750,0.772150
0.038200,0.017650,0.171350,0.772800
0.037550,0.018550,0.171350,0.772550
0.037100,0.017250,0.172550,0.773100
0.037550,0.016500,0.172600,0.773350
0.036600,0.016700,0.173000,0.773700
0.035300,0.017400,0.172450,0.774850
0.035300,0.017000,0.172500,0.775200
0.035200,0.016950,0.173050,0.774800
0.035350,0.015800,0.173250,0.775600
0.035000,0.015950,0.173950,0.775100
0.034700,0.015500,0.174400,0.775400
0.034250,0.015500,0.175900,0.774350
0.032700,0.015100,0.177000,0.775200
0.031250,0.016050,0.176400,0.776300
0.031100,0.016200,0.177200,0.775500
0.032500,0.015800,0.176550,0.775150
0.033150,0.014500,0.178450,0.773900
0.032700,0.015600,0.178400,0.773300
0.033000,0.016100,0.179350,0.771550
0.033050,0.015150,0.179700,0.772100
0.032350,0.015350,0.180700,0.771600
0.032450,0.015750,0.180500,0.771300
0.031950,0.015800,0.180750,0.771500
0.031600,0.015900,0.180550,0.771950
0.032000,0.015900,0.180750,0.771350
0.032800,0.016150,0.180400,0.770650
0.033050,0.016300,0.181000,0.769650
0.032850,0.015650,0.182850,0.768650
0.033050,0.015850,0.183450,0.767650
0.032600,0.016000,0.183850,0.767550
0.032150,0.016750,0.183350,0.767750
0.032500,0.016900,0.182700,0.767900
0.032350,0.016100,0.183850,0.767700
0.032600,0.016650,0.183350,0.767400
0.033200,0.017000,0.183500,0.766300
0.033500,0.016750,0.184400,0.765350
0.032350,0.017800,0.184800,0.765050
0.031150,0.017500,0.185550,0.765800
0.032300,0.017500,0.184900,0.765300
0.032100,0.018050,0.184750,0.765100
0.033350,0.017100,0.184750,0.764800
0.033450,0.017250,0.184500,0.764800
0.033100,0.017600,0.183800,0.765500
0.034350,0.016650,0.183250,0.765750
0.034850,0.016700,0.182700,0.765750
0.036150,0.015950,0.182650,0.765250
0.035200,0.016000,0.182400,0.766400
0.034750,0.017300,0.182250,0.765700
0.034750,0.017200,0.181450,0.766600
0.035700,0.016850,0.181350,0.766100
0.035050,0.016250,0.181600,0.767100
0.034800,0.017050,0.181100,0.767050
0.034450,0.017400,0.181100,0.767050
0.034850,0.017250,0.181050,0.766850
0.035250,0.017400,0.180750,0.766600
0.034450,0.017700,0.181250,0.766600
0.035000,0.017750,0.181750,0.765500
0.036350,0.016650,0.181400,0.765600
0.036300,0.016050,0.181450,0.766200
0.035500,0.017100,0.180850,0.766550
0.034150,0.017600,0.180950,0.767300
0.033550,0.017500,0.180700,0.768250
0.032950,0.017750,0.179350,0.769950
0.032950,0.017200,0.179400,0.770450
0.033250,0.016750,0.179200,0.770800
0.033700,0.016150,0.178600,0.771550
0.033650,0.015700,0.179500,0.771150
0.033550,0.015800,0.179950,0.770700
0.033800,0.016550,0.179550,0.770100
0.034850,0.015250,0.180000,0.769900
0.034800,0.015600,0.179400,0.770200
0.034200,0.016700,0.178950,0.770150
0.034150,0.016250,0.179100,0.770500
0.034250,0.015650,0.179300,0.770800
0.033900,0.017000,0.178400,0.770700
0.034100,0.017800,0.177400,0.770700
0.034150,0.017950,0.176150,0.771750
0.034750,0.017350,0.176600,0.771300
0.035650,0.016300,0.177700,0.770350
0.036000,0.015150,0.179050,0.769800
0.035200,0.016850,0.178300,0.769650
0.035000,0.016300,0.178900,0.769800
0.034200,0.015000,0.180700,0.770100
0.034550,0.013400,0.182050,0.770000
0.034550,0.014350,0.181750,0.769350
0.034400,0.014400,0.182250,0.768950
0.034350,0.015250,0.181750,0.768650
0.034500,0.015100,0.182100,0.768300
0.032900,0.015400,0.182350,0.769350
0.032800,0.015450,0.181900,0.769850
0.032700,0.015850,0.181550,0.769900
0.033300,0.015100,0.181050,0.770550
0.032450,0.016150,0.181250,0.770150
0.032150,0.016300,0.181350,0.770200
0.032050,0.015750,0.181600,0.770600
0.031750,0.016000,0.182100,0.770150
0.032100,0.015750,0.181950,0.770200
0.032900,0.014550,0.181500,0.771050
0.032550,0.014800,0.181800,0.770850
0.032450,0.015000,0.182250,0.770300
0.031250,0.015500,0.182550,0.770700
0.031600,0.014850,0.182850,0.770700
0.031650,0.015950,0.183100,0.769300
0.031500,0.015900,0.182950,0.769650
0.032550,0.015150,0.183500,0.768800
0.032500,0.016200,0.183000,0.768300
0.032200,0.015450,0.184550,0.767800
0.032800,0.015600,0.184600,0.767000
0.032750,0.015150,0.184700,0.767400
0.030700,0.015900,0.185600,0.767800
0.031150,0.015450,0.185150,0.768250
0.032350,0.014950,0.185050,0.767650
0.033000,0.015250,0.184750,0.767000
0.032300,0.015650,0.185100,0.766950
0.032150,0.015450,0.185350,0.767050
0.031900,0.015900,0.185200,0.767000
0.031650,0.015700,0.186550,0.766100
0.031550,0.015550,0.186650,0.766250
0.031800,0.015600,0.187150,0.765450
0.031400,0.015100,0.188300,0.765200
0.031150,0.015050,0.188900,0.764900
0.030800,0.015250,0.189000,0.764950
0.031100,0.014550,0.189750,0.764600
0.031150,0.014700,0.189600,0.764550
0.030600,0.015900,0.189350,0.764150
0.031700,0.015400,0.190600,0.762300
0.031650,0.015600,0.190600,0.762150
0.031700,0.015400,0.190900,0.762000
0.032400,0.015450,0.190600,0.761550
0.031700,0.016200,0.190500,0.761600
0.031850,0.016250,0.191100,0.760800
0.032350,0.016600,0.191550,0.759500
0.032850,0.016700,0.190400,0.760050
0.033500,0.017900,0.188850,0.759750
0.033750,0.017300,0.189200,0.759750
0.033450,0.018300,0.188400,0.759850
0.033850,0.017800,0.189750,0.758600
0.034150,0.017600,0.190050,0.758200
0.034650,0.016800,0.190000,0.758550
0.035100,0.017100,0.189350,0.758450
0.035050,0.017750,0.187500,0.759700
0.034600,0.018600,0.187650,0.759150
0.034750,0.018800,0.187350,0.759100
0.035600,0.018000,0.186300,0.760100
0.035750,0.018150,0.185100,0.761000
0.036300,0.018500,0.184600,0.760600
0.036200,0.018400,0.185100,0.760300
0.035900,0.018550,0.184300,0.761250
0.035500,0.019000,0.183400,0.762100
0.036700,0.018600,0.182950,0.761750
0.036200,0.018800,0.182250,0.762750
0.036450,0.018450,0.181800,0.763300
0.036350,0.018150,0.181350,0.764150
0.036600,0.017700,0.179750,0.765950
0.036800,0.017400,0.178650,0.767150
0.035800,0.017550,0.178450,0.768200
0.035800,0.016550,0.178250,0.769400
0.035200,0.017250,0.176900,0.770650
0.035350,0.017500,0.176500,0.770650
0.034350,0.017350,0.176750,0.771550
0.034100,0.016100,0.178050,0.771750
0.033800,0.015950,0.178450,0.771800
0.032750,0.016300,0.179650,0.771300
0.032600,0.015500,0.181100,0.770800
0.032300,0.015950,0.181500,0.770250
0.033400,0.015650,0.182000,0.768950
0.033300,0.015350,0.182350,0.769000
0.033400,0.014950,0.182150,0.769500
0.032650,0.015050,0.181800,0.770500
0.032450,0.016100,0.181700,0.769750
0.032300,0.016600,0.181550,0.769550
0.032300,0.016750,0.181050,0.769900
0.032450,0.016300,0.182700,0.768550
0.032250,0.017500,0.182100,0.768150
0.032000,0.017900,0.181500,0.768600
0.032250,0.017200,0.182050,0.768500
0.033050,0.016900,0.181400,0.768650
0.033150,0.016300,0.181150,0.769400
0.033600,0.016350,0.181200,0.768850
0.032200,0.017750,0.180750,0.769300
0.032050,0.017600,0.181200,0.769150
0.032250,0.018100,0.180150,0.769500
0.032200,0.017000,0.180800,0.770000
0.032650,0.016950,0.181200,0.769200
0.032500,0.016850,0.182000,0.768650
0.032550,0.017350,0.182350,0.767750
0.032950,0.016700,0.182750,0.767600
0.033450,0.016800,0.182300,0.767450
0.034000,0.018200,0.181600,0.766200
0.034300,0.018000,0.181800,0.765900
0.034800,0.017150,0.182400,0.765650
0.035400,0.016100,0.183300,0.765200
0.035700,0.016050,0.183600,0.764650
0.033700,0.016200,0.183900,0.766200
0.033350,0.016000,0.183900,0.766750
0.034050,0.016700,0.183650,0.765600
0.034350,0.016550,0.184750,0.764350
0.035200,0.016500,0.185300,0.763000
0.035650,0.016450,0.185200,0.762700
0.035400,0.017250,0.184250,0.763100
0.034750,0.017500,0.183850,0.763900
0.036700,0.015900,0.183850,0.763550
0.036150,0.016150,0.183850,0.763850
0.035550,0.016450,0.183400,0.764600
0.035950,0.016450,0.183150,0.764450
0.035300,0.017350,0.182200,0.765150
0.033850,0.018400,0.181600,0.766150
0.034550,0.017800,0.181550,0.766100
0.035300,0.018250,0.180300,0.766150
0.034600,0.017500,0.181050,0.766850
0.034900,0.016800,0.181900,0.766400
0.034600,0.017550,0.181450,0.766400
0.034000,0.017650,0.182200,0.766150
0.034350,0.016950,0.182850,0.765850
0.033900,0.017250,0.182750,0.766100
0.034250,0.018000,0.182250,0.765500
0.034550,0.018100,0.182700,0.764650
0.033750,0.017300,0.183500,0.765450
0.033600,0.017750,0.182700,0.765950
0.034550,0.017700,0.182750,0.765000
0.035200,0.017750,0.182050,0.765000
0.034900,0.017800,0.183050,0.764250
0.036300,0.017400,0.183350,0.762950
0.036750,0.017700,0.182950,0.762600
0.037050,0.018600,0.182450,0.761900
0.037000,0.019350,0.180700,0.762950
0.036950,0.018700,0.181300,0.763050
0.037400,0.019200,0.180350,0.763050
0.038450,0.018500,0.181050,0.762000
0.038050,0.018900,0.180450,0.762600
0.039350,0.018700,0.179450,0.762500
0.039250,0.018800,0.178800,0.763150
0.039900,0.018400,0.178600,0.763100
0.040200,0.017600,0.178500,0.763700
0.039750,0.017450,0.178250,0.764550
0.040350,0.016950,0.177400,0.765300
0.041150,0.016950,0.176300,0.765600
0.040250,0.018450,0.175450,0.765850
0.039500,0.019300,0.174850,0.766350
0.039250,0.018750,0.174000,0.768000
0.039600,0.018650,0.173850,0.767900
0.039150,0.018150,0.173700,0.769000
0.040050,0.016900,0.174100,0.768950
0.039050,0.018700,0.172650,0.769600
0.040000,0.017750,0.172550,0.769700
0.039850,0.017800,0.172800,0.769550
0.039900,0.019100,0.170700,0.770300
0.040500,0.019500,0.169750,0.770250
0.039950,0.019400,0.169250,0.771400
0.040600,0.018700,0.168750,0.771950
0.040600,0.018300,0.168000,0.773100
0.040300,0.018200,0.167300,0.774200
0.040050,0.017950,0.167550,0.774450
0.039650,0.017500,0.168350,0.774500
0.039850,0.017300,0.168650,0.774200
0.040250,0.016900,0.168400,0.774450
0.039350,0.017500,0.167550,0.775600
0.039350,0.017950,0.166650,0.776050
0.038750,0.018750,0.166250,0.776250
0.040250,0.017200,0.166950,0.775600
0.038300,0.017750,0.167050,0.776900
0.038650,0.018200,0.167000,0.776150
0.038400,0.017250,0.167850,0.776500
0.038700,0.016700,0.167950,0.776650
0.038600,0.016950,0.167300,0.777150
0.037700,0.017400,0.167950,0.776950
0.037250,0.018250,0.168050,0.776450
0.037950,0.018050,0.167650,0.776350
0.036950,0.017950,0.167950,0.777150
0.035600,0.017850,0.168900,0.777650
0.035900,0.017950,0.169050,0.777100
0.035700,0.017400,0.169400,0.777500
0.035800,0.017150,0.170350,0.776700
0.035150,0.017800,0.169900,0.777150
0.035550,0.016350,0.171500,0.776600
0.035900,0.015300,0.172950,0.775850
0.034050,0.015450,0.173450,0.777050
0.034000,0.015100,0.174500,0.776400
0.032950,0.015200,0.174950,0.776900
0.032850,0.015950,0.174600,0.776600
0.033650,0.016100,0.174550,0.775700
0.032950,0.015650,0.174950,0.776450
0.033000,0.015450,0.175400,0.776150
0.032550,0.015650,0.176850,0.774950
0.032800,0.015900,0.177150,0.774150
0.032900,0.016200,0.176900,0.774000
0.032800,0.015950,0.177600,0.773650
0.032650,0.014800,0.178650,0.773900
0.032450,0.014850,0.179050,0.773650
0.031900,0.015450,0.179300,0.773350
0.030950,0.016100,0.180750,0.772200
0.030150,0.016600,0.181750,0.771500
0.031450,0.015350,0.181700,0.771500
0.031700,0.015900,0.182200,0.770200
0.032550,0.015000,0.184300,0.768150
0.032300,0.016300,0.183750,0.767650
0.032600,0.016400,0.183400,0.767600
0.032800,0.016600,0.183250,0.767350
0.033500,0.016150,0.182550,0.767800
0.033700,0.016100,0.181850,0.768350
0.034800,0.015800,0.181700,0.767700
0.034050,0.016050,0.181000,0.768900
0.033800,0.015200,0.182700,0.768300
0.033700,0.015250,0.183000,0.768050
0.033100,0.016400,0.183100,0.767400
0.033050,0.016350,0.183600,0.767000
0.033300,0.016250,0.183550,0.766900
0.034300,0.016200,0.184450,0.765050
0.034000,0.016750,0.184550,0.764700
0.034600,0.016800,0.184300,0.764300
0.035950,0.015450,0.184950,0.763650
0.035700,0.015500,0.185600,0.763200
0.034850,0.015750,0.185900,0.763500
0.034000,0.016850,0.185600,0.763550
0.034100,0.017350,0.185750,0.762800
0.034550,0.017200,0.186050,0.762200
0.035450,0.016550,0.187000,0.761000
0.035100,0.017050,0.186350,0.761500
0.034750,0.017150,0.186650,0.761450
0.033650,0.016450,0.187100,0.762800
0.034000,0.016300,0.187950,0.761750
0.034200,0.015700,0.188150,0.761950
0.032400,0.017500,0.187450,0.762650
0.033050,0.017900,0.186950,0.762100
0.033800,0.018300,0.185750,0.762150
0.035200,0.017900,0.184850,0.762050
0.036200,0.016550,0.185100,0.762150
0.034900,0.016150,0.185400,0.763550
0.034750,0.016600,0.185250,0.763400
0.035100,0.017200,0.183600,0.764100
0.034700,0.017050,0.183350,0.764900
0.034950,0.017150,0.183750,0.764150
0.033600,0.017400,0.184650,0.764350
0.034850,0.017700,0.184050,0.763400
0.035150,0.018450,0.183100,0.763300
0.036250,0.017450,0.181900,0.764400
0.036400,0.017950,0.180900,0.764750
0.036450,0.018400,0.180300,0.764850
0.037050,0.017700,0.181250,0.764000
0.036950,0.017600,0.179950,0.765500
0.036200,0.017900,0.180100,0.765800
0.036000,0.018350,0.180100,0.765550
0.035700,0.017950,0.180350,0.766000
0.035600,0.018050,0.180200,0.766150
0.035950,0.018650,0.179050,0.766350
0.035700,0.017950,0.178950,0.767400
0.036650,0.017850,0.179350,0.766150
0.037600,0.018000,0.178650,0.765750
0.036950,0.018550,0.176700,0.767800
0.037250,0.018450,0.176400,0.767900
0.037700,0.018050,0.176400,0.767850
0.038550,0.018000,0.176000,0.767450
0.037500,0.018250,0.175450,0.768800
0.037150,0.017900,0.175150,0.769800
0.038050,0.016450,0.176050,0.769450
0.036800,0.017050,0.174500,0.771650
0.036050,0.017550,0.173950,0.772450
0.036050,0.018000,0.173250,0.772700
0.034950,0.018350,0.172850,0.773850
0.035200,0.016600,0.174150,0.774050
0.035250,0.016100,0.174800,0.773850
0.035050,0.016700,0.173950,0.774300
0.034750,0.016850,0.174300,0.774100
0.034400,0.016600,0.175000,0.774000
0.034500,0.016550,0.175200,0.773750
0.034800,0.016300,0.176350,0.772550
