I,E,S,R
0.001000,0.001050,0.997950,0.000000
0.001150,0.001600,0.997100,0.000150
0.001450,0.002250,0.996050,0.000250
0.001550,0.003000,0.994900,0.000550
0.002000,0.003650,0.993500,0.000850
0.002800,0.005450,0.990650,0.001100
0.003750,0.006350,0.988300,0.001600
0.004800,0.008550,0.984550,0.002100
0.006900,0.011100,0.979550,0.002450
0.008600,0.014700,0.973450,0.003250
0.011500,0.018850,0.965400,0.004250
0.015700,0.023400,0.955300,0.005600
0.020400,0.030700,0.941550,0.007350
0.025950,0.038650,0.925050,0.010350
0.032800,0.048750,0.904200,0.014250
0.042100,0.061250,0.878050,0.018600
0.054550,0.076650,0.844950,0.023850
0.068650,0.094450,0.805900,0.031000
0.085200,0.115800,0.758300,0.040700
0.106650,0.138900,0.703250,0.051200
0.131800,0.165250,0.637550,0.065400
0.161000,0.182700,0.572100,0.084200
0.193950,0.201400,0.499050,0.105600
0.224800,0.226650,0.418050,0.130500
0.259350,0.235300,0.345600,0.159750
0.290050,0.237350,0.279100,0.193500
0.315800,0.231200,0.221550,0.231450
0.337450,0.215800,0.171400,0.275350
0.351550,0.193250,0.133000,0.322200
0.360350,0.171750,0.099850,0.368050
0.364700,0.145800,0.078100,0.411400
0.357950,0.124850,0.059100,0.458100
0.346800,0.104450,0.045750,0.503000
0.329650,0.085500,0.036100,0.548750
0.311500,0.067300,0.029550,0.591650
0.289300,0.054950,0.025600,0.630150
0.265350,0.044050,0.022400,0.668200
0.242100,0.034800,0.020450,0.702650
0.218400,0.029350,0.019100,0.733150
0.195750,0.024000,0.017750,0.762500
0.176800,0.019050,0.018300,0.785850
0.160000,0.015500,0.019100,0.805400
0.143600,0.012900,0.020100,0.823400
0.127250,0.011150,0.020450,0.841150
0.112650,0.009800,0.021950,0.855600
0.099300,0.008300,0.023650,0.868750
0.089200,0.007650,0.024300,0.878850
0.078750,0.007100,0.025050,0.889100
0.069250,0.007100,0.026500,0.897150
0.062700,0.005850,0.028700,0.902750
0.055500,0.004750,0.030850,0.908900
0.048850,0.004500,0.032700,0.913950
0.043450,0.004200,0.035600,0.916750
0.038300,0.003800,0.037800,0.920100
0.034450,0.003450,0.040600,0.921500
0.031900,0.002950,0.043250,0.921900
0.028200,0.002550,0.045300,0.923950
0.024600,0.003100,0.048050,0.924250
0.022150,0.002850,0.050450,0.924550
0.020000,0.003250,0.052350,0.924400
0.017500,0.002800,0.054550,0.925150
0.015650,0.002750,0.058100,0.923500
0.014550,0.002000,0.061200,0.922250
0.012650,0.002200,0.064050,0.921100
0.011750,0.002400,0.066600,0.919250
0.010600,0.002100,0.069500,0.917800
0.009700,0.002200,0.072150,0.915950
0.009050,0.002100,0.075000,0.913850
0.008650,0.002050,0.077100,0.912200
0.007950,0.001600,0.079600,0.910850
0.006900,0.001500,0.082600,0.909000
0.006350,0.001650,0.085400,0.906600
0.005850,0.001900,0.087350,0.904900
0.005450,0.002000,0.090150,0.902400
0.005700,0.001400,0.092850,0.900050
0.005150,0.001500,0.095500,0.897850
0.004700,0.001550,0.098250,0.895500
0.004600,0.001500,0.100900,0.893000
0.004700,0.001350,0.103850,0.890100
0.004200,0.001450,0.107100,0.887250
0.004000,0.001450,0.109600,0.884950
0.003550,0.001600,0.111900,0.882950
0.003600,0.001500,0.115050,0.879850
0.003450,0.001400,0.117550,0.877600
0.003150,0.001350,0.120000,0.875500
0.002950,0.001300,0.122150,0.873600
0.002850,0.001200,0.124650,0.871300
0.002850,0.000900,0.127700,0.868550
0.002600,0.000850,0.130350,0.866200
0.002350,0.000750,0.133950,0.862950
0.002200,0.000650,0.137000,0.860150
0.002150,0.000600,0.139900,0.857350
0.001850,0.000850,0.142200,0.855100
0.001750,0.000700,0.144950,0.852600
0.001900,0.000750,0.147250,0.850100
0.001950,0.000850,0.149750,0.847450
0.002000,0.000900,0.151900,0.845200
0.001900,0.000800,0.154600,0.842700
0.001950,0.000750,0.157450,0.839850
0.001900,0.000900,0.159800,0.837400
0.001750,0.001000,0.162300,0.834950
0.001800,0.001000,0.164500,0.832700
0.001900,0.000950,0.167150,0.830000
0.001850,0.001100,0.169400,0.827650
0.001950,0.000900,0.171800,0.825350
0.002000,0.000800,0.174300,0.822900
0.002000,0.000750,0.177200,0.820050
0.002050,0.000850,0.179300,0.817800
0.002100,0.000750,0.181800,0.815350
0.002100,0.000550,0.183750,0.813600
0.001950,0.000850,0.185800,0.811400
0.001800,0.000950,0.188100,0.809150
0.001700,0.001100,0.190000,0.807200
0.001800,0.001050,0.191650,0.805500
0.002000,0.000900,0.193850,0.803250
0.001950,0.000950,0.195950,0.801150
0.002100,0.000850,0.197950,0.799100
0.002000,0.000900,0.200900,0.796200
0.002150,0.000850,0.203200,0.793800
0.001900,0.000950,0.205500,0.791650
0.001650,0.001250,0.207450,0.789650
0.001700,0.001150,0.209900,0.787250
0.002000,0.001550,0.211450,0.785000
0.002100,0.001950,0.213050,0.782900
0.002350,0.001800,0.214650,0.781200
0.002400,0.001750,0.216400,0.779450
0.002700,0.001550,0.218550,0.777200
0.003100,0.001350,0.220700,0.774850
0.003150,0.001400,0.222950,0.772500
0.003200,0.001650,0.224250,0.770900
0.003250,0.001750,0.226300,0.768700
0.003050,0.001850,0.227750,0.767350
0.003000,0.002000,0.229600,0.765400
0.003250,0.002100,0.230900,0.763750
0.003350,0.001900,0.232250,0.762500
0.003500,0.002200,0.233800,0.760500
0.003650,0.002100,0.234900,0.759350
0.003700,0.002100,0.236550,0.757650
0.004050,0.002450,0.237300,0.756200
0.004150,0.002550,0.238700,0.754600
0.004100,0.003100,0.239700,0.753100
0.004650,0.003200,0.240550,0.751600
0.005150,0.002850,0.242050,0.749950
0.005200,0.003100,0.243100,0.748600
0.005400,0.002650,0.244700,0.747250
0.004950,0.003100,0.246000,0.745950
0.005250,0.003150,0.247100,0.744500
0.005150,0.003250,0.247950,0.743650
0.005500,0.003300,0.248950,0.742250
0.005250,0.003900,0.249700,0.741150
0.005500,0.004250,0.251050,0.739200
0.005900,0.004150,0.252700,0.737250
0.006050,0.005100,0.252750,0.736100
0.006600,0.004850,0.253750,0.734800
0.007400,0.005200,0.254350,0.733050
0.007950,0.004600,0.255550,0.731900
0.007900,0.005100,0.255950,0.731050
0.008350,0.005100,0.256900,0.729650
0.008500,0.005250,0.257400,0.728850
0.008250,0.005050,0.258600,0.728100
0.008650,0.005000,0.259200,0.727150
0.008900,0.005650,0.259700,0.725750
0.009300,0.005850,0.260100,0.724750
0.009800,0.005700,0.261000,0.723500
0.009700,0.005950,0.261050,0.723300
0.010350,0.006050,0.261700,0.721900
0.011300,0.005900,0.262200,0.720600
0.011150,0.006550,0.262250,0.720050
0.011650,0.006800,0.262500,0.719050
0.011900,0.007350,0.261900,0.718850
0.011900,0.008450,0.261550,0.718100
0.012800,0.007800,0.261550,0.717850
0.013200,0.008350,0.261600,0.716850
0.013550,0.008350,0.262000,0.716100
0.014150,0.009550,0.260400,0.715900
0.014750,0.009750,0.260050,0.715450
0.015900,0.010600,0.258600,0.714900
0.016550,0.010900,0.258450,0.714100
0.017750,0.010750,0.258000,0.713500
0.018300,0.011150,0.257550,0.713000
0.019750,0.011900,0.255800,0.712550
0.020650,0.012600,0.253950,0.712800
0.021450,0.012950,0.252400,0.713200
0.022050,0.014250,0.249800,0.713900
0.022900,0.014750,0.248000,0.714350
0.024400,0.015400,0.245450,0.714750
0.026100,0.015550,0.242800,0.715550
0.026400,0.016250,0.240400,0.716950
0.027200,0.017550,0.237150,0.718100
0.029150,0.017000,0.234500,0.719350
0.029400,0.017400,0.232650,0.720550
0.030500,0.019150,0.229350,0.721000
0.031400,0.019550,0.226250,0.722800
0.031650,0.020550,0.223750,0.724050
0.033250,0.019500,0.219950,0.727300
0.035650,0.018600,0.217750,0.728000
0.035850,0.019000,0.214550,0.730600
0.035750,0.019150,0.212300,0.732800
0.036050,0.020850,0.207950,0.735150
0.037050,0.020250,0.205500,0.737200
0.037750,0.020350,0.203150,0.738750
0.037600,0.021850,0.198800,0.741750
0.039200,0.022000,0.194800,0.744000
0.039800,0.021950,0.191500,0.746750
0.040300,0.021850,0.188700,0.749150
0.042150,0.021950,0.184950,0.750950
0.043400,0.021300,0.182100,0.753200
0.043600,0.020250,0.181150,0.755000
0.042750,0.020250,0.178450,0.758550
0.044650,0.019350,0.175150,0.760850
0.044550,0.018700,0.173250,0.763500
0.044950,0.019400,0.170500,0.765150
0.044800,0.018950,0.168750,0.767500
0.044300,0.018000,0.167100,0.770600
0.043500,0.018850,0.164550,0.773100
0.042600,0.018050,0.162900,0.776450
0.042100,0.019200,0.159850,0.778850
0.040550,0.019100,0.158950,0.781400
0.040050,0.018850,0.158400,0.782700
0.039850,0.018200,0.156900,0.785050
0.039100,0.017500,0.156550,0.786850
0.039050,0.016900,0.155450,0.788600
0.038600,0.016300,0.155050,0.790050
0.039900,0.016050,0.152850,0.791200
0.039200,0.015950,0.152100,0.792750
0.038300,0.015600,0.151650,0.794450
0.038000,0.015650,0.150100,0.796250
0.037000,0.015400,0.149600,0.798000
0.035950,0.015150,0.149950,0.798950
0.035900,0.014650,0.149450,0.800000
0.034350,0.014850,0.149300,0.801500
0.033450,0.014300,0.149550,0.802700
0.031800,0.014100,0.150800,0.803300
0.030300,0.013300,0.151550,0.804850
0.030450,0.013150,0.152350,0.804050
0.030500,0.012350,0.151950,0.805200
0.028900,0.013700,0.152350,0.805050
0.028800,0.014000,0.151650,0.805550
0.027650,0.014150,0.152950,0.805250
0.028550,0.013050,0.153100,0.805300
0.028150,0.012850,0.153750,0.805250
0.028000,0.012950,0.154100,0.804950
0.028250,0.012050,0.154200,0.805500
0.027850,0.011250,0.155300,0.805600
0.027100,0.011500,0.155900,0.805500
0.026850,0.011200,0.157700,0.804250
0.025950,0.011450,0.159450,0.803150
0.025750,0.010850,0.162250,0.801150
0.025200,0.011200,0.163150,0.800450
0.025000,0.010650,0.164500,0.799850
0.024300,0.011300,0.165400,0.799000
0.023600,0.011300,0.166900,0.798200
0.023400,0.012100,0.167350,0.797150
0.023400,0.011050,0.168550,0.797000
0.022950,0.010450,0.170400,0.796200
0.022000,0.010350,0.172550,0.795100
0.021800,0.010000,0.175050,0.793150
0.021650,0.010550,0.175950,0.791850
0.022450,0.010200,0.177000,0.790350
0.022400,0.010650,0.176800,0.790150
0.022950,0.011300,0.177900,0.787850
0.021900,0.011950,0.178700,0.787450
0.022200,0.011750,0.180100,0.785950
0.023300,0.011450,0.181450,0.783800
0.023150,0.010250,0.182950,0.783650
0.023100,0.010200,0.184700,0.782000
0.021300,0.010850,0.186250,0.781600
0.021750,0.010150,0.186750,0.781350
0.021800,0.009750,0.188500,0.779950
0.022100,0.009700,0.189600,0.778600
0.021700,0.009950,0.191100,0.777250
0.021050,0.010950,0.191600,0.776400
0.020850,0.009950,0.194250,0.774950
0.020850,0.010500,0.195750,0.772900
0.021050,0.010750,0.197200,0.771000
0.021600,0.011100,0.199000,0.768300
0.021350,0.011250,0.200950,0.766450
0.022200,0.011400,0.201900,0.764500
0.023000,0.011450,0.202650,0.762900
0.022900,0.011600,0.202700,0.762800
0.022850,0.012600,0.203600,0.760950
0.023800,0.011900,0.205100,0.759200
0.024050,0.012500,0.205050,0.758400
0.024000,0.012850,0.204800,0.758350
0.025350,0.013400,0.204350,0.756900
0.025900,0.013200,0.204800,0.756100
0.025500,0.013800,0.204900,0.755800
0.025900,0.014400,0.204700,0.755000
0.026350,0.014900,0.204650,0.754100
0.026350,0.014850,0.204600,0.754200
0.025700,0.015150,0.205700,0.753450
0.026950,0.015350,0.204800,0.752900
0.026550,0.016250,0.204750,0.752450
0.027200,0.016300,0.205350,0.751150
0.028700,0.015450,0.205150,0.750700
0.028300,0.014700,0.205800,0.751200
0.028950,0.014050,0.206550,0.750450
0.028950,0.016200,0.205900,0.748950
0.029750,0.016400,0.204550,0.749300
0.030100,0.017050,0.203900,0.748950
0.031400,0.016550,0.203400,0.748650
0.031900,0.016550,0.202350,0.749200
0.032150,0.017750,0.201650,0.748450
0.032850,0.018400,0.200800,0.747950
0.033400,0.019350,0.199850,0.747400
0.033600,0.018100,0.200450,0.747850
0.033750,0.018000,0.200200,0.748050
0.034050,0.018050,0.199500,0.748400
0.033950,0.018100,0.199400,0.748550
0.034100,0.018950,0.198000,0.748950
0.034600,0.018350,0.197650,0.749400
0.035750,0.018400,0.196450,0.749400
0.036200,0.018650,0.195900,0.749250
0.037950,0.018350,0.194200,0.749500
0.037200,0.020000,0.191650,0.751150
0.037700,0.019500,0.190650,0.752150
0.037650,0.020800,0.189350,0.752200
0.038700,0.020800,0.188050,0.752450
0.039300,0.020050,0.187250,0.753400
0.039500,0.020350,0.185650,0.754500
0.040650,0.020200,0.183950,0.755200
0.040250,0.020100,0.182900,0.756750
0.041050,0.019750,0.180950,0.758250
0.041100,0.021100,0.178600,0.759200
0.041650,0.020600,0.178650,0.759100
0.041450,0.021400,0.177700,0.759450
0.040900,0.022550,0.175850,0.760700
0.041200,0.021600,0.174500,0.762700
0.042000,0.021500,0.174150,0.762350
0.042600,0.019550,0.174550,0.763300
0.042800,0.019550,0.172450,0.765200
0.041500,0.020050,0.172700,0.765750
0.042150,0.021200,0.169450,0.767200
0.042650,0.020600,0.168850,0.767900
0.043500,0.018100,0.168600,0.769800
0.041250,0.018650,0.168200,0.771900
0.040550,0.018500,0.167750,0.773200
0.041050,0.017900,0.167400,0.773650
0.040450,0.018300,0.166550,0.774700
0.039550,0.017850,0.166750,0.775850
0.039400,0.017850,0.166650,0.776100
0.039600,0.016700,0.166950,0.776750
0.039300,0.017200,0.166700,0.776800
0.038200,0.017250,0.167150,0.777400
0.038250,0.017250,0.167350,0.777150
0.037450,0.017500,0.167650,0.777400
0.037050,0.017350,0.167900,0.777700
0.037450,0.016950,0.168000,0.777600
0.037100,0.017800,0.168050,0.777050
0.037000,0.018550,0.166450,0.778000
0.035900,0.017600,0.166950,0.779550
0.036200,0.017250,0.167650,0.778900
0.036300,0.015650,0.168950,0.779100
0.036200,0.015350,0.169600,0.778850
0.035900,0.015650,0.170750,0.777700
0.035250,0.015950,0.171450,0.777350
0.035550,0.015750,0.171950,0.776750
0.036150,0.015200,0.172850,0.775800
0.035450,0.016300,0.171250,0.777000
0.036000,0.016350,0.170950,0.776700
0.034550,0.016700,0.171500,0.777250
0.033750,0.016900,0.171450,0.777900
0.033050,0.017700,0.172550,0.776700
0.033550,0.016600,0.173500,0.776350
0.033800,0.016250,0.173950,0.776000
0.033500,0.016950,0.172750,0.776800
0.035150,0.016750,0.172350,0.775750
0.034900,0.016700,0.173300,0.775100
0.036000,0.015800,0.173550,0.774650
0.035300,0.015950,0.173750,0.775000
0.034900,0.015700,0.174850,0.774550
0.034700,0.015500,0.174450,0.775350
0.036400,0.014500,0.174250,0.774850
0.035550,0.016250,0.174450,0.773750
0.035450,0.016550,0.174300,0.773700
0.035850,0.016050,0.173700,0.774400
0.034500,0.016700,0.173800,0.775000
0.033800,0.016900,0.173850,0.775450
0.033550,0.016000,0.174600,0.775850
0.033750,0.015900,0.175400,0.774950
0.033950,0.016200,0.175900,0.773950
0.033950,0.016900,0.175450,0.773700
0.033850,0.015900,0.175500,0.774750
0.034800,0.015600,0.175750,0.773850
0.034400,0.015600,0.176350,0.773650
0.035150,0.016050,0.176550,0.772250
0.034250,0.016800,0.176650,0.772300
0.034950,0.016200,0.177750,0.771100
0.034550,0.017050,0.177050,0.771350
0.034950,0.017100,0.177100,0.770850
0.034050,0.018250,0.175850,0.771850
0.034150,0.017500,0.176800,0.771550
0.033800,0.017100,0.176500,0.772600
0.033300,0.017200,0.177150,0.772350
0.033600,0.016700,0.178950,0.770750
0.033550,0.017200,0.178950,0.770300
0.033500,0.017150,0.179200,0.770150
0.034050,0.016500,0.178350,0.771100
0.034500,0.016100,0.178650,0.770750
0.033900,0.016800,0.178150,0.771150
0.032800,0.017350,0.178900,0.770950
0.033100,0.017850,0.178750,0.770300
0.033350,0.017700,0.179350,0.769600
0.034500,0.016700,0.179500,0.769300
0.035300,0.015750,0.180100,0.768850
0.034050,0.015650,0.180850,0.769450
0.033750,0.017200,0.180500,0.768550
0.033950,0.016300,0.180950,0.768800
0.033550,0.015750,0.181900,0.768800
0.034000,0.016550,0.181600,0.767850
0.033900,0.016900,0.181200,0.768000
0.034700,0.016550,0.180800,0.767950
0.033750,0.017100,0.180100,0.769050
0.033450,0.016500,0.180100,0.769950
0.033250,0.016250,0.181450,0.769050
0.034100,0.015950,0.182800,0.767150
0.033050,0.016550,0.182950,0.767450
0.033450,0.015200,0.183550,0.767800
0.032450,0.015500,0.183650,0.768400
0.031950,0.016150,0.183200,0.768700
0.032600,0.015900,0.182650,0.768850
0.032900,0.015800,0.183250,0.768050
0.033100,0.015950,0.183700,0.767250
0.032650,0.016700,0.183250,0.767400
0.033100,0.016400,0.183250,0.767250
0.032300,0.017450,0.182750,0.767500
0.032850,0.016150,0.183150,0.767850
0.033750,0.015650,0.183050,0.767550
0.032900,0.015700,0.182600,0.768800
0.033000,0.015550,0.182550,0.768900
0.032000,0.016000,0.182600,0.769400
0.032550,0.016750,0.182900,0.767800
0.033100,0.016750,0.183250,0.766900
0.033350,0.016300,0.182550,0.767800
0.032900,0.017050,0.182050,0.768000
0.032550,0.016750,0.182700,0.768000
0.032850,0.017950,0.181600,0.767600
0.032900,0.017500,0.181500,0.768100
0.033200,0.017050,0.180800,0.768950
0.033100,0.016450,0.181400,0.769050
0.033900,0.017150,0.180850,0.768100
0.033450,0.017150,0.180850,0.768550
0.033800,0.017250,0.180550,0.768400
0.034300,0.016750,0.179800,0.769150
0.035400,0.016100,0.179300,0.769200
0.034850,0.016950,0.178200,0.770000
0.036000,0.016600,0.178900,0.768500
0.035550,0.015450,0.180000,0.769000
0.033800,0.017000,0.179300,0.769900
0.033350,0.016350,0.179900,0.770400
0.033850,0.015950,0.179350,0.770850
0.032650,0.016650,0.179400,0.771300
0.033250,0.016100,0.179600,0.771050
0.033550,0.017150,0.180350,0.768950
0.034250,0.017000,0.180500,0.768250
0.034800,0.016050,0.180100,0.769050
0.034200,0.017050,0.180600,0.768150
0.034450,0.016950,0.179900,0.768700
0.035700,0.016300,0.178750,0.769250
0.034900,0.016500,0.178150,0.770450
0.034550,0.015250,0.179050,0.771150
0.034800,0.015700,0.178850,0.770650
0.033700,0.015000,0.180600,0.770700
0.033450,0.014450,0.181600,0.770500
0.032600,0.014150,0.183400,0.769850
0.032500,0.014550,0.184550,0.768400
0.031350,0.014750,0.185200,0.768700
0.032300,0.015000,0.185500,0.767200
0.032450,0.015500,0.186000,0.766050
0.033500,0.015800,0.185500,0.765200
0.033400,0.016800,0.184050,0.765750
0.033200,0.016900,0.184150,0.765750
0.034250,0.016850,0.183450,0.765450
0.034200,0.016300,0.184050,0.765450
0.034650,0.016850,0.184400,0.764100
0.035150,0.016950,0.183800,0.764100
0.034950,0.017150,0.183100,0.764800
0.034800,0.016500,0.183100,0.765600
0.034800,0.017350,0.183500,0.764350
0.035150,0.018200,0.182150,0.764500
0.035750,0.018100,0.182500,0.763650
0.036400,0.018750,0.180700,0.764150
0.037800,0.017800,0.179300,0.765100
0.037000,0.018250,0.178100,0.766650
0.038550,0.018100,0.177750,0.765600
0.038800,0.016900,0.178350,0.765950
0.039200,0.016550,0.178250,0.766000
0.037700,0.017200,0.177550,0.767550
0.037200,0.017500,0.177500,0.767800
0.037400,0.017500,0.176800,0.768300
0.037900,0.017300,0.176350,0.768450
0.037250,0.016800,0.176950,0.769000
0.037850,0.016500,0.176700,0.768950
0.035950,0.017550,0.176300,0.770200
0.036450,0.017250,0.175450,0.770850
0.035850,0.018150,0.174250,0.771750
0.035000,0.019200,0.173500,0.772300
0.035600,0.018950,0.173250,0.772200
0.035900,0.017800,0.173500,0.772800
0.035050,0.017800,0.172350,0.774800
0.035250,0.017400,0.172900,0.774450
0.033850,0.017900,0.172700,0.775550
0.033950,0.017600,0.172450,0.776000
0.034950,0.018050,0.172850,0.774150
0.035800,0.017350,0.173250,0.773600
0.036150,0.016700,0.174800,0.772350
0.035800,0.016750,0.175000,0.772450
0.035600,0.016700,0.176450,0.771250
0.035050,0.017000,0.175950,0.772000
0.035500,0.016550,0.175550,0.772400
0.036250,0.015500,0.177050,0.771200
0.035150,0.016600,0.176300,0.771950
0.036000,0.015400,0.176650,0.771950
0.035100,0.016550,0.175900,0.772450
0.035200,0.016650,0.176850,0.771300
0.034600,0.017050,0.176350,0.772000
0.034750,0.016500,0.177600,0.771150
0.034150,0.017300,0.177350,0.771200
0.034200,0.016850,0.178400,0.770550
0.033700,0.016750,0.178700,0.770850
0.033000,0.016800,0.179850,0.770350
0.033050,0.016800,0.181000,0.769150
0.033150,0.016700,0.181950,0.768200
0.032900,0.016500,0.182800,0.767800
0.032450,0.016350,0.184900,0.766300
0.032650,0.015950,0.185000,0.766400
0.032700,0.017250,0.183500,0.766550
0.033350,0.015850,0.184150,0.766650
0.032950,0.016100,0.185350,0.765600
0.033700,0.016000,0.185350,0.764950
0.033750,0.016450,0.185250,0.764550
0.034800,0.016150,0.184900,0.764150
0.034750,0.016450,0.184500,0.764300
0.034050,0.017300,0.184250,0.764400
0.034750,0.016350,0.185800,0.763100
0.034900,0.016300,0.185750,0.763050
0.034250,0.016350,0.186650,0.762750
0.034150,0.016100,0.188400,0.761350
0.033800,0.015650,0.189650,0.760900
0.032750,0.017200,0.188450,0.761600
0.033850,0.016000,0.189650,0.760500
0.033200,0.017000,0.188600,0.761200
0.032350,0.017300,0.189250,0.761100
0.032800,0.016650,0.189700,0.760850
0.032000,0.017650,0.189450,0.760900
0.033600,0.017800,0.188400,0.760200
0.033500,0.018550,0.187500,0.760450
0.033700,0.019650,0.187250,0.759400
0.034350,0.019900,0.187000,0.758750
0.035100,0.020000,0.186350,0.758550
0.036550,0.020100,0.186300,0.757050
0.036950,0.019750,0.186150,0.757150
0.038900,0.019050,0.185500,0.756550
0.038600,0.018450,0.185800,0.757150
0.037850,0.019750,0.184200,0.758200
0.039450,0.019250,0.183450,0.757850
0.040000,0.019650,0.181500,0.758850
0.039850,0.019850,0.181150,0.759150
0.040500,0.019500,0.180500,0.759500
0.039800,0.018600,0.180600,0.761000
0.037350,0.018350,0.180950,0.763350
0.037600,0.019000,0.181050,0.762350
0.038250,0.018650,0.181350,0.761750
0.038650,0.019250,0.180500,0.761600
0.038600,0.019300,0.181300,0.760800
0.038950,0.018950,0.180200,0.761900
0.039050,0.018500,0.180000,0.762450
0.040200,0.018700,0.178900,0.762200
0.040800,0.018100,0.178550,0.762550
0.039250,0.019150,0.177250,0.764350
0.039350,0.020350,0.175200,0.765100
0.040400,0.018950,0.176000,0.764650
0.039750,0.020200,0.174750,0.765300
0.039500,0.019650,0.175300,0.765550
0.039300,0.019400,0.174700,0.766600
0.039800,0.018600,0.174750,0.766850
0.040150,0.018900,0.175650,0.765300
0.040750,0.018600,0.174000,0.766650
0.040000,0.018700,0.174450,0.766850
0.040100,0.019000,0.174100,0.766800
0.039250,0.020450,0.173150,0.767150
0.040100,0.021450,0.171850,0.766600
0.040600,0.020950,0.171750,0.766700
0.040200,0.020250,0.171550,0.768000
0.040400,0.020400,0.170750,0.768450
0.040500,0.020800,0.169450,0.769250
0.041450,0.020550,0.167500,0.770500
0.043200,0.019750,0.166350,0.770700
0.043300,0.019350,0.166150,0.771200
0.043450,0.020150,0.164850,0.771550
0.042500,0.019900,0.164600,0.773000
0.043000,0.019600,0.164650,0.772750
0.042900,0.020650,0.163000,0.773450
0.042050,0.020750,0.162300,0.774900
0.041700,0.020450,0.161400,0.776450
0.042550,0.019700,0.161700,0.776050
0.042100,0.018850,0.162600,0.776450
0.040600,0.018700,0.163350,0.777350
0.040200,0.018600,0.164200,0.777000
0.042000,0.016850,0.165750,0.775400
0.040850,0.018400,0.163900,0.776850
0.040650,0.017450,0.164850,0.777050
0.040550,0.017100,0.164450,0.777900
0.040150,0.016400,0.165500,0.777950
0.039200,0.015550,0.166850,0.778400
0.036650,0.016900,0.167350,0.779100
0.037250,0.015350,0.167450,0.779950
0.036200,0.015450,0.168950,0.779400
0.035400,0.016650,0.168600,0.779350
0.036600,0.015850,0.168150,0.779400
0.036350,0.016050,0.169050,0.778550
0.035700,0.016250,0.169750,0.778300
0.035000,0.017050,0.170200,0.777750
0.034400,0.016900,0.170550,0.778150
0.033800,0.016800,0.171350,0.778050
0.033750,0.016650,0.173400,0.776200
0.033600,0.016650,0.174350,0.775400
0.034950,0.015500,0.175100,0.774450
0.034000,0.015950,0.176200,0.773850
0.034100,0.015650,0.176850,0.773400
0.032950,0.016000,0.176800,0.774250
0.033250,0.015750,0.177300,0.773700
0.032900,0.016150,0.177450,0.773500
0.034400,0.015250,0.178150,0.772200
0.034300,0.015400,0.178500,0.771800
0.034150,0.014000,0.180600,0.771250
0.034200,0.015550,0.180600,0.769650
0.033500,0.015150,0.181350,0.770000
0.033050,0.016250,0.181950,0.768750
0.032800,0.016400,0.182400,0.768400
0.032150,0.016400,0.182600,0.768850
0.031700,0.016300,0.184200,0.767800
0.032350,0.016250,0.183750,0.767650
0.032150,0.016800,0.184400,0.766650
0.033050,0.016450,0.184800,0.765700
0.033250,0.015800,0.186050,0.764900
0.033450,0.015550,0.186800,0.764200
0.033550,0.016000,0.187650,0.762800
0.033450,0.015850,0.187950,0.762750
0.033350,0.015400,0.188050,0.763200
0.033650,0.015650,0.187950,0.762750
0.032900,0.016600,0.188050,0.762450
0.032650,0.017300,0.187700,0.762350
0.032250,0.016850,0.188050,0.762850
0.031850,0.018050,0.187000,0.763100
0.031800,0.018300,0.186900,0.763000
0.031850,0.017800,0.187200,0.763150
0.032200,0.017000,0.187450,0.763350
0.032450,0.016300,0.187400,0.763850
0.032350,0.016000,0.188000,0.763650
0.032900,0.015250,0.188800,0.763050
0.033750,0.014700,0.189100,0.762450
0.033600,0.016450,0.189550,0.760400
0.034750,0.015450,0.189800,0.760000
0.033550,0.016550,0.190450,0.759450
0.033250,0.017900,0.189300,0.759550
0.034600,0.017550,0.188750,0.759100
0.035250,0.016650,0.188950,0.759150
0.036200,0.016400,0.189800,0.757600
0.035950,0.016200,0.190200,0.757650
0.035200,0.017550,0.190450,0.756800
0.035500,0.018400,0.190400,0.755700
0.035900,0.018200,0.190200,0.755700
0.035500,0.018100,0.189450,0.756950
0.035100,0.018550,0.189000,0.757350
0.035300,0.019400,0.188750,0.756550
0.036600,0.018050,0.189400,0.755950
0.036450,0.018400,0.188700,0.756450
0.036800,0.018700,0.188550,0.755950
0.036850,0.019000,0.188150,0.756000
0.036150,0.018700,0.188150,0.757000
0.034900,0.019900,0.187000,0.758200
0.036700,0.018300,0.186850,0.758150
0.038050,0.017900,0.185500,0.758550
0.036900,0.017500,0.185850,0.759750
0.036850,0.018650,0.184850,0.759650
0.037700,0.018700,0.184100,0.759500
0.037700,0.019000,0.183700,0.759600
0.037500,0.018500,0.184100,0.759900
0.037900,0.019650,0.182100,0.760350
0.037750,0.020150,0.182200,0.759900
0.038700,0.019900,0.182100,0.759300
0.039150,0.019700,0.181450,0.759700
0.039900,0.019950,0.180450,0.759700
0.041100,0.018700,0.179600,0.760600
0.041200,0.018750,0.178900,0.761150
0.041800,0.018350,0.178850,0.761000
0.041850,0.017900,0.178300,0.761950
0.041300,0.018400,0.176900,0.763400
0.042000,0.018100,0.177300,0.762600
0.041700,0.018300,0.176500,0.763500
0.041750,0.018450,0.176000,0.763800
0.041050,0.019650,0.173100,0.766200
0.040100,0.019550,0.172200,0.768150
0.040050,0.019300,0.172150,0.768500
0.039000,0.020000,0.171200,0.769800
0.039400,0.019050,0.170600,0.770950
0.038150,0.019250,0.171300,0.771300
0.038900,0.018800,0.171150,0.771150
0.039450,0.018300,0.170400,0.771850
0.039650,0.017750,0.170650,0.771950
0.040450,0.018300,0.169600,0.771650
0.040300,0.018300,0.169000,0.772400
0.038650,0.019400,0.167700,0.774250
0.039300,0.018500,0.167600,0.774600
0.039900,0.018650,0.167400,0.774050
0.039450,0.018750,0.166950,0.774850
0.039700,0.018500,0.166500,0.775300
0.039150,0.017850,0.166050,0.776950
0.037750,0.017200,0.166200,0.778850
0.036900,0.017350,0.166800,0.778950
0.036600,0.017550,0.166750,0.779100
0.037400,0.016300,0.166800,0.779500
0.037700,0.016350,0.167500,0.778450
0.036750,0.016600,0.168250,0.778400
0.036050,0.016500,0.168000,0.779450
0.035950,0.016000,0.168200,0.779850
0.034350,0.016250,0.168950,0.780450
0.034750,0.015650,0.169300,0.780300
0.032800,0.015950,0.169500,0.781750
0.033150,0.015250,0.170350,0.781250
0.034100,0.015350,0.170300,0.780250
0.033550,0.016000,0.172050,0.778400
0.032450,0.016350,0.172750,0.778450
0.032550,0.016200,0.173650,0.777600
0.032650,0.015900,0.174850,0.776600
0.033400,0.014200,0.175850,0.776550
0.033200,0.013400,0.177550,0.775850
0.033300,0.013050,0.178700,0.774950
0.032600,0.013200,0.179900,0.774300
