
real	0m4,542s
user	0m10,328s
sys	0m5,279s

real	0m4,463s
user	0m9,851s
sys	0m6,033s

real	0m4,577s
user	0m10,084s
sys	0m5,297s

real	0m4,620s
user	0m10,063s
sys	0m5,674s

real	0m4,765s
user	0m10,070s
sys	0m5,477s
