
real	0m19,493s
user	0m19,487s
sys	0m0,004s

real	0m19,514s
user	0m19,513s
sys	0m0,000s

real	0m19,485s
user	0m19,475s
sys	0m0,008s

real	0m19,488s
user	0m19,483s
sys	0m0,004s

real	0m19,584s
user	0m19,574s
sys	0m0,008s
