
real	0m13,836s
user	0m13,799s
sys	0m0,036s

real	0m13,828s
user	0m13,791s
sys	0m0,036s

real	0m13,876s
user	0m13,850s
sys	0m0,024s

real	0m13,824s
user	0m13,776s
sys	0m0,048s

real	0m13,883s
user	0m13,858s
sys	0m0,024s

real	0m14,130s
user	0m14,102s
sys	0m0,028s

real	0m14,145s
user	0m14,096s
sys	0m0,048s

real	0m14,129s
user	0m14,104s
sys	0m0,024s
