I,E,S,R
0.001000,0.000900,0.998100,0.000000
0.001350,0.001050,0.997600,0.000000
0.001500,0.001950,0.996450,0.000100
0.002100,0.003000,0.994700,0.000200
0.002600,0.004600,0.992250,0.000550
0.003850,0.005000,0.990200,0.000950
0.004600,0.006350,0.987450,0.001600
0.006100,0.008100,0.983600,0.002200
0.007700,0.011700,0.977800,0.002800
0.010500,0.015500,0.970600,0.003400
0.013200,0.019850,0.962300,0.004650
0.018100,0.026050,0.950100,0.005750
0.022300,0.033750,0.935550,0.008400
0.028350,0.041650,0.918400,0.011600
0.036850,0.052600,0.895700,0.014850
0.046500,0.066800,0.867050,0.019650
0.060400,0.083100,0.830650,0.025850
0.076350,0.102100,0.787400,0.034150
0.094950,0.123500,0.736100,0.045450
0.117950,0.145700,0.678700,0.057650
0.145050,0.171050,0.611600,0.072300
0.174850,0.192950,0.539150,0.093050
0.204250,0.211000,0.468250,0.116500
0.237800,0.221300,0.397000,0.143900
0.270750,0.231250,0.323400,0.174600
0.297950,0.233250,0.259200,0.209600
0.327250,0.222600,0.202800,0.247350
0.347150,0.205650,0.156300,0.290900
0.359750,0.184800,0.119050,0.336400
0.363950,0.161800,0.089600,0.384650
0.361100,0.138900,0.067200,0.432800
0.356550,0.113950,0.050750,0.478750
0.340400,0.093150,0.040850,0.525600
0.320450,0.075200,0.033100,0.571250
0.295100,0.061650,0.027950,0.615300
0.271500,0.050050,0.025550,0.652900
0.247950,0.040850,0.022350,0.688850
0.226850,0.033950,0.020150,0.719050
0.205700,0.026450,0.019500,0.748350
0.184800,0.021950,0.019550,0.773700
0.166400,0.017850,0.019800,0.795950
0.147850,0.015550,0.019550,0.817050
0.133000,0.013000,0.019550,0.834450
0.119550,0.011100,0.020500,0.848850
0.106800,0.008950,0.021450,0.862800
0.095750,0.007650,0.022650,0.873950
0.085400,0.006700,0.024350,0.883550
0.074550,0.005350,0.025900,0.894200
0.065200,0.005700,0.027400,0.901700
0.059000,0.004650,0.029900,0.906450
0.051700,0.004050,0.031700,0.912550
0.044550,0.003800,0.034000,0.917650
0.039250,0.003700,0.036350,0.920700
0.035550,0.003600,0.038900,0.921950
0.031750,0.003550,0.040350,0.924350
0.027950,0.003450,0.042900,0.925700
0.024350,0.003150,0.045600,0.926900
0.021900,0.002950,0.048750,0.926400
0.020000,0.002700,0.051800,0.925500
0.018000,0.002850,0.053700,0.925450
0.016550,0.002600,0.055900,0.924950
0.014300,0.002400,0.057550,0.925750
0.012450,0.002550,0.060500,0.924500
0.011200,0.002050,0.064050,0.922700
0.009850,0.002000,0.066350,0.921800
0.008750,0.002050,0.068550,0.920650
0.008050,0.002150,0.071550,0.918250
0.007600,0.001850,0.074350,0.916200
0.007000,0.001600,0.077850,0.913550
0.006450,0.001700,0.079900,0.911950
0.006100,0.001400,0.082500,0.910000
0.005050,0.001350,0.085100,0.908500
0.005450,0.000900,0.088100,0.905550
0.004750,0.001150,0.092050,0.902050
0.004450,0.000900,0.095100,0.899550
0.003700,0.000850,0.098050,0.897400
0.003500,0.000900,0.100750,0.894850
0.003250,0.000950,0.103350,0.892450
0.003000,0.000950,0.106000,0.890050
0.002900,0.000650,0.109150,0.887300
0.002650,0.000750,0.111650,0.884950
0.002500,0.000650,0.114250,0.882600
0.002350,0.000750,0.117050,0.879850
0.002250,0.000700,0.119650,0.877400
0.002300,0.000600,0.122750,0.874350
0.002000,0.000750,0.125100,0.872150
0.001750,0.000500,0.127850,0.869900
0.001750,0.000500,0.130450,0.867300
0.001700,0.000550,0.132350,0.865400
0.001550,0.000500,0.135300,0.862650
0.001650,0.000500,0.137450,0.860400
0.001600,0.000350,0.139700,0.858350
0.001550,0.000500,0.141600,0.856350
0.001700,0.000350,0.144100,0.853850
0.001700,0.000350,0.146850,0.851100
0.001900,0.000150,0.149850,0.848100
0.001650,0.000350,0.151800,0.846200
0.001450,0.000400,0.154300,0.843850
0.001550,0.000550,0.157200,0.840700
0.001550,0.000500,0.159650,0.838300
0.001500,0.000350,0.162050,0.836100
0.001400,0.000500,0.164550,0.833550
0.001250,0.000750,0.166500,0.831500
0.001150,0.000750,0.168750,0.829350
0.000950,0.000850,0.171000,0.827200
0.001000,0.000900,0.173050,0.825050
0.001050,0.000750,0.175650,0.822550
0.001300,0.000500,0.178100,0.820100
0.001150,0.000800,0.179950,0.818100
0.001400,0.000700,0.182050,0.815850
0.001250,0.000650,0.183800,0.814300
0.001300,0.000750,0.185600,0.812350
0.001350,0.000750,0.187050,0.810850
0.001400,0.000650,0.189300,0.808650
0.001300,0.000650,0.191800,0.806250
0.001200,0.001000,0.193750,0.804050
0.001250,0.001150,0.195800,0.801800
0.001550,0.000850,0.197550,0.800050
0.001500,0.000800,0.198950,0.798750
0.001300,0.001000,0.201350,0.796350
0.001350,0.000850,0.202900,0.794900
0.001350,0.000700,0.205650,0.792300
0.001300,0.000650,0.207100,0.790950
0.001350,0.000700,0.209350,0.788600
0.001200,0.000800,0.211850,0.786150
0.001250,0.000750,0.214300,0.783700
0.001350,0.000800,0.216250,0.781600
0.001500,0.000750,0.218200,0.779550
0.001550,0.000700,0.220700,0.777050
0.001950,0.000650,0.222700,0.774700
0.001950,0.000600,0.224950,0.772500
0.001850,0.000800,0.227350,0.770000
0.001850,0.001100,0.229250,0.767800
0.001900,0.001150,0.230850,0.766100
0.002150,0.001150,0.232250,0.764450
0.002150,0.001200,0.234000,0.762650
0.002350,0.001400,0.235750,0.760500
0.002750,0.001350,0.237050,0.758850
0.003000,0.001300,0.239000,0.756700
0.003050,0.001250,0.240250,0.755450
0.002850,0.001750,0.241750,0.753650
0.003050,0.002050,0.243450,0.751450
0.003300,0.002400,0.245050,0.749250
0.003550,0.002150,0.247150,0.747150
0.003350,0.002200,0.249050,0.745400
0.003500,0.002350,0.251300,0.742850
0.003600,0.002400,0.253350,0.740650
0.003500,0.002650,0.255200,0.738650
0.003650,0.002600,0.257600,0.736150
0.003700,0.002600,0.258700,0.735000
0.004200,0.002350,0.259600,0.733850
0.004250,0.002800,0.261050,0.731900
0.004700,0.002650,0.262700,0.729950
0.005200,0.003450,0.263700,0.727650
0.005150,0.003500,0.265050,0.726300
0.005300,0.003750,0.265950,0.725000
0.005600,0.003850,0.266800,0.723750
0.006300,0.003850,0.267900,0.721950
0.006150,0.005000,0.268200,0.720650
0.006400,0.004950,0.269400,0.719250
0.007400,0.005200,0.269850,0.717550
0.007700,0.005500,0.270050,0.716750
0.008300,0.005450,0.270450,0.715800
0.008100,0.006400,0.270150,0.715350
0.008700,0.006650,0.270600,0.714050
0.009250,0.006100,0.271100,0.713550
0.009750,0.006500,0.271200,0.712550
0.010100,0.006700,0.271300,0.711900
0.010650,0.006800,0.271300,0.711250
0.011500,0.007450,0.270650,0.710400
0.012050,0.007700,0.270300,0.709950
0.012700,0.008750,0.269150,0.709400
0.012650,0.009500,0.268700,0.709150
0.012950,0.009700,0.268300,0.709050
0.014950,0.008450,0.268800,0.707800
0.014900,0.010000,0.267450,0.707650
0.015800,0.010650,0.265200,0.708350
0.016350,0.011000,0.264700,0.707950
0.016850,0.010900,0.263800,0.708450
0.017150,0.011650,0.262800,0.708400
0.018550,0.011350,0.261550,0.708550
0.019200,0.011500,0.259850,0.709450
0.020500,0.011900,0.257650,0.709950
0.020750,0.010700,0.257400,0.711150
0.020850,0.011800,0.255050,0.712300
0.022200,0.011700,0.252950,0.713150
0.022450,0.012600,0.251400,0.713550
0.023050,0.014250,0.248500,0.714200
0.024150,0.014500,0.246450,0.714900
0.026550,0.014400,0.244100,0.714950
0.026900,0.014350,0.242150,0.716600
0.027550,0.015450,0.239150,0.717850
0.028250,0.015700,0.236150,0.719900
0.028650,0.016200,0.233850,0.721300
0.028400,0.018300,0.229850,0.723450
0.029750,0.017100,0.228050,0.725100
0.029900,0.017300,0.225200,0.727600
0.029500,0.018650,0.222400,0.729450
0.031850,0.017650,0.220650,0.729850
0.032300,0.016950,0.218900,0.731850
0.032050,0.017000,0.216350,0.734600
0.032950,0.017750,0.213150,0.736150
0.032700,0.018000,0.210350,0.738950
0.034350,0.017750,0.207300,0.740600
0.034250,0.017550,0.206100,0.742100
0.033250,0.018600,0.203700,0.744450
0.032250,0.019150,0.201500,0.747100
0.034050,0.018350,0.198800,0.748800
0.035150,0.017850,0.196950,0.750050
0.035400,0.017350,0.195450,0.751800
0.034550,0.018150,0.192700,0.754600
0.035100,0.017550,0.191400,0.755950
0.036100,0.017400,0.189400,0.757100
0.036450,0.016450,0.188550,0.758550
0.036200,0.018550,0.185650,0.759600
0.037050,0.018200,0.184500,0.760250
0.037250,0.018550,0.182500,0.761700
0.037950,0.018050,0.180300,0.763700
0.037750,0.018500,0.178200,0.765550
0.038150,0.018000,0.177100,0.766750
0.039150,0.016500,0.175750,0.768600
0.038100,0.017250,0.173600,0.771050
0.037800,0.017350,0.171500,0.773350
0.037550,0.016950,0.170300,0.775200
0.036250,0.018400,0.167500,0.777850
0.037300,0.017450,0.166350,0.778900
0.036300,0.018300,0.164300,0.781100
0.037100,0.017050,0.164150,0.781700
0.036200,0.016650,0.163250,0.783900
0.035650,0.016900,0.162050,0.785400
0.034550,0.016350,0.161400,0.787700
0.035800,0.015150,0.160900,0.788150
0.035300,0.014200,0.161100,0.789400
0.034300,0.014500,0.160800,0.790400
0.032950,0.015150,0.160400,0.791500
0.032650,0.015100,0.159250,0.793000
0.032000,0.015350,0.158250,0.794400
0.031750,0.014300,0.158700,0.795250
0.031000,0.015100,0.157050,0.796850
0.031650,0.013800,0.157850,0.796700
0.032400,0.013300,0.157600,0.796700
0.032450,0.012700,0.157050,0.797800
0.031300,0.013550,0.157500,0.797650
0.030150,0.013050,0.158550,0.798250
0.029600,0.012700,0.159850,0.797850
0.028200,0.012900,0.159800,0.799100
0.027550,0.012950,0.160300,0.799200
0.027300,0.012750,0.161200,0.798750
0.027100,0.011600,0.163550,0.797750
0.026850,0.011900,0.163800,0.797450
0.027050,0.011800,0.164600,0.796550
0.026600,0.011900,0.166300,0.795200
0.025350,0.012150,0.167900,0.794600
0.024750,0.012600,0.168700,0.793950
0.024600,0.011700,0.170150,0.793550
0.023900,0.012050,0.170500,0.793550
0.024300,0.011050,0.171800,0.792850
0.023650,0.011100,0.173450,0.791800
0.023250,0.011750,0.173550,0.791450
0.023200,0.012050,0.174350,0.790400
0.023800,0.011100,0.176200,0.788900
0.023750,0.011100,0.177300,0.787850
0.023550,0.011050,0.177800,0.787600
0.024400,0.010850,0.178500,0.786250
0.024550,0.010100,0.180500,0.784850
0.024450,0.010100,0.181200,0.784250
0.023300,0.010900,0.181950,0.783850
0.023200,0.011100,0.183000,0.782700
0.022950,0.010900,0.185800,0.780350
0.023500,0.010550,0.186800,0.779150
0.023800,0.010350,0.188200,0.777650
0.024100,0.010950,0.189150,0.775800
0.023500,0.011950,0.189450,0.775100
0.024650,0.011650,0.190650,0.773050
0.024450,0.011600,0.191600,0.772350
0.024150,0.011250,0.192250,0.772350
0.023700,0.011500,0.192600,0.772200
0.023850,0.012500,0.192850,0.770800
0.024550,0.012050,0.194050,0.769350
0.024000,0.012800,0.194000,0.769200
0.023800,0.012500,0.194750,0.768950
0.024300,0.012350,0.195350,0.768000
0.024050,0.011900,0.196000,0.768050
0.023900,0.012500,0.196650,0.766950
0.023600,0.012150,0.197750,0.766500
0.023450,0.012550,0.197900,0.766100
0.024850,0.012100,0.199400,0.763650
0.024200,0.012800,0.199500,0.763500
0.024550,0.013400,0.199250,0.762800
0.024550,0.012600,0.200400,0.762450
0.024650,0.013250,0.200250,0.761850
0.025400,0.012850,0.200800,0.760950
0.026250,0.012800,0.201500,0.759450
0.026400,0.013250,0.202100,0.758250
0.026050,0.013350,0.203000,0.757600
0.026500,0.013800,0.203350,0.756350
0.026850,0.014000,0.203800,0.755350
0.027100,0.014750,0.203150,0.755000
0.027000,0.015150,0.202700,0.755150
0.028050,0.015050,0.203350,0.753550
0.027750,0.014600,0.203700,0.753950
0.028300,0.014700,0.203600,0.753400
0.028850,0.015600,0.203000,0.752550
0.029150,0.015400,0.204550,0.750900
0.029800,0.014900,0.204100,0.751200
0.029900,0.014350,0.205350,0.750400
0.029300,0.014950,0.205000,0.750750
0.028950,0.016250,0.203800,0.751000
0.029200,0.015400,0.204350,0.751050
0.029400,0.016700,0.204000,0.749900
0.030950,0.015400,0.204600,0.749050
0.030050,0.016700,0.204850,0.748400
0.030550,0.016950,0.203600,0.748900
0.030800,0.018050,0.201750,0.749400
0.031300,0.017850,0.201700,0.749150
0.031250,0.018700,0.199900,0.750150
0.032000,0.018400,0.198850,0.750750
0.034350,0.017150,0.198850,0.749650
0.035100,0.016550,0.199050,0.749300
0.034550,0.017750,0.198400,0.749300
0.034800,0.018350,0.196500,0.750350
0.035300,0.017600,0.196050,0.751050
0.034650,0.019400,0.194750,0.751200
0.035150,0.018650,0.194550,0.751650
0.036000,0.018250,0.194550,0.751200
0.036200,0.018200,0.193350,0.752250
0.037050,0.019150,0.191900,0.751900
0.037700,0.018850,0.189400,0.754050
0.037850,0.019800,0.187300,0.755050
0.038550,0.020300,0.185650,0.755500
0.038650,0.020700,0.184150,0.756500
0.039550,0.020400,0.182350,0.757700
0.039000,0.019000,0.182200,0.759800
0.039550,0.019850,0.181250,0.759350
0.039300,0.019050,0.181600,0.760050
0.038700,0.019350,0.180400,0.761550
0.038150,0.018800,0.180100,0.762950
0.038400,0.017750,0.179650,0.764200
0.038500,0.018100,0.178900,0.764500
0.039250,0.017450,0.178300,0.765000
0.038800,0.017650,0.177450,0.766100
0.038450,0.017550,0.176800,0.767200
0.038050,0.017450,0.176250,0.768250
0.037750,0.017400,0.176150,0.768700
0.037700,0.017400,0.175300,0.769600
0.037400,0.017600,0.174650,0.770350
0.037850,0.016650,0.174350,0.771150
0.038250,0.017050,0.173900,0.770800
0.037400,0.017200,0.174500,0.770900
0.037700,0.016750,0.173850,0.771700
0.036950,0.017150,0.173950,0.771950
0.037350,0.016650,0.172950,0.773050
0.036750,0.017800,0.171450,0.774000
0.036350,0.017750,0.171100,0.774800
0.036650,0.017300,0.171150,0.774900
0.036200,0.018200,0.170300,0.775300
0.035700,0.018850,0.169500,0.775950
0.036500,0.017100,0.170600,0.775800
0.035700,0.016850,0.171100,0.776350
0.035950,0.017100,0.170600,0.776350
0.035400,0.017350,0.169750,0.777500
0.035350,0.016850,0.170550,0.777250
0.034800,0.017200,0.171350,0.776650
0.034850,0.016300,0.172050,0.776800
0.034150,0.017900,0.171150,0.776800
0.035400,0.017350,0.171050,0.776200
0.036400,0.016800,0.171000,0.775800
0.035400,0.017350,0.169750,0.777500
0.036000,0.017400,0.170200,0.776400
0.035800,0.017100,0.171150,0.775950
0.036200,0.017250,0.171400,0.775150
0.035750,0.017100,0.171650,0.775500
0.036400,0.016650,0.171300,0.775650
0.035450,0.016450,0.170850,0.777250
0.034800,0.015850,0.172250,0.777100
0.033300,0.015800,0.172100,0.778800
0.033100,0.016200,0.172350,0.778350
0.031650,0.016550,0.172800,0.779000
0.032150,0.016350,0.173100,0.778400
0.031400,0.016550,0.173000,0.779050
0.031650,0.016050,0.174500,0.777800
0.030450,0.016400,0.174050,0.779100
0.030350,0.016100,0.175850,0.777700
0.030900,0.015150,0.177050,0.776900
0.030950,0.016500,0.177400,0.775150
0.031700,0.016250,0.177350,0.774700
0.032200,0.015700,0.177950,0.774150
0.032000,0.016150,0.178250,0.773600
0.032300,0.015600,0.179100,0.773000
0.032950,0.014950,0.179700,0.772400
0.032750,0.015350,0.179700,0.772200
0.031950,0.016150,0.179950,0.771950
0.031650,0.016100,0.180250,0.772000
0.033100,0.015500,0.180250,0.771150
0.032800,0.015150,0.179950,0.772100
0.032550,0.015700,0.179600,0.772150
0.031950,0.016350,0.179000,0.772700
0.032250,0.015300,0.180950,0.771500
0.032400,0.014950,0.181000,0.771650
0.031200,0.016350,0.180550,0.771900
0.031650,0.017150,0.179800,0.771400
0.031200,0.017750,0.180300,0.770750
0.031450,0.017550,0.181050,0.769950
0.031900,0.017050,0.180500,0.770550
0.033200,0.015900,0.181150,0.769750
0.034050,0.015450,0.181450,0.769050
0.033700,0.015850,0.180300,0.770150
0.033500,0.016800,0.180700,0.769000
0.034400,0.015150,0.181450,0.769000
0.033700,0.015550,0.182200,0.768550
0.034050,0.015400,0.182750,0.767800
0.032200,0.017000,0.181600,0.769200
0.032000,0.016350,0.182550,0.769100
0.033000,0.015450,0.182200,0.769350
0.032400,0.015150,0.182450,0.770000
0.032400,0.014450,0.182100,0.771050
0.031400,0.015300,0.181500,0.771800
0.031750,0.015700,0.181150,0.771400
0.031850,0.015450,0.180850,0.771850
0.031550,0.015900,0.181350,0.771200
0.031350,0.014650,0.182350,0.771650
0.030100,0.015500,0.182900,0.771500
0.029100,0.015450,0.184300,0.771150
0.030750,0.013250,0.185300,0.770700
0.030100,0.012900,0.186000,0.771000
0.030250,0.012150,0.187200,0.770400
0.029700,0.013350,0.187950,0.769000
0.030000,0.013500,0.188150,0.768350
0.028950,0.014450,0.188700,0.767900
0.028900,0.014750,0.188850,0.767500
0.028300,0.015300,0.189800,0.766600
0.028550,0.015250,0.190400,0.765800
0.028450,0.015100,0.191350,0.765100
0.028950,0.015000,0.191250,0.764800
0.028900,0.015250,0.191550,0.764300
0.029350,0.015800,0.191750,0.763100
0.029000,0.016400,0.191100,0.763500
0.029950,0.016350,0.191350,0.762350
0.030350,0.016500,0.191200,0.761950
0.031300,0.015950,0.192000,0.760750
0.031900,0.016350,0.192300,0.759450
0.032350,0.015750,0.193400,0.758500
0.034400,0.016450,0.191850,0.757300
0.034900,0.016350,0.190850,0.757900
0.034100,0.016300,0.190700,0.758900
0.033850,0.016850,0.190050,0.759250
0.034450,0.016500,0.190850,0.758200
0.033700,0.017350,0.190050,0.758900
0.034100,0.018000,0.188100,0.759800
0.034100,0.018450,0.187000,0.760450
0.035650,0.016900,0.186700,0.760750
0.035200,0.016500,0.186200,0.762100
0.035250,0.016850,0.184750,0.763150
0.034800,0.017550,0.184350,0.763300
0.035350,0.018150,0.183750,0.762750
0.035350,0.017900,0.183100,0.763650
0.036050,0.017350,0.183200,0.763400
0.036000,0.017650,0.182750,0.763600
0.036450,0.016150,0.183100,0.764300
0.036350,0.016600,0.182750,0.764300
0.036200,0.016300,0.183000,0.764500
0.035550,0.017150,0.183100,0.764200
0.035100,0.017250,0.182150,0.765500
0.034800,0.016750,0.181700,0.766750
0.035450,0.015850,0.183050,0.765650
0.034150,0.016450,0.183000,0.766400
0.034050,0.016600,0.182750,0.766600
0.034700,0.015900,0.182400,0.767000
0.034050,0.016700,0.182200,0.767050
0.034750,0.015850,0.181950,0.767450
0.034050,0.017000,0.181600,0.767350
0.034150,0.017650,0.180950,0.767250
0.034500,0.017250,0.180400,0.767850
0.034750,0.017050,0.179850,0.768350
0.034750,0.016700,0.179800,0.768750
0.034150,0.016900,0.179600,0.769350
0.036050,0.015000,0.180550,0.768400
0.035350,0.015650,0.180700,0.768300
0.035350,0.015500,0.180650,0.768500
0.035000,0.015900,0.180500,0.768600
0.034200,0.015950,0.181500,0.768350
0.032850,0.016500,0.181650,0.769000
0.032700,0.017300,0.181850,0.768150
0.033450,0.016600,0.182950,0.767000
0.033050,0.016550,0.182500,0.767900
0.031850,0.017050,0.182700,0.768400
0.031650,0.016200,0.183600,0.768550
0.032850,0.015400,0.184250,0.767500
0.033050,0.016050,0.183150,0.767750
0.032450,0.015800,0.183250,0.768500
0.032650,0.016600,0.183000,0.767750
0.032700,0.016950,0.182600,0.767750
0.032450,0.018100,0.181450,0.768000
0.033200,0.017750,0.180550,0.768500
0.033500,0.016700,0.181550,0.768250
0.033450,0.016850,0.180500,0.769200
0.034350,0.015900,0.180950,0.768800
0.034650,0.016100,0.180600,0.768650
0.035000,0.016450,0.180750,0.767800
0.035900,0.015900,0.180350,0.767850
0.035850,0.016450,0.179900,0.767800
0.035450,0.016750,0.180050,0.767750
0.035950,0.017600,0.178550,0.767900
0.036250,0.017100,0.179100,0.767550
0.036700,0.017200,0.178850,0.767250
0.038100,0.017050,0.177800,0.767050
0.037100,0.017250,0.178800,0.766850
0.035900,0.018100,0.179750,0.766250
0.037550,0.017950,0.178550,0.765950
0.037350,0.017500,0.178450,0.766700
0.035900,0.017650,0.179350,0.767100
0.036400,0.016600,0.180700,0.766300
0.035600,0.017200,0.180350,0.766850
0.035800,0.017050,0.180700,0.766450
0.035300,0.018150,0.179200,0.767350
0.035650,0.017100,0.179800,0.767450
0.035650,0.017600,0.179200,0.767550
0.035650,0.018150,0.177800,0.768400
0.036350,0.017700,0.177400,0.768550
0.036800,0.017350,0.176650,0.769200
0.036500,0.016850,0.177000,0.769650
0.035850,0.016800,0.176250,0.771100
0.035700,0.016400,0.176450,0.771450
0.035800,0.016950,0.176000,0.771250
0.035150,0.017450,0.176100,0.771300
0.035300,0.017250,0.175200,0.772250
0.035500,0.016300,0.174950,0.773250
0.036150,0.015450,0.175550,0.772850
0.035350,0.016300,0.176150,0.772200
0.034850,0.016950,0.175800,0.772400
0.035550,0.016150,0.176700,0.771600
0.033700,0.017350,0.175950,0.773000
0.033750,0.017400,0.176200,0.772650
0.034550,0.016950,0.176500,0.772000
0.034100,0.017650,0.175900,0.772350
0.034700,0.017000,0.176400,0.771900
0.036250,0.015400,0.177100,0.771250
0.035250,0.016100,0.176600,0.772050
0.035800,0.016000,0.177150,0.771050
0.035900,0.016000,0.177950,0.770150
0.035550,0.015700,0.178100,0.770650
0.034550,0.017050,0.178450,0.769950
0.034450,0.016800,0.178200,0.770550
0.034200,0.017800,0.178350,0.769650
0.033450,0.018050,0.178800,0.769700
0.033700,0.017600,0.179300,0.769400
0.033850,0.018050,0.179850,0.768250
0.035200,0.016650,0.180000,0.768150
0.034300,0.017300,0.179950,0.768450
0.034150,0.016500,0.181000,0.768350
0.034250,0.016700,0.180850,0.768200
0.034550,0.016300,0.180750,0.768400
0.034500,0.017350,0.179000,0.769150
0.035450,0.016300,0.179900,0.768350
0.035200,0.016250,0.180550,0.768000
0.035900,0.016800,0.180350,0.766950
0.035500,0.017200,0.180700,0.766600
0.035100,0.018150,0.180300,0.766450
0.036350,0.017500,0.180050,0.766100
0.036450,0.017250,0.180200,0.766100
0.036650,0.017600,0.179750,0.766000
0.035550,0.018650,0.180250,0.765550
0.035000,0.019250,0.180600,0.765150
0.037000,0.017750,0.180900,0.764350
0.037150,0.017750,0.180650,0.764450
0.036100,0.018550,0.178650,0.766700
0.036900,0.018150,0.177950,0.767000
0.037200,0.016800,0.178050,0.767950
0.036350,0.017100,0.177750,0.768800
0.036450,0.016550,0.178550,0.768450
0.037250,0.016150,0.179750,0.766850
0.037000,0.016400,0.179750,0.766850
0.037500,0.017300,0.178800,0.766400
0.038200,0.017450,0.179100,0.765250
0.037500,0.017450,0.179800,0.765250
0.036300,0.017850,0.179100,0.766750
0.036100,0.017850,0.179650,0.766400
0.035750,0.016600,0.180200,0.767450
0.035650,0.017200,0.180150,0.767000
0.036700,0.016450,0.180250,0.766600
0.035750,0.017450,0.179700,0.767100
0.035150,0.017900,0.180000,0.766950
0.036000,0.016900,0.180350,0.766750
0.036050,0.016300,0.181250,0.766400
0.034750,0.017700,0.182050,0.765500
0.035950,0.016950,0.182050,0.765050
0.036350,0.016350,0.182500,0.764800
0.036350,0.016550,0.182050,0.765050
0.036850,0.016750,0.181050,0.765350
0.037250,0.016100,0.181600,0.765050
0.037850,0.014750,0.182200,0.765200
0.037300,0.015700,0.182050,0.764950
0.036950,0.015750,0.182250,0.765050
0.037150,0.016900,0.181300,0.764650
0.034400,0.017550,0.181700,0.766350
0.035450,0.016150,0.182600,0.765800
0.035200,0.017150,0.182550,0.765100
0.035950,0.016800,0.182750,0.764500
0.034950,0.017450,0.182950,0.764650
0.035350,0.017600,0.182750,0.764300
0.034900,0.017250,0.183500,0.764350
0.034300,0.017550,0.183250,0.764900
0.035000,0.016900,0.182950,0.765150
0.035050,0.017400,0.182350,0.765200
0.033450,0.017450,0.182900,0.766200
0.033750,0.017850,0.182200,0.766200
0.034300,0.017850,0.182400,0.765450
0.035050,0.018150,0.181450,0.765350
0.035450,0.017800,0.182150,0.764600
0.035800,0.017050,0.182000,0.765150
0.036650,0.017100,0.181600,0.764650
0.035350,0.017100,0.181800,0.765750
0.036000,0.015950,0.181500,0.766550
0.035800,0.016050,0.182350,0.765800
0.036050,0.016850,0.181850,0.765250
0.037000,0.016350,0.181450,0.765200
0.035600,0.016450,0.182150,0.765800
0.035000,0.016700,0.182750,0.765550
0.035350,0.017300,0.181850,0.765500
0.035300,0.016350,0.183700,0.764650
0.034800,0.017500,0.183150,0.764550
0.035250,0.017650,0.183200,0.763900
0.035550,0.018000,0.182200,0.764250
0.035450,0.018500,0.179900,0.766150
0.036400,0.018050,0.179750,0.765800
0.036700,0.017150,0.180850,0.765300
0.037350,0.017350,0.180450,0.764850
0.036900,0.017900,0.179400,0.765800
0.035950,0.017650,0.180150,0.766250
0.036300,0.018050,0.180000,0.765650
0.036400,0.018150,0.179500,0.765950
0.036550,0.017600,0.179650,0.766200
0.037400,0.018100,0.179500,0.765000
0.037700,0.017550,0.180300,0.764450
0.036800,0.017800,0.179550,0.765850
0.036700,0.018500,0.178900,0.765900
0.037100,0.018600,0.177900,0.766400
0.034900,0.019250,0.178300,0.767550
0.035300,0.019000,0.178300,0.767400
0.036600,0.019150,0.177600,0.766650
0.036000,0.020000,0.177850,0.766150
0.035900,0.019200,0.178350,0.766550
0.036800,0.018350,0.178150,0.766700
0.037350,0.017250,0.179750,0.765650
0.037300,0.017150,0.180050,0.765500
0.037250,0.018300,0.179200,0.765250
0.037150,0.017950,0.180150,0.764750
0.036550,0.018150,0.180550,0.764750
0.036200,0.017350,0.181200,0.765250
0.036550,0.018000,0.180450,0.765000
0.037900,0.017950,0.178750,0.765400
0.037700,0.017900,0.179800,0.764600
0.037500,0.018050,0.179200,0.765250
0.037400,0.019250,0.177900,0.765450
0.037900,0.019000,0.177050,0.766050
0.037600,0.019150,0.176800,0.766450
0.037550,0.019350,0.175850,0.767250
0.038950,0.018000,0.175800,0.767250
0.039350,0.018100,0.174650,0.767900
0.038950,0.018400,0.174200,0.768450
0.038950,0.017800,0.174850,0.768400
0.038950,0.018150,0.174450,0.768450
0.038600,0.018100,0.174650,0.768650
0.038550,0.018350,0.173600,0.769500
0.037800,0.018000,0.172950,0.771250
0.038100,0.017950,0.172050,0.771900
0.040100,0.016450,0.171900,0.771550
0.039350,0.016800,0.172650,0.771200
0.038600,0.016550,0.172850,0.772000
0.039200,0.015700,0.173000,0.772100
0.038350,0.016550,0.172700,0.772400
0.037250,0.016850,0.174350,0.771550
0.036700,0.017150,0.173800,0.772350
0.036950,0.016900,0.173900,0.772250
0.035700,0.017250,0.173250,0.773800
0.035000,0.016900,0.172900,0.775200
0.035000,0.016750,0.173250,0.775000
0.034850,0.016800,0.172600,0.775750
0.034900,0.016650,0.173350,0.775100
0.034350,0.016400,0.173600,0.775650
0.035300,0.015400,0.174300,0.775000
0.034300,0.015550,0.174250,0.775900
0.034050,0.015450,0.174550,0.775950
0.034100,0.015050,0.175450,0.775400
0.033000,0.016300,0.175350,0.775350
0.033700,0.015250,0.176650,0.774400
0.032900,0.016300,0.177350,0.773450
0.032850,0.015800,0.177700,0.773650
0.033600,0.014700,0.177950,0.773750
0.032950,0.015200,0.179150,0.772700
0.032400,0.016250,0.179550,0.771800
0.033150,0.016600,0.178250,0.772000
0.033100,0.015850,0.178450,0.772600
0.032000,0.017050,0.178200,0.772750
0.032500,0.016850,0.178900,0.771750
0.032750,0.018000,0.178400,0.770850
0.033350,0.017900,0.177900,0.770850
0.035300,0.017050,0.178150,0.769500
0.034900,0.016800,0.177800,0.770500
0.034850,0.017350,0.177300,0.770500
0.033950,0.017800,0.177350,0.770900
0.034550,0.016950,0.176650,0.771850
0.034550,0.016750,0.177300,0.771400
0.034650,0.015050,0.177950,0.772350
0.033250,0.015600,0.178000,0.773150
0.033200,0.016200,0.176850,0.773750
0.033400,0.015450,0.177200,0.773950
0.033550,0.016150,0.177250,0.773050
0.033050,0.016300,0.177750,0.772900
0.033450,0.016100,0.178650,0.771800
0.033200,0.016700,0.179300,0.770800
0.033950,0.016700,0.178650,0.770700
0.033650,0.015650,0.180400,0.770300
0.033600,0.016600,0.179500,0.770300
0.034600,0.016400,0.179750,0.769250
0.034200,0.016500,0.179700,0.769600
0.034000,0.016750,0.179200,0.770050
0.035800,0.016200,0.178150,0.769850
0.034650,0.016650,0.178250,0.770450
0.035100,0.015400,0.178200,0.771300
0.035450,0.015000,0.178350,0.771200
0.034750,0.015850,0.178150,0.771250
0.034400,0.016050,0.177050,0.772500
0.033650,0.016300,0.176300,0.773750
0.033500,0.016100,0.176700,0.773700
0.032500,0.016850,0.177500,0.773150
0.032500,0.016300,0.178400,0.772800
0.032200,0.016800,0.177700,0.773300
0.033350,0.016000,0.177700,0.772950
0.033000,0.016750,0.177150,0.773100
