I,E,S,R
0.001000,0.000750,0.998250,0.000000
0.000900,0.001200,0.997650,0.000250
0.000800,0.001500,0.997200,0.000500
0.001150,0.001750,0.996400,0.000700
0.001500,0.002550,0.995100,0.000850
0.002250,0.002900,0.993800,0.001050
0.002650,0.003800,0.992250,0.001300
0.003300,0.005600,0.989550,0.001550
0.004450,0.007750,0.985800,0.002000
0.005850,0.009500,0.982000,0.002650
0.007650,0.011700,0.977100,0.003550
0.009750,0.015650,0.970050,0.004550
0.013900,0.020350,0.960450,0.005300
0.018350,0.026750,0.947950,0.006950
0.023600,0.036850,0.929850,0.009700
0.029800,0.047150,0.910550,0.012500
0.039000,0.059550,0.884750,0.016700
0.051000,0.074750,0.852750,0.021500
0.064250,0.091700,0.816700,0.027350
0.080750,0.108400,0.774750,0.036100
0.102600,0.135400,0.715550,0.046450
0.127050,0.159250,0.653150,0.060550
0.155350,0.183300,0.584600,0.076750
0.183400,0.208100,0.510450,0.098050
0.215800,0.223900,0.436950,0.123350
0.251200,0.231800,0.364550,0.152450
0.283250,0.235150,0.295150,0.186450
0.309350,0.230900,0.234500,0.225250
0.332400,0.216350,0.184050,0.267200
0.349650,0.199900,0.141100,0.309350
0.360700,0.177500,0.107650,0.354150
0.362700,0.152400,0.082500,0.402400
0.359500,0.128300,0.063400,0.448800
0.352450,0.106150,0.050350,0.491050
0.334800,0.087600,0.040850,0.536750
0.317150,0.070050,0.033550,0.579250
0.294100,0.058300,0.028250,0.619350
0.272100,0.045900,0.024700,0.657300
0.248850,0.038800,0.021600,0.690750
0.227250,0.030600,0.021450,0.720700
0.204600,0.024800,0.020600,0.750000
0.183950,0.020250,0.020650,0.775150
0.163400,0.017350,0.020350,0.798900
0.147900,0.013400,0.021250,0.817450
0.132700,0.011500,0.023000,0.832800
0.119800,0.009100,0.024100,0.847000
0.103650,0.008500,0.025600,0.862250
0.092200,0.007450,0.027100,0.873250
0.081200,0.006700,0.028550,0.883550
0.072100,0.006450,0.029900,0.891550
0.063600,0.005650,0.032050,0.898700
0.056100,0.005100,0.034400,0.904400
0.050550,0.004750,0.036250,0.908450
0.044150,0.004700,0.039100,0.912050
0.038400,0.005600,0.040600,0.915400
0.035200,0.004350,0.043400,0.917050
0.031900,0.004350,0.045150,0.918600
0.029200,0.003600,0.047250,0.919950
0.026650,0.003450,0.049600,0.920300
0.024550,0.003050,0.052600,0.919800
0.021550,0.003600,0.054550,0.920300
0.020000,0.002950,0.057450,0.919600
0.017650,0.002600,0.060200,0.919550
0.016400,0.002750,0.062400,0.918450
0.014100,0.002850,0.065000,0.918050
0.013100,0.002600,0.067950,0.916350
0.011500,0.002900,0.069400,0.916200
0.010000,0.002350,0.072900,0.914750
0.009350,0.001700,0.075650,0.913300
0.008350,0.001650,0.078450,0.911550
0.007500,0.001600,0.081550,0.909350
0.006500,0.001850,0.084250,0.907400
0.006150,0.001450,0.087000,0.905400
0.005550,0.001400,0.089300,0.903750
0.005200,0.001200,0.093200,0.900400
0.005050,0.001000,0.095500,0.898450
0.004400,0.000950,0.097750,0.896900
0.004200,0.001050,0.100400,0.894350
0.003850,0.000800,0.103350,0.892000
0.003300,0.000900,0.106100,0.889700
0.002850,0.000950,0.108950,0.887250
0.002800,0.000950,0.112600,0.883650
0.002600,0.000800,0.115850,0.880750
0.002450,0.000950,0.118500,0.878100
0.002200,0.000950,0.122000,0.874850
0.002000,0.000900,0.124650,0.872450
0.002200,0.000600,0.127350,0.869850
0.001650,0.000600,0.130050,0.867700
0.001350,0.000450,0.133500,0.864700
0.001250,0.000400,0.135600,0.862750
0.001150,0.000250,0.138600,0.860000
0.000900,0.000400,0.141300,0.857400
0.000800,0.000350,0.143900,0.854950
0.000750,0.000400,0.145650,0.853200
0.000900,0.000300,0.147800,0.851000
0.000750,0.000150,0.150650,0.848450
0.000700,0.000250,0.153300,0.845750
0.000800,0.000250,0.155700,0.843250
0.000850,0.000350,0.157700,0.841100
0.000900,0.000450,0.160150,0.838500
0.000950,0.000350,0.163300,0.835400
0.001000,0.000300,0.165950,0.832750
0.000900,0.000400,0.168700,0.830000
0.001000,0.000250,0.171000,0.827750
0.000900,0.000350,0.173350,0.825400
0.000750,0.000400,0.176200,0.822650
0.000600,0.000400,0.178750,0.820250
0.000600,0.000450,0.181200,0.817750
0.000650,0.000350,0.183600,0.815400
0.000800,0.000350,0.185650,0.813200
0.000750,0.000400,0.187850,0.811000
0.000850,0.000350,0.190550,0.808250
0.001000,0.000350,0.193150,0.805500
0.000950,0.000350,0.195150,0.803550
0.000800,0.000250,0.198100,0.800850
0.000750,0.000250,0.200000,0.799000
0.000800,0.000350,0.201900,0.796950
0.000700,0.000450,0.204350,0.794500
0.000800,0.000450,0.206600,0.792150
0.000850,0.000450,0.208850,0.789850
0.000800,0.000450,0.211300,0.787450
0.000700,0.000450,0.213800,0.785050
0.000700,0.000350,0.215700,0.783250
0.000650,0.000300,0.217700,0.781350
0.000700,0.000150,0.220250,0.778900
0.000650,0.000300,0.222600,0.776450
0.000700,0.000250,0.224650,0.774400
0.000750,0.000400,0.226650,0.772200
0.000750,0.000400,0.228900,0.769950
0.000800,0.000400,0.230850,0.767950
0.000850,0.000350,0.233050,0.765750
0.000900,0.000400,0.235000,0.763700
0.000950,0.000350,0.237250,0.761450
0.000800,0.000500,0.239400,0.759300
0.000750,0.000500,0.240900,0.757850
0.000700,0.000450,0.243350,0.755500
0.000800,0.000350,0.245650,0.753200
0.000850,0.000500,0.247600,0.751050
0.000950,0.000300,0.249200,0.749550
0.000850,0.000300,0.251150,0.747700
0.000950,0.000250,0.252450,0.746350
0.000900,0.000350,0.254300,0.744450
0.000850,0.000600,0.256050,0.742500
0.000850,0.000500,0.258200,0.740450
0.000900,0.000300,0.259950,0.738850
0.000900,0.000400,0.261550,0.737150
0.000900,0.000450,0.263250,0.735400
0.000800,0.000550,0.265900,0.732750
0.000950,0.000650,0.267950,0.730450
0.001100,0.000400,0.270600,0.727900
0.001150,0.000600,0.272100,0.726150
0.001200,0.000850,0.273750,0.724200
0.001300,0.000900,0.276050,0.721750
0.001400,0.000950,0.278050,0.719600
0.001450,0.000950,0.279800,0.717800
0.001350,0.001300,0.281450,0.715900
0.001250,0.001350,0.282800,0.714600
0.001500,0.001550,0.283850,0.713100
0.001950,0.001050,0.285500,0.711500
0.002000,0.001200,0.287500,0.709300
0.002300,0.001400,0.289050,0.707250
0.002400,0.001600,0.290000,0.706000
0.002300,0.001950,0.291050,0.704700
0.002550,0.002000,0.292150,0.703300
0.002650,0.002200,0.293300,0.701850
0.003100,0.001800,0.294500,0.700600
0.003050,0.002000,0.296050,0.698900
0.003050,0.002400,0.297600,0.696950
0.003450,0.002450,0.298850,0.695250
0.003600,0.002400,0.300200,0.693800
0.003800,0.002750,0.300700,0.692750
0.003750,0.002700,0.302100,0.691450
0.003600,0.002850,0.302650,0.690900
0.004000,0.002800,0.304200,0.689000
0.004050,0.003050,0.304950,0.687950
0.004350,0.002900,0.305950,0.686800
0.004500,0.003250,0.306500,0.685750
0.004700,0.003300,0.307200,0.684800
0.005000,0.004200,0.307200,0.683600
0.005450,0.003900,0.308100,0.682550
0.005750,0.003850,0.308650,0.681750
0.005850,0.003850,0.308750,0.681550
0.006100,0.003900,0.309650,0.680350
0.005950,0.004350,0.310500,0.679200
0.006800,0.004500,0.310600,0.678100
0.007050,0.005150,0.310150,0.677650
0.007600,0.005000,0.310650,0.676750
0.007850,0.006050,0.309500,0.676600
0.008300,0.006350,0.309600,0.675750
0.009500,0.006550,0.309400,0.674550
0.010300,0.007200,0.308300,0.674200
0.011300,0.007950,0.307300,0.673450
0.012650,0.008550,0.305900,0.672900
0.013550,0.009600,0.305050,0.671800
0.014850,0.010150,0.303550,0.671450
0.015400,0.010800,0.301950,0.671850
0.015500,0.011900,0.300600,0.672000
0.016700,0.011600,0.299650,0.672050
0.017650,0.012150,0.297600,0.672600
0.017950,0.013650,0.294650,0.673750
0.019600,0.013800,0.292300,0.674300
0.020250,0.014900,0.289450,0.675400
0.021950,0.015950,0.286400,0.675700
0.023550,0.016450,0.283050,0.676950
0.025700,0.015950,0.281000,0.677350
0.026650,0.016850,0.277750,0.678750
0.028700,0.018400,0.274000,0.678900
0.030250,0.019600,0.269500,0.680650
0.031400,0.020700,0.264500,0.683400
0.032600,0.021850,0.259950,0.685600
0.034800,0.021900,0.255800,0.687500
0.036600,0.022750,0.251650,0.689000
0.038600,0.023850,0.246100,0.691450
0.040700,0.023900,0.240900,0.694500
0.041050,0.024900,0.236450,0.697600
0.042750,0.026200,0.230500,0.700550
0.045250,0.025650,0.224800,0.704300
0.046450,0.026300,0.219200,0.708050
0.048700,0.027000,0.214250,0.710050
0.050100,0.028000,0.208300,0.713600
0.049150,0.028850,0.203000,0.719000
0.050200,0.028600,0.198100,0.723100
0.050550,0.027700,0.193650,0.728100
0.051500,0.027750,0.187850,0.732900
0.051800,0.027450,0.183100,0.737650
0.052300,0.026350,0.180350,0.741000
0.052700,0.026000,0.176350,0.744950
0.053150,0.026400,0.171250,0.749200
0.053450,0.026500,0.167400,0.752650
0.054050,0.026150,0.163650,0.756150
0.053500,0.026300,0.160350,0.759850
0.053450,0.024950,0.157450,0.764150
0.054400,0.024050,0.154800,0.766750
0.054200,0.023800,0.151000,0.771000
0.052150,0.022950,0.149550,0.775350
0.051400,0.021500,0.147800,0.779300
0.050850,0.020800,0.145900,0.782450
0.049250,0.022300,0.142500,0.785950
0.050150,0.021000,0.140350,0.788500
0.049200,0.019950,0.138750,0.792100
0.048400,0.019500,0.136900,0.795200
0.048000,0.018600,0.135750,0.797650
0.046200,0.018200,0.134500,0.801100
0.044400,0.016950,0.134150,0.804500
0.043600,0.015850,0.133450,0.807100
0.043350,0.015150,0.133200,0.808300
0.042000,0.014500,0.133700,0.809800
0.039950,0.014450,0.134050,0.811550
0.039200,0.014450,0.133450,0.812900
0.037700,0.015100,0.133300,0.813900
0.036150,0.014500,0.132950,0.816400
0.035950,0.014100,0.132900,0.817050
0.034800,0.013500,0.133600,0.818100
0.033700,0.012650,0.134700,0.818950
0.033050,0.013300,0.135450,0.818200
0.032250,0.013100,0.135650,0.819000
0.030900,0.012300,0.135950,0.820850
0.029650,0.012400,0.136850,0.821100
0.028400,0.012350,0.138400,0.820850
0.026950,0.012150,0.139000,0.821900
0.027050,0.010900,0.140800,0.821250
0.026250,0.011650,0.141850,0.820250
0.025900,0.010250,0.144650,0.819200
0.025850,0.010050,0.145750,0.818350
0.025100,0.009850,0.147400,0.817650
0.024750,0.010100,0.147950,0.817200
0.023550,0.010150,0.149750,0.816550
0.023250,0.010300,0.150800,0.815650
0.023200,0.009700,0.152150,0.814950
0.022700,0.009500,0.154350,0.813450
0.022150,0.009200,0.156000,0.812650
0.021750,0.009000,0.157050,0.812200
0.021000,0.009500,0.160150,0.809350
0.020250,0.009900,0.161600,0.808250
0.020200,0.009600,0.164050,0.806150
0.020200,0.009550,0.165950,0.804300
0.019300,0.009950,0.167400,0.803350
0.019450,0.009700,0.169050,0.801800
0.019400,0.008700,0.171200,0.800700
0.018600,0.009200,0.172450,0.799750
0.019100,0.009750,0.173650,0.797500
0.019000,0.009800,0.175100,0.796100
0.019250,0.009900,0.177450,0.793400
0.018850,0.010100,0.179200,0.791850
0.019100,0.010050,0.180700,0.790150
0.019250,0.009100,0.183050,0.788600
0.019600,0.008750,0.184800,0.786850
0.019150,0.009600,0.185450,0.785800
0.019350,0.009750,0.186700,0.784200
0.019950,0.010600,0.187450,0.782000
0.020250,0.010600,0.188500,0.780650
0.020000,0.011750,0.189250,0.779000
0.019900,0.010900,0.191600,0.777600
0.020500,0.011000,0.192950,0.775550
0.020800,0.011000,0.194400,0.773800
0.021550,0.011650,0.194350,0.772450
0.022100,0.011100,0.196650,0.770150
0.023400,0.011150,0.196800,0.768650
0.022600,0.011650,0.197400,0.768350
0.022650,0.011300,0.199200,0.766850
0.022550,0.012250,0.199750,0.765450
0.023200,0.013050,0.200250,0.763500
0.024450,0.012850,0.200900,0.761800
0.023250,0.014000,0.201100,0.761650
0.024250,0.014100,0.202150,0.759500
0.024250,0.014550,0.202850,0.758350
0.025050,0.014900,0.202000,0.758050
0.024800,0.015100,0.202200,0.757900
0.026000,0.014100,0.203900,0.756000
0.025600,0.013500,0.206100,0.754800
0.025100,0.014600,0.205650,0.754650
0.025050,0.015400,0.205450,0.754100
0.025500,0.014400,0.206050,0.754050
0.026050,0.013750,0.207050,0.753150
0.026750,0.014000,0.207200,0.752050
0.028150,0.013100,0.207300,0.751450
0.027600,0.014550,0.206500,0.751350
0.028000,0.014950,0.206900,0.750150
0.027950,0.015400,0.206350,0.750300
0.027450,0.015100,0.207100,0.750350
0.028150,0.015000,0.207900,0.748950
0.029600,0.015000,0.207500,0.747900
0.030100,0.015550,0.207500,0.746850
0.030250,0.015450,0.207750,0.746550
0.030600,0.016000,0.207450,0.745950
0.031100,0.015900,0.205900,0.747100
0.031600,0.015650,0.204950,0.747800
0.031800,0.015800,0.204000,0.748400
0.032300,0.016050,0.202900,0.748750
0.031400,0.017550,0.201500,0.749550
0.031450,0.017400,0.200400,0.750750
0.032800,0.017450,0.199350,0.750400
0.033250,0.016900,0.198650,0.751200
0.033250,0.018400,0.197000,0.751350
0.033200,0.018400,0.196900,0.751500
0.033150,0.017600,0.196050,0.753200
0.033150,0.018050,0.195550,0.753250
0.033150,0.018200,0.194750,0.753900
0.034000,0.018350,0.193800,0.753850
0.035200,0.019050,0.193050,0.752700
0.036000,0.018150,0.192450,0.753400
0.037100,0.017100,0.192750,0.753050
0.037050,0.018150,0.191550,0.753250
0.037150,0.017000,0.192500,0.753350
0.036950,0.018200,0.191900,0.752950
0.036900,0.018350,0.191550,0.753200
0.036500,0.018450,0.191500,0.753550
0.036300,0.020000,0.189350,0.754350
0.037550,0.018900,0.190100,0.753450
0.038500,0.018450,0.189850,0.753200
0.038450,0.018550,0.188900,0.754100
0.038350,0.018800,0.187750,0.755100
0.039650,0.019200,0.186250,0.754900
0.040450,0.018900,0.184950,0.755700
0.040300,0.019250,0.183550,0.756900
0.039500,0.019600,0.181900,0.759000
0.039450,0.019450,0.181500,0.759600
0.039650,0.018750,0.181800,0.759800
0.039050,0.018450,0.182100,0.760400
0.039650,0.018550,0.181850,0.759950
0.039950,0.018850,0.180950,0.760250
0.040100,0.018900,0.181250,0.759750
0.039450,0.018800,0.180350,0.761400
0.039700,0.018150,0.179150,0.763000
0.040250,0.017550,0.178400,0.763800
0.038850,0.018050,0.178650,0.764450
0.037750,0.018750,0.177850,0.765650
0.038900,0.018000,0.177250,0.765850
0.038500,0.018950,0.175900,0.766650
0.038650,0.018300,0.175450,0.767600
0.039600,0.017350,0.176100,0.766950
0.039250,0.018100,0.175150,0.767500
0.039100,0.018950,0.174550,0.767400
0.040100,0.017250,0.174700,0.767950
0.039150,0.018600,0.174200,0.768050
0.038500,0.018900,0.174950,0.767650
0.038250,0.017600,0.175150,0.769000
0.037900,0.017450,0.175000,0.769650
0.038450,0.017250,0.175000,0.769300
0.038600,0.016500,0.174650,0.770250
0.038200,0.016750,0.174850,0.770200
0.038450,0.015850,0.176450,0.769250
0.038050,0.016850,0.175000,0.770100
0.037950,0.017500,0.173600,0.770950
0.037400,0.018250,0.172700,0.771650
0.037700,0.017500,0.172450,0.772350
0.038800,0.016600,0.172850,0.771750
0.039000,0.016650,0.172750,0.771600
0.037100,0.018450,0.172400,0.772050
0.037800,0.018900,0.171500,0.771800
0.037750,0.018450,0.171750,0.772050
0.036900,0.018550,0.172750,0.771800
0.037200,0.017650,0.173150,0.772000
0.037350,0.016550,0.175250,0.770850
0.036700,0.016300,0.175050,0.771950
0.036950,0.016800,0.175550,0.770700
0.037200,0.017150,0.175150,0.770500
0.035450,0.016950,0.176300,0.771300
0.035250,0.016800,0.176650,0.771300
0.034150,0.016400,0.177550,0.771900
0.034800,0.015800,0.178700,0.770700
0.034400,0.017150,0.178550,0.769900
0.034700,0.016750,0.179200,0.769350
0.034750,0.016800,0.179950,0.768500
0.034600,0.016200,0.180750,0.768450
0.033900,0.016450,0.181050,0.768600
0.033550,0.015450,0.182550,0.768450
0.033300,0.016050,0.182050,0.768600
0.032750,0.016050,0.183200,0.768000
0.032450,0.016450,0.183650,0.767450
0.033150,0.016350,0.182900,0.767600
0.032700,0.015850,0.184550,0.766900
0.032300,0.016350,0.185350,0.766000
0.031850,0.016000,0.186700,0.765450
0.031750,0.015450,0.187250,0.765550
0.031750,0.015600,0.187150,0.765500
0.031250,0.016650,0.186850,0.765250
0.032200,0.016950,0.185950,0.764900
0.032450,0.015800,0.187300,0.764450
0.031700,0.015600,0.187000,0.765700
0.031750,0.015900,0.187350,0.765000
0.032600,0.016050,0.187700,0.763650
0.032250,0.015900,0.188950,0.762900
0.031150,0.016000,0.189900,0.762950
0.031950,0.015650,0.190300,0.762100
0.032900,0.015900,0.190350,0.760850
0.032600,0.016450,0.190800,0.760150
0.033600,0.015500,0.192600,0.758300
0.034000,0.016400,0.192100,0.757500
0.034000,0.016950,0.192000,0.757050
0.034150,0.016950,0.191950,0.756950
0.034850,0.017300,0.191800,0.756050
0.036250,0.015850,0.192150,0.755750
0.034700,0.016150,0.192850,0.756300
0.035600,0.016450,0.191750,0.756200
0.034850,0.017600,0.190850,0.756700
0.035600,0.018150,0.190350,0.755900
0.036550,0.018500,0.191050,0.753900
0.037300,0.017600,0.191050,0.754050
0.036600,0.018300,0.190050,0.755050
0.035800,0.018650,0.190700,0.754850
0.035850,0.018450,0.190500,0.755200
0.035550,0.018600,0.190050,0.755800
0.034800,0.018000,0.189700,0.757500
0.035200,0.018200,0.189600,0.757000
0.035600,0.018700,0.189050,0.756650
0.035650,0.018450,0.188350,0.757550
0.035500,0.017050,0.189300,0.758150
0.034250,0.017350,0.188650,0.759750
0.034500,0.019000,0.187400,0.759100
0.035550,0.018500,0.187350,0.758600
0.035250,0.017900,0.187950,0.758900
0.034950,0.018650,0.187850,0.758550
0.035500,0.018250,0.187950,0.758300
0.037350,0.017350,0.188250,0.757050
0.036550,0.017650,0.188750,0.757050
0.037900,0.018150,0.187050,0.756900
0.037800,0.019050,0.185850,0.757300
0.038100,0.019750,0.185150,0.757000
0.038700,0.019200,0.185450,0.756650
0.039000,0.018750,0.184600,0.757650
0.038100,0.019750,0.182750,0.759400
0.039100,0.018500,0.183000,0.759400
0.039300,0.019700,0.181450,0.759550
0.039300,0.019400,0.181100,0.760200
0.038700,0.020000,0.179900,0.761400
0.038000,0.019550,0.179850,0.762600
0.038150,0.018850,0.179700,0.763300
0.038300,0.019050,0.178650,0.764000
0.039300,0.017900,0.177500,0.765300
0.038000,0.017850,0.177400,0.766750
0.037900,0.018200,0.176500,0.767400
0.038750,0.016650,0.177350,0.767250
0.037750,0.017150,0.177050,0.768050
0.037400,0.017050,0.178250,0.767300
0.037000,0.018050,0.177550,0.767400
0.037450,0.017400,0.176350,0.768800
0.035000,0.018550,0.176150,0.770300
0.036100,0.019050,0.176000,0.768850
0.036150,0.017550,0.177350,0.768950
0.036100,0.018050,0.176950,0.768900
0.035800,0.017050,0.177950,0.769200
0.035650,0.016600,0.177450,0.770300
0.035250,0.016350,0.177450,0.770950
0.035150,0.016550,0.177100,0.771200
0.034150,0.016450,0.177650,0.771750
0.034850,0.015950,0.178550,0.770650
0.033850,0.017050,0.178000,0.771100
0.034050,0.016550,0.178350,0.771050
0.034850,0.015850,0.177850,0.771450
0.035500,0.015550,0.177350,0.771600
0.035500,0.015850,0.177650,0.771000
0.035900,0.015000,0.178100,0.771000
0.036350,0.014900,0.178450,0.770300
0.035500,0.015000,0.179300,0.770200
0.034900,0.015600,0.179600,0.769900
0.034400,0.015400,0.180000,0.770200
0.034300,0.014600,0.180500,0.770600
0.032900,0.016200,0.179150,0.771750
0.032450,0.016000,0.179550,0.772000
0.032750,0.015900,0.179650,0.771700
0.032250,0.015550,0.179850,0.772350
0.031400,0.015800,0.179800,0.773000
0.032850,0.016100,0.179350,0.771700
0.032800,0.016150,0.180000,0.771050
0.032000,0.016400,0.179400,0.772200
0.032150,0.015350,0.180000,0.772500
0.032250,0.015450,0.180850,0.771450
0.031150,0.015650,0.182800,0.770400
0.030950,0.015450,0.183650,0.769950
0.031100,0.015000,0.183950,0.769950
0.031150,0.015050,0.184250,0.769550
0.031200,0.015950,0.184300,0.768550
0.032100,0.015000,0.185150,0.767750
0.032350,0.015950,0.184450,0.767250
0.031750,0.017200,0.184550,0.766500
0.032050,0.016900,0.184450,0.766600
0.032550,0.016700,0.184650,0.766100
0.033300,0.016550,0.184250,0.765900
0.033350,0.016500,0.184850,0.765300
0.034050,0.017050,0.184150,0.764750
0.035550,0.016900,0.183600,0.763950
0.034750,0.017950,0.182750,0.764550
0.033650,0.018300,0.181700,0.766350
0.032800,0.018000,0.181400,0.767800
0.034000,0.016950,0.181550,0.767500
0.035000,0.016450,0.181150,0.767400
0.034300,0.016600,0.181150,0.767950
0.034250,0.016900,0.180300,0.768550
0.034350,0.016450,0.180950,0.768250
0.033750,0.015850,0.181200,0.769200
0.033000,0.016500,0.181900,0.768600
0.033000,0.016650,0.182350,0.768000
0.032950,0.016500,0.182250,0.768300
0.033500,0.016200,0.181050,0.769250
0.033300,0.015200,0.181850,0.769650
0.033700,0.015250,0.182350,0.768700
0.033350,0.017100,0.181600,0.767950
0.034450,0.017100,0.180750,0.767700
0.035100,0.016750,0.180800,0.767350
0.036000,0.015850,0.182350,0.765800
0.036150,0.015900,0.182150,0.765800
0.035350,0.015600,0.182350,0.766700
0.035100,0.017100,0.181300,0.766500
0.033550,0.017650,0.181700,0.767100
0.033250,0.017400,0.182350,0.767000
0.033400,0.017250,0.183500,0.765850
0.034400,0.016500,0.184400,0.764700
0.035500,0.015250,0.184250,0.765000
0.034300,0.016600,0.183700,0.765400
0.034350,0.017050,0.183000,0.765600
0.033350,0.018350,0.182550,0.765750
0.033250,0.017900,0.182950,0.765900
0.035250,0.016600,0.182600,0.765550
0.035600,0.016900,0.181850,0.765650
0.035400,0.017650,0.181350,0.765600
0.036000,0.016800,0.182100,0.765100
0.036200,0.016700,0.182300,0.764800
0.035450,0.017100,0.182900,0.764550
0.035700,0.017000,0.183700,0.763600
0.035350,0.017250,0.182900,0.764500
0.034900,0.018600,0.182500,0.764000
0.034350,0.017150,0.184200,0.764300
0.034100,0.016450,0.185250,0.764200
0.035000,0.015750,0.185600,0.763650
0.035300,0.015800,0.185600,0.763300
0.034400,0.016850,0.185000,0.763750
0.033750,0.017350,0.185400,0.763500
0.034100,0.016700,0.186000,0.763200
0.033450,0.017200,0.187050,0.762300
0.033600,0.018400,0.185550,0.762450
0.033700,0.018450,0.185200,0.762650
0.035000,0.017150,0.185950,0.761900
0.034600,0.017150,0.186300,0.761950
0.034300,0.017350,0.186850,0.761500
0.035400,0.017550,0.185950,0.761100
0.036200,0.017550,0.185050,0.761200
0.036700,0.017350,0.184600,0.761350
0.035850,0.017750,0.184250,0.762150
0.036400,0.018050,0.183650,0.761900
0.036600,0.018250,0.183750,0.761400
0.037150,0.016950,0.184050,0.761850
0.037650,0.017700,0.183700,0.760950
0.036300,0.018050,0.183250,0.762400
0.036250,0.016700,0.183850,0.763200
0.036400,0.016500,0.183850,0.763250
0.036300,0.017300,0.184600,0.761800
0.036850,0.017900,0.182650,0.762600
0.037150,0.019400,0.180700,0.762750
0.036050,0.019250,0.180700,0.764000
0.036600,0.018950,0.180950,0.763500
0.036250,0.018950,0.181600,0.763200
0.036900,0.019050,0.180150,0.763900
0.037200,0.018800,0.179750,0.764250
0.037250,0.018850,0.179900,0.764000
0.037050,0.019400,0.179400,0.764150
0.037050,0.017650,0.179900,0.765400
0.037350,0.017650,0.179550,0.765450
0.037900,0.017850,0.179200,0.765050
0.037450,0.019150,0.179150,0.764250
0.037400,0.018950,0.179350,0.764300
0.037850,0.018700,0.179200,0.764250
0.036950,0.019050,0.178950,0.765050
0.037300,0.019900,0.179000,0.763800
0.038500,0.019400,0.178500,0.763600
0.039400,0.018150,0.178950,0.763500
0.037200,0.018150,0.178400,0.766250
0.037600,0.017450,0.178900,0.766050
0.036400,0.018000,0.178400,0.767200
0.036750,0.017450,0.178400,0.767400
0.036600,0.017900,0.178100,0.767400
0.036550,0.017850,0.178550,0.767050
0.036600,0.017400,0.178600,0.767400
0.037600,0.017050,0.178550,0.766800
0.036550,0.018350,0.177950,0.767150
0.038100,0.017600,0.178850,0.765450
0.038050,0.018150,0.177650,0.766150
0.037800,0.017400,0.178350,0.766450
0.036200,0.017350,0.179200,0.767250
0.035750,0.017600,0.178600,0.768050
0.036550,0.018400,0.177800,0.767250
0.036150,0.018000,0.176950,0.768900
0.035900,0.017750,0.177600,0.768750
0.034600,0.017750,0.178500,0.769150
0.034750,0.018100,0.179050,0.768100
0.035100,0.017850,0.179950,0.767100
0.035150,0.017700,0.180000,0.767150
0.034800,0.017750,0.180000,0.767450
0.035600,0.017450,0.180450,0.766500
0.035750,0.016650,0.180600,0.767000
0.036150,0.017150,0.181500,0.765200
0.035600,0.017250,0.182950,0.764200
0.035750,0.016700,0.183150,0.764400
0.034550,0.017400,0.183250,0.764800
0.036000,0.017050,0.183500,0.763450
0.036000,0.016800,0.183700,0.763500
0.035050,0.016700,0.183200,0.765050
0.035600,0.017000,0.182700,0.764700
0.035300,0.016800,0.183100,0.764800
0.035950,0.017400,0.182850,0.763800
0.035350,0.017600,0.183100,0.763950
0.035800,0.017300,0.183500,0.763400
0.036600,0.017000,0.184150,0.762250
0.036650,0.017300,0.184100,0.761950
0.036700,0.018150,0.182800,0.762350
0.037450,0.017850,0.182950,0.761750
0.036100,0.018650,0.183250,0.762000
0.036100,0.017550,0.185100,0.761250
0.036600,0.018050,0.184000,0.761350
0.036750,0.018850,0.183050,0.761350
0.036700,0.019100,0.183350,0.760850
0.037350,0.019500,0.182050,0.761100
0.037200,0.019600,0.181900,0.761300
0.037850,0.018850,0.182600,0.760700
0.038450,0.018200,0.182600,0.760750
0.038450,0.017800,0.183350,0.760400
0.037550,0.018800,0.183050,0.760600
0.037300,0.020050,0.182450,0.760200
0.037550,0.020700,0.180750,0.761000
0.038500,0.019400,0.181200,0.760900
0.038900,0.018750,0.180450,0.761900
0.038550,0.018400,0.180750,0.762300
0.038550,0.018000,0.181800,0.761650
0.038350,0.019350,0.180600,0.761700
0.038200,0.018650,0.181150,0.762000
0.037700,0.018500,0.181950,0.761850
0.037500,0.018850,0.181650,0.762000
0.038200,0.019650,0.180300,0.761850
0.038650,0.019700,0.179950,0.761700
0.039000,0.019000,0.179350,0.762650
0.039900,0.017950,0.179150,0.763000
0.039450,0.018700,0.178950,0.762900
0.039300,0.018300,0.178600,0.763800
0.040000,0.018700,0.178050,0.763250
0.040300,0.019450,0.176050,0.764200
0.040750,0.019450,0.174900,0.764900
0.040800,0.019650,0.174050,0.765500
0.040600,0.020700,0.173500,0.765200
0.040150,0.021100,0.172550,0.766200
0.040650,0.020950,0.172250,0.766150
0.040150,0.021000,0.172650,0.766200
0.041200,0.020200,0.173150,0.765450
0.041150,0.019100,0.173300,0.766450
0.040750,0.018550,0.172950,0.767750
0.040550,0.018550,0.172300,0.768600
0.040000,0.018300,0.172050,0.769650
0.039500,0.019300,0.172000,0.769200
0.039400,0.019300,0.172400,0.768900
0.040950,0.018550,0.171250,0.769250
0.041000,0.019150,0.169850,0.770000
0.040900,0.019550,0.169700,0.769850
0.040150,0.019850,0.169100,0.770900
0.040600,0.019550,0.169000,0.770850
0.040400,0.018500,0.168600,0.772500
0.040200,0.018950,0.167800,0.773050
0.040400,0.019400,0.168100,0.772100
0.040550,0.019600,0.167350,0.772500
0.040050,0.020250,0.166050,0.773650
0.040600,0.018400,0.166150,0.774850
0.040500,0.016850,0.167550,0.775100
0.039950,0.016800,0.167150,0.776100
0.038750,0.017300,0.166300,0.777650
0.038400,0.017400,0.167550,0.776650
0.037200,0.017150,0.168750,0.776900
0.037250,0.017000,0.169450,0.776300
0.037450,0.016750,0.169000,0.776800
0.037550,0.016250,0.169150,0.777050
0.037450,0.015900,0.169350,0.777300
0.036550,0.015800,0.169600,0.778050
0.035300,0.017050,0.170000,0.777650
0.034500,0.016700,0.170050,0.778750
0.034800,0.017350,0.170050,0.777800
0.036350,0.015800,0.170550,0.777300
0.036800,0.015200,0.170550,0.777450
0.036400,0.015400,0.171150,0.777050
0.034900,0.015900,0.172300,0.776900
0.034200,0.016150,0.172600,0.777050
0.035000,0.016100,0.172950,0.775950
0.034400,0.016750,0.172650,0.776200
0.033900,0.016850,0.172050,0.777200
0.034550,0.016500,0.172250,0.776700
0.033850,0.016100,0.172800,0.777250
0.034350,0.015400,0.175000,0.775250
0.034450,0.016450,0.174800,0.774300
0.034350,0.015900,0.175750,0.774000
0.035000,0.015650,0.175450,0.773900
0.035800,0.014800,0.175850,0.773550
0.034450,0.015750,0.177250,0.772550
0.035700,0.015150,0.177400,0.771750
0.035150,0.015250,0.177350,0.772250
