I,E,S,R
0.001000,0.000900,0.998100,0.000000
0.000900,0.001350,0.997400,0.000350
0.001300,0.001550,0.996700,0.000450
0.001550,0.002350,0.995450,0.000650
0.001850,0.002950,0.994200,0.001000
0.002350,0.003450,0.992950,0.001250
0.003150,0.004650,0.990600,0.001600
0.003900,0.005950,0.987950,0.002200
0.005150,0.007750,0.984350,0.002750
0.005950,0.010650,0.979850,0.003550
0.008550,0.012400,0.974750,0.004300
0.010050,0.016950,0.967250,0.005750
0.014200,0.021050,0.957850,0.006900
0.017100,0.028350,0.945050,0.009500
0.023250,0.035750,0.929400,0.011600
0.030300,0.044500,0.910500,0.014700
0.038850,0.054750,0.887800,0.018600
0.049750,0.069400,0.857400,0.023450
0.064550,0.085050,0.820800,0.029600
0.080800,0.102000,0.779000,0.038200
0.098050,0.126150,0.726900,0.048900
0.119800,0.151450,0.667250,0.061500
0.148100,0.173450,0.601400,0.077050
0.177900,0.198550,0.527500,0.096050
0.210000,0.214500,0.455400,0.120100
0.238000,0.225700,0.385500,0.150800
0.269150,0.234050,0.316650,0.180150
0.304250,0.229650,0.252300,0.213800
0.328200,0.221450,0.195650,0.254700
0.346000,0.205150,0.149250,0.299600
0.356100,0.184600,0.112300,0.347000
0.360150,0.161000,0.084000,0.394850
0.358800,0.134350,0.065400,0.441450
0.350450,0.112500,0.049750,0.487300
0.332750,0.092400,0.040050,0.534800
0.315000,0.074500,0.032500,0.578000
0.293700,0.059800,0.027050,0.619450
0.271900,0.047350,0.024550,0.656200
0.247150,0.037500,0.023000,0.692350
0.225050,0.030650,0.021300,0.723000
0.203500,0.024000,0.020950,0.751550
0.183550,0.020050,0.021150,0.775250
0.162700,0.016900,0.020650,0.799750
0.147300,0.014250,0.021050,0.817400
0.131550,0.011600,0.021250,0.835600
0.117750,0.010300,0.021000,0.850950
0.104750,0.009150,0.022150,0.863950
0.092800,0.008750,0.023300,0.875150
0.082950,0.008150,0.024900,0.884000
0.073950,0.006750,0.025750,0.893550
0.065900,0.006600,0.026600,0.900900
0.057900,0.006300,0.027950,0.907850
0.051950,0.005450,0.030650,0.911950
0.046050,0.005000,0.032050,0.916900
0.040800,0.005050,0.034200,0.919950
0.036400,0.004450,0.035950,0.923200
0.033900,0.003650,0.037350,0.925100
0.029300,0.003750,0.040100,0.926850
0.026350,0.004100,0.041700,0.927850
0.023600,0.003450,0.044100,0.928850
0.021200,0.002900,0.046350,0.929550
0.018850,0.003000,0.049150,0.929000
0.017100,0.002650,0.051700,0.928550
0.015450,0.002450,0.054500,0.927600
0.013050,0.002200,0.057450,0.927300
0.012000,0.001950,0.060500,0.925550
0.011450,0.001550,0.063850,0.923150
0.010150,0.001500,0.067050,0.921300
0.009050,0.001850,0.069350,0.919750
0.008250,0.001950,0.072400,0.917400
0.007950,0.001900,0.075150,0.915000
0.007200,0.001550,0.078000,0.913250
0.006650,0.001750,0.080450,0.911150
0.006000,0.001700,0.083500,0.908800
0.005750,0.001400,0.086550,0.906300
0.005500,0.001250,0.090100,0.903150
0.005050,0.001550,0.093650,0.899750
0.004350,0.001750,0.096650,0.897250
0.004300,0.001550,0.099450,0.894700
0.004200,0.001350,0.102100,0.892350
0.004000,0.001250,0.104600,0.890150
0.003650,0.001400,0.107550,0.887400
0.003600,0.001300,0.110700,0.884400
0.003700,0.000950,0.113600,0.881750
0.003350,0.001200,0.115750,0.879700
0.003250,0.001150,0.118600,0.877000
0.003200,0.001150,0.120950,0.874700
0.002950,0.001350,0.123550,0.872150
0.003000,0.001300,0.126800,0.868900
0.003050,0.001350,0.128550,0.867050
0.003150,0.001000,0.131600,0.864250
0.002800,0.000850,0.134400,0.861950
0.002650,0.001050,0.136350,0.859950
0.002850,0.001000,0.137950,0.858200
0.002900,0.001050,0.140350,0.855700
0.002850,0.001250,0.142450,0.853450
0.003050,0.000850,0.144950,0.851150
0.003000,0.000850,0.147200,0.848950
0.002850,0.000850,0.150150,0.846150
0.002700,0.000750,0.152150,0.844400
0.002550,0.001000,0.154650,0.841800
0.002450,0.001300,0.156700,0.839550
0.002500,0.001150,0.159550,0.836800
0.002150,0.001350,0.161500,0.835000
0.002250,0.001250,0.163750,0.832750
0.002300,0.001400,0.166700,0.829600
0.002200,0.001700,0.168400,0.827700
0.002350,0.001450,0.170400,0.825800
0.002650,0.001400,0.172600,0.823350
0.002750,0.001300,0.174200,0.821750
0.002700,0.001200,0.176550,0.819550
0.002450,0.001250,0.178600,0.817700
0.002500,0.001550,0.180800,0.815150
0.002500,0.001550,0.182700,0.813250
0.002400,0.001550,0.184500,0.811550
0.002450,0.001500,0.185850,0.810200
0.002650,0.001200,0.187850,0.808300
0.002350,0.001450,0.189750,0.806450
0.002550,0.001400,0.192400,0.803650
0.002700,0.001300,0.195200,0.800800
0.002350,0.001050,0.197500,0.799100
0.002300,0.000750,0.200000,0.796950
0.002250,0.000900,0.202150,0.794700
0.001850,0.001250,0.203700,0.793200
0.002000,0.001150,0.205950,0.790900
0.002000,0.001250,0.207500,0.789250
0.002050,0.001200,0.209950,0.786800
0.002100,0.001100,0.212200,0.784600
0.002000,0.000900,0.214000,0.783100
0.002200,0.001150,0.215650,0.781000
0.002200,0.001300,0.217600,0.778900
0.002300,0.001050,0.219950,0.776700
0.002000,0.000950,0.221950,0.775100
0.002050,0.000900,0.223600,0.773450
0.002050,0.001300,0.225450,0.771200
0.002300,0.001200,0.227600,0.768900
0.002250,0.001400,0.228900,0.767450
0.002400,0.001250,0.231550,0.764800
0.002450,0.001400,0.233400,0.762750
0.002950,0.001300,0.235400,0.760350
0.002650,0.001300,0.237600,0.758450
0.002450,0.001850,0.238500,0.757200
0.002850,0.001500,0.240000,0.755650
0.003150,0.001600,0.241600,0.753650
0.003150,0.001750,0.243250,0.751850
0.003450,0.001650,0.245200,0.749700
0.003800,0.001600,0.247000,0.747600
0.003600,0.001850,0.248900,0.745650
0.003650,0.002050,0.250850,0.743450
0.003850,0.002000,0.252750,0.741400
0.004000,0.002250,0.254100,0.739650
0.004150,0.002100,0.257050,0.736700
0.003950,0.001900,0.259150,0.735000
0.003800,0.002150,0.261150,0.732900
0.004050,0.002300,0.262850,0.730800
0.004100,0.002300,0.264050,0.729550
0.004100,0.003000,0.265350,0.727550
0.004200,0.003300,0.266350,0.726150
0.004650,0.003500,0.267500,0.724350
0.004800,0.003850,0.268800,0.722550
0.005500,0.003350,0.269800,0.721350
0.005400,0.003900,0.270550,0.720150
0.005800,0.003850,0.272000,0.718350
0.006550,0.004050,0.272650,0.716750
0.006750,0.004650,0.273600,0.715000
0.007350,0.004700,0.273900,0.714050
0.007600,0.005100,0.274400,0.712900
0.007700,0.005500,0.274800,0.712000
0.008100,0.005950,0.274500,0.711450
0.009150,0.005600,0.275500,0.709750
0.009250,0.006050,0.275650,0.709050
0.010300,0.005700,0.276450,0.707550
0.011100,0.006300,0.275950,0.706650
0.011700,0.006950,0.275900,0.705450
0.011850,0.007500,0.275100,0.705550
0.012250,0.008550,0.273800,0.705400
0.012900,0.009550,0.272250,0.705300
0.013550,0.009750,0.272150,0.704550
0.014050,0.010350,0.271150,0.704450
0.015850,0.009900,0.271150,0.703100
0.016850,0.009600,0.270250,0.703300
0.018050,0.009700,0.268650,0.703600
0.018500,0.011000,0.267300,0.703200
0.020150,0.011050,0.265800,0.703000
0.020300,0.012550,0.263500,0.703650
0.021750,0.013400,0.261050,0.703800
0.022650,0.013700,0.258700,0.704950
0.022900,0.014250,0.257450,0.705400
0.023200,0.014350,0.256250,0.706200
0.024150,0.015100,0.253550,0.707200
0.025000,0.015800,0.251200,0.708000
0.026150,0.016300,0.248400,0.709150
0.027150,0.017300,0.245300,0.710250
0.028750,0.017700,0.241800,0.711750
0.029750,0.018000,0.239450,0.712800
0.030250,0.018500,0.236600,0.714650
0.030500,0.019200,0.233200,0.717100
0.031200,0.019800,0.230050,0.718950
0.031950,0.019700,0.227150,0.721200
0.032150,0.020350,0.224350,0.723150
0.033250,0.019400,0.221500,0.725850
0.033950,0.019700,0.218650,0.727700
0.035250,0.019250,0.215700,0.729800
0.036900,0.019950,0.211350,0.731800
0.037250,0.019650,0.208150,0.734950
0.037700,0.019850,0.205400,0.737050
0.037150,0.021050,0.201100,0.740700
0.037000,0.021550,0.198050,0.743400
0.038550,0.021050,0.195850,0.744550
0.038450,0.020950,0.193050,0.747550
0.038700,0.021600,0.189300,0.750400
0.039450,0.021200,0.187600,0.751750
0.039900,0.021250,0.184650,0.754200
0.040600,0.020450,0.182250,0.756700
0.040400,0.021550,0.178750,0.759300
0.040650,0.021500,0.176200,0.761650
0.041850,0.020050,0.173800,0.764300
0.040800,0.018900,0.173150,0.767150
0.040050,0.017400,0.172600,0.769950
0.039400,0.018850,0.169850,0.771900
0.040100,0.017900,0.168500,0.773500
0.039650,0.017900,0.166850,0.775600
0.039450,0.017950,0.164600,0.778000
0.040600,0.016900,0.163350,0.779150
0.040550,0.017150,0.161200,0.781100
0.040450,0.018300,0.158350,0.782900
0.040100,0.017600,0.156850,0.785450
0.039850,0.016700,0.157100,0.786350
0.039900,0.016350,0.154700,0.789050
0.039450,0.015850,0.154100,0.790600
0.037850,0.016400,0.152200,0.793550
0.037600,0.016500,0.151400,0.794500
0.037100,0.015900,0.151700,0.795300
0.037050,0.015200,0.151850,0.795900
0.036450,0.014700,0.151600,0.797250
0.035200,0.014750,0.151150,0.798900
0.034900,0.014400,0.150650,0.800050
0.034250,0.013950,0.151550,0.800250
0.033400,0.012550,0.152500,0.801550
0.032900,0.012850,0.152550,0.801700
0.031500,0.012750,0.153550,0.802200
0.031100,0.013450,0.152900,0.802550
0.030750,0.012100,0.153450,0.803700
0.030200,0.011200,0.154600,0.804000
0.028900,0.012200,0.154800,0.804100
0.027100,0.012050,0.155200,0.805650
0.026000,0.012500,0.155650,0.805850
0.026250,0.012200,0.156250,0.805300
0.026500,0.011600,0.157850,0.804050
0.025600,0.011400,0.157950,0.805050
0.025200,0.010700,0.159200,0.804900
0.024500,0.009950,0.160950,0.804600
0.023700,0.010300,0.161000,0.805000
0.024350,0.010500,0.161200,0.803950
0.023750,0.011050,0.162300,0.802900
0.024050,0.011400,0.163100,0.801450
0.023400,0.011600,0.164000,0.801000
0.022350,0.011150,0.165900,0.800600
0.022300,0.010850,0.168200,0.798650
0.022300,0.010750,0.169000,0.797950
0.023300,0.010650,0.169100,0.796950
0.022750,0.011350,0.170000,0.795900
0.021850,0.010500,0.171000,0.796650
0.021200,0.010800,0.172250,0.795750
0.021800,0.010950,0.173100,0.794150
0.021050,0.010650,0.175400,0.792900
0.019850,0.011400,0.177050,0.791700
0.020100,0.011250,0.178350,0.790300
0.020350,0.010700,0.179950,0.789000
0.019750,0.010750,0.180800,0.788700
0.020700,0.009650,0.183050,0.786600
0.019950,0.009850,0.185100,0.785100
0.019400,0.010150,0.186950,0.783500
0.019500,0.010150,0.188150,0.782200
0.019400,0.010500,0.189100,0.781000
0.020150,0.010800,0.191150,0.777900
0.020500,0.011000,0.192550,0.775950
0.020300,0.011650,0.193700,0.774350
0.020250,0.012050,0.194550,0.773150
0.020900,0.011400,0.197300,0.770400
0.020850,0.011650,0.198100,0.769400
0.022000,0.010650,0.199850,0.767500
0.021650,0.011650,0.201000,0.765700
0.022050,0.011650,0.201800,0.764500
0.022450,0.011150,0.202600,0.763800
0.022850,0.011450,0.203100,0.762600
0.022700,0.011600,0.203600,0.762100
0.022850,0.011400,0.205200,0.760550
0.022950,0.011400,0.207050,0.758600
0.023550,0.011750,0.207150,0.757550
0.023400,0.012400,0.208050,0.756150
0.023300,0.012350,0.209150,0.755200
0.023750,0.011850,0.210750,0.753650
0.023450,0.012300,0.211300,0.752950
0.025000,0.013500,0.209050,0.752450
0.024400,0.014200,0.207900,0.753500
0.024650,0.014300,0.207450,0.753600
0.024650,0.014250,0.207950,0.753150
0.025050,0.014450,0.207450,0.753050
0.026050,0.013850,0.207750,0.752350
0.026450,0.015050,0.207600,0.750900
0.027300,0.015200,0.208050,0.749450
0.028100,0.015050,0.207800,0.749050
0.029100,0.014350,0.208050,0.748500
0.028150,0.015650,0.208450,0.747750
0.028700,0.015750,0.208350,0.747200
0.029500,0.016100,0.208100,0.746300
0.029800,0.017400,0.206850,0.745950
0.030750,0.016650,0.206500,0.746100
0.030850,0.017700,0.205000,0.746450
0.032400,0.017000,0.204750,0.745850
0.032700,0.018000,0.203350,0.745950
0.034450,0.016300,0.203700,0.745550
0.034850,0.016750,0.203950,0.744450
0.033800,0.016450,0.203500,0.746250
0.033950,0.016250,0.203050,0.746750
0.032950,0.017400,0.202500,0.747150
0.034200,0.016950,0.201850,0.747000
0.033850,0.017600,0.200450,0.748100
0.033650,0.017750,0.200150,0.748450
0.033150,0.016950,0.200100,0.749800
0.034950,0.016900,0.199800,0.748350
0.035800,0.017150,0.198400,0.748650
0.035100,0.017350,0.197350,0.750200
0.035250,0.018200,0.195850,0.750700
0.035850,0.018500,0.195000,0.750650
0.035300,0.019200,0.194350,0.751150
0.035750,0.019250,0.193350,0.751650
0.036050,0.018950,0.192450,0.752550
0.035450,0.019000,0.191600,0.753950
0.036750,0.018500,0.190300,0.754450
0.037700,0.018450,0.190050,0.753800
0.038550,0.018650,0.189050,0.753750
0.039400,0.018450,0.187600,0.754550
0.039800,0.017850,0.187550,0.754800
0.039850,0.018100,0.186600,0.755450
0.040650,0.018450,0.185350,0.755550
0.039900,0.019600,0.183350,0.757150
0.039650,0.020700,0.182150,0.757500
0.040150,0.020050,0.181800,0.758000
0.040650,0.019950,0.181100,0.758300
0.040050,0.021450,0.179400,0.759100
0.040350,0.019800,0.178650,0.761200
0.039600,0.019900,0.177350,0.763150
0.039350,0.020350,0.175800,0.764500
0.039250,0.021200,0.174050,0.765500
0.041550,0.019450,0.174950,0.764050
0.042700,0.017850,0.174700,0.764750
0.041650,0.019100,0.172850,0.766400
0.041650,0.018750,0.172250,0.767350
0.041900,0.018200,0.171050,0.768850
0.041450,0.018850,0.170850,0.768850
0.041100,0.019350,0.169650,0.769900
0.041450,0.018900,0.169950,0.769700
0.040850,0.018700,0.170150,0.770300
0.039950,0.019250,0.170200,0.770600
0.040250,0.019050,0.169650,0.771050
0.040200,0.019300,0.168900,0.771600
0.040700,0.019300,0.167200,0.772800
0.040150,0.019600,0.166100,0.774150
0.040000,0.019150,0.165950,0.774900
0.039950,0.020450,0.163900,0.775700
0.040350,0.020250,0.163700,0.775700
0.040150,0.019300,0.163000,0.777550
0.040700,0.019300,0.163250,0.776750
0.040750,0.019400,0.162550,0.777300
0.040350,0.019150,0.162400,0.778100
0.040500,0.019700,0.161800,0.778000
0.041350,0.018750,0.160950,0.778950
0.040850,0.017950,0.162850,0.778350
0.039000,0.018250,0.163200,0.779550
0.038150,0.017850,0.163450,0.780550
0.037450,0.017650,0.163000,0.781900
0.037900,0.016950,0.162950,0.782200
0.038550,0.015850,0.163950,0.781650
0.038150,0.015050,0.165400,0.781400
0.036500,0.016150,0.165450,0.781900
0.035700,0.016400,0.165750,0.782150
0.035550,0.016700,0.165450,0.782300
0.035800,0.016300,0.166300,0.781600
0.035150,0.015450,0.166200,0.783200
0.034050,0.015900,0.166900,0.783150
0.033100,0.016100,0.167200,0.783600
0.033050,0.015550,0.168400,0.783000
0.031700,0.015300,0.170150,0.782850
0.031750,0.015450,0.170800,0.782000
0.031900,0.015250,0.171050,0.781800
0.031900,0.014800,0.171700,0.781600
0.032200,0.014650,0.172600,0.780550
0.032550,0.014550,0.172450,0.780450
0.032150,0.015600,0.173000,0.779250
0.031000,0.016800,0.174000,0.778200
0.030950,0.016750,0.174150,0.778150
0.031700,0.015850,0.175500,0.776950
0.031300,0.017000,0.176300,0.775400
0.032000,0.016400,0.176550,0.775050
0.032350,0.015050,0.177300,0.775300
0.032850,0.014600,0.178450,0.774100
0.031700,0.015100,0.179050,0.774150
0.031600,0.015400,0.179500,0.773500
0.031900,0.015200,0.179300,0.773600
0.032000,0.015650,0.178800,0.773550
0.031750,0.016300,0.178650,0.773300
0.031500,0.015050,0.179900,0.773550
0.031250,0.015750,0.180100,0.772900
0.031300,0.015650,0.180600,0.772450
0.031350,0.015750,0.181650,0.771250
0.032700,0.015050,0.182400,0.769850
0.032300,0.015100,0.184050,0.768550
0.032450,0.015100,0.185150,0.767300
0.032200,0.015600,0.184800,0.767400
0.032950,0.015350,0.184400,0.767300
0.032500,0.014950,0.183850,0.768700
0.033050,0.015500,0.183400,0.768050
0.032450,0.016450,0.182900,0.768200
0.032550,0.016150,0.183150,0.768150
0.032300,0.015700,0.182950,0.769050
0.033050,0.015850,0.183500,0.767600
0.032650,0.016100,0.184050,0.767200
0.033150,0.015900,0.184650,0.766300
0.033050,0.016200,0.184350,0.766400
0.033150,0.015900,0.184700,0.766250
0.032100,0.016500,0.183800,0.767600
0.032600,0.015950,0.183900,0.767550
0.032550,0.017100,0.182550,0.767800
0.031850,0.017200,0.182050,0.768900
0.033200,0.015750,0.182550,0.768500
0.031250,0.016800,0.182450,0.769500
0.031550,0.016950,0.183050,0.768450
0.031200,0.017450,0.182600,0.768750
0.032300,0.017000,0.182150,0.768550
0.032450,0.016800,0.182300,0.768450
0.031950,0.017400,0.181700,0.768950
0.032650,0.016500,0.182150,0.768700
0.031400,0.017500,0.181250,0.769850
0.031750,0.017300,0.181400,0.769550
0.032600,0.015750,0.182400,0.769250
0.032250,0.016450,0.180750,0.770550
0.032350,0.016350,0.180850,0.770450
0.031800,0.016200,0.180900,0.771100
0.031950,0.015400,0.182000,0.770650
0.031250,0.015600,0.183000,0.770150
0.031450,0.015700,0.182900,0.769950
0.031950,0.015950,0.183700,0.768400
0.031500,0.016550,0.183700,0.768250
0.031300,0.015950,0.184100,0.768650
0.030850,0.015350,0.184500,0.769300
0.030900,0.014800,0.185950,0.768350
0.030450,0.014100,0.187250,0.768200
0.030350,0.014500,0.187350,0.767800
0.030300,0.014450,0.187600,0.767650
0.029650,0.015050,0.188500,0.766800
0.029650,0.015050,0.188900,0.766400
0.030000,0.015700,0.188800,0.765500
0.030800,0.016000,0.188800,0.764400
0.031000,0.015800,0.188900,0.764300
0.030950,0.016250,0.188200,0.764600
0.031950,0.016150,0.188300,0.763600
0.032700,0.015600,0.187950,0.763750
0.033000,0.015550,0.188500,0.762950
0.033000,0.016350,0.188850,0.761800
0.032400,0.015700,0.189750,0.762150
0.033350,0.015900,0.189100,0.761650
0.032100,0.017200,0.187850,0.762850
0.033650,0.016450,0.188500,0.761400
0.033500,0.016200,0.188900,0.761400
0.034600,0.016200,0.188800,0.760400
0.034750,0.015600,0.188750,0.760900
0.034300,0.016300,0.188250,0.761150
0.033450,0.016000,0.189700,0.760850
0.033150,0.016750,0.189200,0.760900
0.033350,0.016950,0.188650,0.761050
0.033300,0.017250,0.189250,0.760200
0.033700,0.018050,0.187900,0.760350
0.034450,0.017200,0.187900,0.760450
0.034800,0.017550,0.186800,0.760850
0.033800,0.018000,0.186850,0.761350
0.034150,0.017500,0.187050,0.761300
0.032700,0.018650,0.186300,0.762350
0.033950,0.018250,0.187600,0.760200
0.035200,0.017050,0.187550,0.760200
0.035400,0.017650,0.187150,0.759800
0.036100,0.017300,0.186250,0.760350
0.036700,0.017950,0.185100,0.760250
0.037550,0.018500,0.184500,0.759450
0.038250,0.018650,0.183000,0.760100
0.038200,0.019100,0.181950,0.760750
0.037400,0.018450,0.181800,0.762350
0.037300,0.018600,0.181350,0.762750
0.037300,0.017250,0.181750,0.763700
0.036500,0.018100,0.180850,0.764550
0.036300,0.018500,0.180650,0.764550
0.036650,0.018650,0.180000,0.764700
0.036550,0.019300,0.178750,0.765400
0.037000,0.019600,0.177550,0.765850
0.037400,0.019650,0.175750,0.767200
0.038050,0.019550,0.175650,0.766750
0.038100,0.019200,0.174650,0.768050
0.037400,0.018950,0.174600,0.769050
0.037850,0.017650,0.174800,0.769700
0.036950,0.017900,0.175300,0.769850
0.034900,0.018700,0.174050,0.772350
0.036050,0.016800,0.175000,0.772150
0.036300,0.017050,0.174850,0.771800
0.036750,0.016950,0.175150,0.771150
0.036050,0.017150,0.175850,0.770950
0.035600,0.017150,0.176200,0.771050
0.034800,0.017600,0.175600,0.772000
0.033500,0.017650,0.177650,0.771200
0.034400,0.016600,0.177600,0.771400
0.035850,0.015100,0.177850,0.771200
0.035500,0.015100,0.178550,0.770850
0.034400,0.015050,0.179050,0.771500
0.034450,0.015650,0.178200,0.771700
0.034450,0.016150,0.177550,0.771850
0.034050,0.017200,0.176350,0.772400
0.033850,0.016550,0.177750,0.771850
0.033300,0.018000,0.175950,0.772750
0.034300,0.016050,0.177600,0.772050
0.034350,0.016400,0.177650,0.771600
0.034300,0.016450,0.178850,0.770400
0.034450,0.016100,0.178700,0.770750
0.034850,0.016200,0.179250,0.769700
0.035050,0.015700,0.178700,0.770550
0.034750,0.015350,0.178900,0.771000
0.033750,0.015000,0.179900,0.771350
0.033000,0.015700,0.179750,0.771550
0.032900,0.016700,0.179400,0.771000
0.033000,0.017300,0.179550,0.770150
0.033600,0.016600,0.179750,0.770050
0.033200,0.016500,0.180500,0.769800
0.033300,0.016600,0.180800,0.769300
0.033100,0.018250,0.179550,0.769100
0.034700,0.017300,0.180100,0.767900
0.034350,0.017250,0.180250,0.768150
0.034250,0.017100,0.180500,0.768150
0.034100,0.017050,0.181100,0.767750
0.034100,0.018300,0.180100,0.767500
0.034800,0.017700,0.180550,0.766950
0.034050,0.017800,0.180800,0.767350
0.033600,0.017700,0.181550,0.767150
0.033000,0.018000,0.182450,0.766550
0.034200,0.017600,0.181750,0.766450
0.033750,0.017800,0.182150,0.766300
0.033450,0.016900,0.182450,0.767200
0.032250,0.016650,0.183600,0.767500
0.032300,0.016700,0.183150,0.767850
0.032450,0.016450,0.183850,0.767250
0.032950,0.016200,0.184450,0.766400
0.033100,0.016900,0.182950,0.767050
0.033850,0.016300,0.183600,0.766250
0.034600,0.016850,0.183700,0.764850
0.034900,0.016950,0.183400,0.764750
0.035850,0.016000,0.184050,0.764100
0.035200,0.016100,0.184050,0.764650
0.035300,0.016300,0.183900,0.764500
0.035900,0.016300,0.183050,0.764750
0.035900,0.017850,0.182700,0.763550
0.034350,0.018850,0.181550,0.765250
0.035550,0.018000,0.181500,0.764950
0.036150,0.017450,0.182200,0.764200
0.036350,0.017650,0.181700,0.764300
0.035700,0.017850,0.182200,0.764250
0.036450,0.017250,0.183100,0.763200
0.036000,0.017800,0.183200,0.763000
0.035650,0.018050,0.182400,0.763900
0.036100,0.017750,0.182750,0.763400
0.036050,0.017450,0.182450,0.764050
0.036500,0.016750,0.184050,0.762700
0.036000,0.016100,0.185450,0.762450
0.034950,0.016700,0.186100,0.762250
0.035150,0.016550,0.186100,0.762200
0.035200,0.016350,0.186550,0.761900
0.035450,0.017150,0.186800,0.760600
0.037550,0.016400,0.187100,0.758950
0.036750,0.017150,0.186650,0.759450
0.036950,0.016700,0.187550,0.758800
0.036600,0.017750,0.187050,0.758600
0.037550,0.017550,0.186050,0.758850
0.036350,0.017750,0.186550,0.759350
0.037500,0.016800,0.186950,0.758750
0.036400,0.017850,0.185600,0.760150
0.036850,0.017600,0.184650,0.760900
0.036300,0.017600,0.184300,0.761800
0.035600,0.018650,0.183750,0.762000
0.035550,0.018900,0.183350,0.762200
0.036500,0.018200,0.183000,0.762300
0.037000,0.017500,0.182850,0.762650
0.037000,0.016600,0.183400,0.763000
0.036650,0.016700,0.182650,0.764000
0.036000,0.016300,0.183200,0.764500
0.034900,0.016700,0.182550,0.765850
0.034800,0.015800,0.184450,0.764950
0.034400,0.016450,0.184400,0.764750
0.034700,0.016300,0.184950,0.764050
0.035800,0.015650,0.186250,0.762300
0.035850,0.016000,0.185400,0.762750
0.035250,0.016050,0.185300,0.763400
0.035700,0.016000,0.184450,0.763850
0.034500,0.016950,0.184100,0.764450
0.034200,0.017300,0.184600,0.763900
0.034350,0.017150,0.185450,0.763050
0.034150,0.017900,0.185900,0.762050
0.035000,0.017500,0.185200,0.762300
0.035350,0.017500,0.185050,0.762100
0.035150,0.017100,0.185000,0.762750
0.035350,0.015850,0.185400,0.763400
0.035300,0.016550,0.185200,0.762950
0.034750,0.017000,0.184100,0.764150
0.034450,0.017750,0.182100,0.765700
0.035650,0.017400,0.182000,0.764950
0.035900,0.017750,0.182250,0.764100
0.036000,0.018050,0.181000,0.764950
0.035650,0.018250,0.179700,0.766400
0.036350,0.017400,0.179850,0.766400
0.037350,0.016900,0.179500,0.766250
0.036950,0.017300,0.180350,0.765400
0.037050,0.017450,0.180050,0.765450
0.037650,0.017000,0.179650,0.765700
0.038900,0.016900,0.180400,0.763800
0.037750,0.017150,0.180250,0.764850
0.037000,0.017200,0.180700,0.765100
0.037150,0.017850,0.180450,0.764550
0.038050,0.017850,0.180350,0.763750
0.038550,0.017150,0.179900,0.764400
0.038000,0.017100,0.179650,0.765250
0.038400,0.016200,0.180100,0.765300
0.038550,0.016000,0.180150,0.765300
0.037300,0.016650,0.179850,0.766200
0.036850,0.016650,0.180300,0.766200
0.036650,0.017150,0.180150,0.766050
0.035850,0.018300,0.179000,0.766850
0.035350,0.018600,0.178850,0.767200
0.035500,0.018650,0.178650,0.767200
0.035750,0.017150,0.180350,0.766750
0.034800,0.017250,0.179900,0.768050
0.034100,0.017950,0.179750,0.768200
0.034550,0.017500,0.180500,0.767450
0.033850,0.016750,0.181700,0.767700
0.033800,0.016500,0.181300,0.768400
0.033300,0.016750,0.182000,0.767950
0.033600,0.016150,0.182600,0.767650
0.033250,0.017200,0.181900,0.767650
0.032900,0.016050,0.183050,0.768000
0.033650,0.015750,0.183700,0.766900
0.034450,0.015900,0.183100,0.766550
0.034500,0.015700,0.182950,0.766850
0.034650,0.014650,0.184300,0.766400
0.033850,0.015250,0.185550,0.765350
0.033450,0.016250,0.184800,0.765500
0.033600,0.016550,0.184700,0.765150
0.034200,0.016350,0.184450,0.765000
0.034050,0.016350,0.184500,0.765100
0.034750,0.015600,0.185050,0.764600
0.034650,0.017400,0.184000,0.763950
0.034800,0.016550,0.184100,0.764550
0.034400,0.016800,0.184200,0.764600
0.034950,0.016950,0.183000,0.765100
0.035950,0.017300,0.182950,0.763800
0.035500,0.017650,0.182150,0.764700
0.035150,0.018250,0.181150,0.765450
0.035050,0.018600,0.181250,0.765100
0.034700,0.019250,0.181050,0.765000
0.035650,0.018250,0.181950,0.764150
0.035250,0.017200,0.182200,0.765350
0.034900,0.016250,0.182750,0.766100
0.034550,0.016300,0.182800,0.766350
0.034950,0.015750,0.183150,0.766150
0.033250,0.016150,0.184150,0.766450
0.033050,0.016700,0.184750,0.765500
0.032950,0.016250,0.185000,0.765800
0.032900,0.016300,0.185300,0.765500
0.033000,0.016700,0.186000,0.764300
0.032850,0.017150,0.185900,0.764100
0.033500,0.017300,0.186000,0.763200
0.034400,0.016950,0.185500,0.763150
0.034150,0.017050,0.185850,0.762950
0.034350,0.017100,0.185200,0.763350
0.034150,0.017500,0.185700,0.762650
0.034300,0.018100,0.184850,0.762750
0.035600,0.018000,0.185400,0.761000
0.036050,0.018050,0.185500,0.760400
0.035700,0.018350,0.184550,0.761400
0.036550,0.018400,0.184050,0.761000
0.036300,0.019500,0.183200,0.761000
0.037000,0.018100,0.183000,0.761900
0.037500,0.017700,0.182400,0.762400
0.036150,0.018750,0.181850,0.763250
0.036000,0.018700,0.181100,0.764200
0.036600,0.017750,0.180800,0.764850
0.036600,0.016500,0.181900,0.765000
0.035150,0.017450,0.180750,0.766650
0.035850,0.017750,0.180550,0.765850
0.034850,0.017600,0.180250,0.767300
0.035050,0.017800,0.181550,0.765600
0.034400,0.018350,0.181350,0.765900
0.034750,0.017200,0.182500,0.765550
0.035150,0.016600,0.182700,0.765550
0.034400,0.016600,0.183100,0.765900
0.034500,0.016400,0.182000,0.767100
0.034250,0.016650,0.182250,0.766850
0.033900,0.016600,0.181850,0.767650
0.034000,0.017150,0.181350,0.767500
0.034450,0.016100,0.181900,0.767550
0.034450,0.015800,0.182100,0.767650
0.035100,0.015850,0.181250,0.767800
0.034400,0.016400,0.181350,0.767850
0.033200,0.017600,0.182100,0.767100
0.032950,0.016900,0.183250,0.766900
0.033250,0.017050,0.183950,0.765750
0.032850,0.016800,0.184700,0.765650
0.032500,0.016900,0.184500,0.766100
0.032450,0.017250,0.184950,0.765350
0.033550,0.016950,0.184550,0.764950
0.033650,0.017150,0.185350,0.763850
0.033300,0.017000,0.186000,0.763700
0.032750,0.016950,0.187200,0.763100
0.034100,0.016400,0.186950,0.762550
0.034950,0.016050,0.186850,0.762150
0.033900,0.015950,0.186900,0.763250
0.032800,0.016700,0.186400,0.764100
0.033200,0.016200,0.186450,0.764150
0.032900,0.016950,0.186850,0.763300
0.033700,0.016750,0.186200,0.763350
0.034350,0.017000,0.185550,0.763100
0.034600,0.017600,0.186150,0.761650
0.035500,0.017250,0.185050,0.762200
0.035500,0.017450,0.184600,0.762450
0.035700,0.018150,0.184250,0.761900
0.036000,0.018200,0.183750,0.762050
