I,E,S,R
0.001000,0.000650,0.998350,0.000000
0.001300,0.001600,0.997050,0.000050
0.001800,0.002150,0.995900,0.000150
0.001950,0.002950,0.994650,0.000450
0.002600,0.004200,0.992550,0.000650
0.003350,0.005200,0.990400,0.001050
0.004850,0.006700,0.987100,0.001350
0.006400,0.009150,0.982750,0.001700
0.008250,0.012850,0.976550,0.002350
0.010100,0.016300,0.970000,0.003600
0.013500,0.021350,0.960350,0.004800
0.017400,0.026950,0.949300,0.006350
0.021450,0.035800,0.933750,0.009000
0.027450,0.044900,0.915850,0.011800
0.036150,0.055050,0.893550,0.015250
0.046650,0.067700,0.865200,0.020450
0.058700,0.084450,0.829400,0.027450
0.073600,0.102300,0.788250,0.035850
0.094550,0.122150,0.737550,0.045750
0.117300,0.146200,0.677750,0.058750
0.143600,0.169450,0.612250,0.074700
0.175200,0.191150,0.541800,0.091850
0.208000,0.210100,0.467700,0.114200
0.235700,0.228800,0.391750,0.143750
0.272100,0.231300,0.322400,0.174200
0.299000,0.234050,0.256850,0.210100
0.325750,0.221550,0.203350,0.249350
0.341600,0.207050,0.157850,0.293500
0.358000,0.187400,0.120850,0.333750
0.360400,0.164900,0.092150,0.382550
0.356950,0.139950,0.071000,0.432100
0.346250,0.117500,0.055550,0.480700
0.331550,0.098100,0.044450,0.525900
0.315900,0.081950,0.035350,0.566800
0.297400,0.066800,0.029200,0.606600
0.276800,0.053300,0.024700,0.645200
0.257550,0.042000,0.021850,0.678600
0.234800,0.033650,0.020850,0.710700
0.210700,0.026650,0.020000,0.742650
0.190350,0.021300,0.019500,0.768850
0.171000,0.016700,0.019750,0.792550
0.152450,0.014250,0.020150,0.813150
0.136350,0.012800,0.021100,0.829750
0.121950,0.010400,0.021800,0.845850
0.108050,0.009100,0.022600,0.860250
0.095450,0.008650,0.024550,0.871350
0.084700,0.007100,0.026450,0.881750
0.074400,0.006450,0.028150,0.891000
0.066350,0.005700,0.030800,0.897150
0.058550,0.005350,0.032750,0.903350
0.052250,0.005150,0.034250,0.908350
0.046150,0.004500,0.036350,0.913000
0.041150,0.004100,0.039300,0.915450
0.036650,0.004550,0.040750,0.918050
0.032600,0.003800,0.042700,0.920900
0.029250,0.003900,0.044950,0.921900
0.026100,0.004100,0.046850,0.922950
0.023250,0.003700,0.049200,0.923850
0.021000,0.003650,0.051750,0.923600
0.018750,0.003200,0.054450,0.923600
0.016450,0.003050,0.057400,0.923100
0.015050,0.002900,0.060200,0.921850
0.014000,0.002700,0.062300,0.921000
0.012850,0.002750,0.064450,0.919950
0.011400,0.002250,0.067600,0.918750
0.010250,0.001950,0.070400,0.917400
0.009450,0.002000,0.073400,0.915150
0.008750,0.002200,0.075550,0.913500
0.007900,0.002150,0.078050,0.911900
0.007400,0.001900,0.081900,0.908800
0.007300,0.001400,0.084600,0.906700
0.006300,0.001500,0.087400,0.904800
0.005700,0.001700,0.090500,0.902100
0.005250,0.001800,0.093150,0.899800
0.004750,0.001850,0.096300,0.897100
0.004600,0.001700,0.099750,0.893950
0.004300,0.001700,0.102750,0.891250
0.004100,0.001750,0.105750,0.888400
0.004500,0.001250,0.109050,0.885200
0.004150,0.001100,0.111500,0.883250
0.004150,0.000950,0.114200,0.880700
0.003700,0.001150,0.116300,0.878850
0.003600,0.001200,0.118850,0.876350
0.003800,0.001050,0.121600,0.873550
0.003200,0.001200,0.123900,0.871700
0.003100,0.001250,0.126000,0.869650
0.003250,0.001150,0.128500,0.867100
0.002950,0.001300,0.131550,0.864200
0.003000,0.001300,0.133450,0.862250
0.003100,0.001100,0.135850,0.859950
0.002750,0.001050,0.138700,0.857500
0.002150,0.001200,0.141000,0.855650
0.002150,0.001550,0.143150,0.853150
0.002200,0.001200,0.145900,0.850700
0.002200,0.001100,0.149100,0.847600
0.002250,0.001200,0.150800,0.845750
0.002150,0.001100,0.153000,0.843750
0.002050,0.000950,0.155200,0.841800
0.002150,0.000800,0.156950,0.840100
0.001950,0.000950,0.159500,0.837600
0.001850,0.001050,0.161500,0.835600
0.001950,0.000700,0.163650,0.833700
0.001900,0.000900,0.165550,0.831650
0.001950,0.000900,0.167250,0.829900
0.001950,0.000900,0.169150,0.828000
0.001850,0.001000,0.171500,0.825650
0.001900,0.001000,0.173600,0.823500
0.002000,0.001100,0.175750,0.821150
0.001850,0.001100,0.178150,0.818900
0.001800,0.001100,0.180050,0.817050
0.001800,0.000950,0.182050,0.815200
0.002050,0.000750,0.184200,0.813000
0.001750,0.000950,0.186300,0.811000
0.001600,0.000850,0.188700,0.808850
0.001450,0.000750,0.191000,0.806800
0.001300,0.000750,0.193150,0.804800
0.001350,0.000800,0.195400,0.802450
0.001150,0.000800,0.197150,0.800900
0.001100,0.000650,0.199300,0.798950
0.000950,0.000750,0.200800,0.797500
0.000950,0.000900,0.203500,0.794650
0.001000,0.000750,0.205900,0.792350
0.001100,0.000550,0.208500,0.789850
0.001000,0.000600,0.210450,0.787950
0.001150,0.000550,0.212100,0.786200
0.001000,0.000600,0.213650,0.784750
0.001100,0.000350,0.216050,0.782500
0.001200,0.000250,0.218000,0.780550
0.001200,0.000400,0.220100,0.778300
0.001150,0.000600,0.222450,0.775800
0.001200,0.000550,0.224900,0.773350
0.001450,0.000550,0.226900,0.771100
0.001250,0.000900,0.228650,0.769200
0.001500,0.000700,0.231000,0.766800
0.001150,0.000950,0.232750,0.765150
0.001150,0.000850,0.234200,0.763800
0.001200,0.000700,0.236400,0.761700
0.001300,0.000950,0.237900,0.759850
0.001500,0.000900,0.240300,0.757300
0.001450,0.000850,0.241900,0.755800
0.001450,0.000900,0.243950,0.753700
0.001450,0.001000,0.246500,0.751050
0.001350,0.001200,0.248550,0.748900
0.001650,0.001100,0.250350,0.746900
0.001900,0.001050,0.252100,0.744950
0.001900,0.001150,0.254200,0.742750
0.001900,0.001100,0.255900,0.741100
0.001800,0.001050,0.257800,0.739350
0.001850,0.001000,0.259600,0.737550
0.001750,0.001150,0.261400,0.735700
0.001950,0.001350,0.263150,0.733550
0.002150,0.001200,0.265050,0.731600
0.002100,0.001150,0.267050,0.729700
0.002300,0.001350,0.268150,0.728200
0.002500,0.001100,0.269950,0.726450
0.002400,0.001600,0.271100,0.724900
0.002600,0.001950,0.272500,0.722950
0.002750,0.002050,0.274100,0.721100
0.003100,0.001850,0.276000,0.719050
0.003200,0.002050,0.277800,0.716950
0.003400,0.002050,0.278900,0.715650
0.003300,0.002300,0.280350,0.714050
0.003150,0.002200,0.281700,0.712950
0.003400,0.002450,0.283400,0.710750
0.003600,0.002550,0.283850,0.710000
0.003600,0.002900,0.285050,0.708450
0.003650,0.003150,0.286050,0.707150
0.004350,0.003000,0.287150,0.705500
0.004800,0.003100,0.287950,0.704150
0.004900,0.002650,0.289600,0.702850
0.004900,0.003250,0.290350,0.701500
0.005050,0.003700,0.291000,0.700250
0.005150,0.003600,0.292000,0.699250
0.005050,0.003700,0.293100,0.698150
0.005350,0.003900,0.294200,0.696550
0.005950,0.003700,0.295850,0.694500
0.006350,0.003750,0.297000,0.692900
0.006450,0.004450,0.296900,0.692200
0.006000,0.005400,0.297750,0.690850
0.006400,0.005300,0.298200,0.690100
0.006700,0.005600,0.298850,0.688850
0.007100,0.005500,0.299500,0.687900
0.008500,0.005950,0.299250,0.686300
0.009400,0.005700,0.299400,0.685500
0.010100,0.006050,0.299050,0.684800
0.010550,0.006100,0.299500,0.683850
0.010900,0.007300,0.298750,0.683050
0.011300,0.007550,0.298750,0.682400
0.011650,0.008500,0.297600,0.682250
0.012700,0.007900,0.297400,0.682000
0.013650,0.008350,0.296350,0.681650
0.013500,0.009000,0.295400,0.682100
0.013900,0.009800,0.294200,0.682100
0.015150,0.009950,0.292950,0.681950
0.015750,0.010750,0.292550,0.680950
0.016850,0.011700,0.290450,0.681000
0.018700,0.012800,0.288350,0.680150
0.019550,0.013050,0.286500,0.680900
0.020550,0.013150,0.285150,0.681150
0.021350,0.013650,0.282800,0.682200
0.022300,0.014450,0.280400,0.682850
0.023750,0.015250,0.278300,0.682700
0.024750,0.017150,0.274050,0.684050
0.026300,0.017600,0.270450,0.685650
0.027250,0.017750,0.267650,0.687350
0.027450,0.018250,0.265850,0.688450
0.028450,0.018750,0.263200,0.689600
0.032350,0.017200,0.260200,0.690250
0.032450,0.018750,0.255400,0.693400
0.033200,0.020200,0.251850,0.694750
0.035000,0.019800,0.248500,0.696700
0.035050,0.021650,0.243000,0.700300
0.036350,0.021350,0.240150,0.702150
0.038000,0.021700,0.234600,0.705700
0.039000,0.022150,0.230150,0.708700
0.039950,0.023450,0.225700,0.710900
0.041750,0.023950,0.220750,0.713550
0.041150,0.024850,0.216600,0.717400
0.042800,0.024950,0.211600,0.720650
0.043150,0.024350,0.208750,0.723750
0.043400,0.024550,0.205250,0.726800
0.044200,0.024850,0.200650,0.730300
0.044800,0.024900,0.195950,0.734350
0.045300,0.024750,0.192200,0.737750
0.045450,0.024850,0.188700,0.741000
0.046750,0.024450,0.184700,0.744100
0.048800,0.023550,0.180850,0.746800
0.046700,0.025250,0.176800,0.751250
0.046650,0.023700,0.174400,0.755250
0.046100,0.023700,0.171250,0.758950
0.047150,0.023350,0.167800,0.761700
0.048750,0.022150,0.164850,0.764250
0.049150,0.021250,0.162250,0.767350
0.047000,0.021400,0.159850,0.771750
0.046950,0.021150,0.158550,0.773350
0.046700,0.020300,0.156700,0.776300
0.045950,0.020900,0.154150,0.779000
0.045950,0.020450,0.152550,0.781050
0.045600,0.019750,0.150900,0.783750
0.045100,0.019450,0.149850,0.785600
0.045200,0.020000,0.146950,0.787850
0.044500,0.019200,0.145550,0.790750
0.043200,0.019000,0.144850,0.792950
0.042100,0.018650,0.143050,0.796200
0.042700,0.017500,0.142050,0.797750
0.040800,0.017850,0.141000,0.800350
0.038200,0.017250,0.140850,0.803700
0.037700,0.016600,0.140400,0.805300
0.037400,0.016950,0.139150,0.806500
0.036850,0.015150,0.139850,0.808150
0.036000,0.014400,0.139500,0.810100
0.035150,0.014100,0.138850,0.811900
0.034850,0.013550,0.138850,0.812750
0.033050,0.014650,0.138100,0.814200
0.033300,0.014750,0.137550,0.814400
0.031800,0.014450,0.138450,0.815300
0.031400,0.013050,0.139200,0.816350
0.030000,0.012100,0.141050,0.816850
0.029350,0.011750,0.142200,0.816700
0.028100,0.010600,0.143850,0.817450
0.027100,0.010800,0.145600,0.816500
0.025950,0.010700,0.147250,0.816100
0.025900,0.010150,0.148600,0.815350
0.024400,0.010000,0.150600,0.815000
0.024000,0.009700,0.151300,0.815000
0.023450,0.009500,0.152900,0.814150
0.021950,0.010300,0.154750,0.813000
0.021650,0.010200,0.156950,0.811200
0.022050,0.009000,0.158900,0.810050
0.021500,0.008900,0.160050,0.809550
0.021000,0.009250,0.161950,0.807800
0.020200,0.009650,0.163950,0.806200
0.019850,0.009950,0.165100,0.805100
0.019650,0.010250,0.166300,0.803800
0.019700,0.010700,0.167350,0.802250
0.019450,0.010350,0.169450,0.800750
0.019600,0.009950,0.171500,0.798950
0.020200,0.009650,0.173600,0.796550
0.020150,0.009200,0.175750,0.794900
0.019850,0.009250,0.177700,0.793200
0.019550,0.009200,0.180200,0.791050
0.019450,0.009550,0.182100,0.788900
0.019850,0.008800,0.184200,0.787150
0.019800,0.009700,0.185100,0.785400
0.020600,0.009100,0.186200,0.784100
0.020550,0.009650,0.186750,0.783050
0.020350,0.010150,0.187450,0.782050
0.020500,0.010100,0.188000,0.781400
0.020500,0.009750,0.190000,0.779750
0.020550,0.010300,0.191050,0.778100
0.020250,0.010550,0.192100,0.777100
0.020700,0.010000,0.194000,0.775300
0.019750,0.010250,0.194200,0.775800
0.020250,0.010450,0.194850,0.774450
0.021150,0.009350,0.197300,0.772200
0.021350,0.009150,0.199300,0.770200
0.020900,0.009800,0.199250,0.770050
0.020750,0.011000,0.200000,0.768250
0.020650,0.011500,0.201100,0.766750
0.021100,0.011200,0.202350,0.765350
0.021000,0.010700,0.203700,0.764600
0.020550,0.011050,0.205650,0.762750
0.019600,0.012450,0.205250,0.762700
0.021000,0.012050,0.206250,0.760700
0.020500,0.011750,0.207000,0.760750
0.019950,0.012300,0.207300,0.760450
0.020200,0.011750,0.208350,0.759700
0.020750,0.011250,0.209700,0.758300
0.021750,0.010800,0.210950,0.756500
0.021900,0.011150,0.211500,0.755450
0.022300,0.010650,0.211800,0.755250
0.022800,0.011750,0.212350,0.753100
0.023300,0.011700,0.213150,0.751850
0.023000,0.012900,0.213500,0.750600
0.023400,0.012700,0.214050,0.749850
0.024200,0.013300,0.214350,0.748150
0.024400,0.013250,0.214600,0.747750
0.025400,0.013550,0.214500,0.746550
0.025350,0.013950,0.214550,0.746150
0.025750,0.014250,0.214750,0.745250
0.027000,0.013400,0.214950,0.744650
0.027250,0.013800,0.215250,0.743700
0.027250,0.014750,0.215100,0.742900
0.028300,0.015500,0.213800,0.742400
0.028450,0.015200,0.214100,0.742250
0.028350,0.015700,0.212900,0.743050
0.029150,0.015800,0.212500,0.742550
0.029400,0.015850,0.212200,0.742550
0.029450,0.016450,0.211650,0.742450
0.029500,0.017100,0.210300,0.743100
0.030300,0.017550,0.209200,0.742950
0.031750,0.017100,0.209150,0.742000
0.033450,0.016550,0.209400,0.740600
0.032850,0.017550,0.208650,0.740950
0.033750,0.017000,0.207950,0.741300
0.034400,0.017000,0.206100,0.742500
0.034000,0.018100,0.203800,0.744100
0.033450,0.018500,0.203400,0.744650
0.033800,0.018500,0.203150,0.744550
0.033700,0.018650,0.202050,0.745600
0.034650,0.018350,0.201300,0.745700
0.034450,0.018750,0.199850,0.746950
0.034600,0.017650,0.199550,0.748200
0.033750,0.018250,0.199350,0.748650
0.033800,0.019300,0.197250,0.749650
0.034550,0.018550,0.197850,0.749050
0.035350,0.018950,0.197100,0.748600
0.035800,0.018700,0.196900,0.748600
0.037250,0.019450,0.195900,0.747400
0.037600,0.018700,0.195150,0.748550
0.037200,0.018400,0.194300,0.750100
0.037350,0.018550,0.194300,0.749800
0.037700,0.017800,0.193300,0.751200
0.037150,0.017900,0.194500,0.750450
0.036950,0.018000,0.194100,0.750950
0.037450,0.018000,0.192800,0.751750
0.038400,0.018500,0.190050,0.753050
0.038550,0.018550,0.190000,0.752900
0.037850,0.018850,0.190000,0.753300
0.036600,0.019400,0.189250,0.754750
0.037300,0.019550,0.188300,0.754850
0.038800,0.019700,0.186100,0.755400
0.039050,0.019350,0.184850,0.756750
0.038700,0.020250,0.183100,0.757950
0.039400,0.019650,0.182450,0.758500
0.039750,0.018550,0.183050,0.758650
0.039450,0.019250,0.181950,0.759350
0.040750,0.018850,0.181950,0.758450
0.039850,0.019200,0.180550,0.760400
0.039850,0.019900,0.179750,0.760500
0.039850,0.020600,0.178350,0.761200
0.041450,0.019100,0.177650,0.761800
0.039700,0.019200,0.177900,0.763200
0.039250,0.018400,0.177550,0.764800
0.039350,0.018650,0.178000,0.764000
0.039600,0.017700,0.179400,0.763300
0.038450,0.017500,0.179650,0.764400
0.037850,0.017250,0.179050,0.765850
0.037450,0.017750,0.178800,0.766000
0.036750,0.017800,0.178950,0.766500
0.037350,0.017050,0.179700,0.765900
0.037700,0.017300,0.178000,0.767000
0.038700,0.016900,0.177700,0.766700
0.037900,0.018600,0.176300,0.767200
0.037700,0.018900,0.175500,0.767900
0.036950,0.018150,0.176600,0.768300
0.036450,0.018650,0.176750,0.768150
0.036400,0.018800,0.176050,0.768750
0.037100,0.018600,0.176250,0.768050
0.036850,0.018900,0.175400,0.768850
0.036700,0.018950,0.174800,0.769550
0.037550,0.018150,0.174800,0.769500
0.037100,0.018300,0.175100,0.769500
0.037050,0.019050,0.174700,0.769200
0.037300,0.019200,0.174100,0.769400
0.037250,0.019100,0.173600,0.770050
0.038350,0.017750,0.174300,0.769600
0.039250,0.017550,0.173350,0.769850
0.038750,0.016950,0.174500,0.769800
0.038550,0.016750,0.174600,0.770100
0.037800,0.017800,0.174550,0.769850
0.037900,0.018050,0.173700,0.770350
0.038350,0.017100,0.174050,0.770500
0.037250,0.017650,0.173350,0.771750
0.037500,0.018300,0.172650,0.771550
0.036000,0.018450,0.172500,0.773050
0.036700,0.017000,0.173050,0.773250
0.036400,0.017900,0.172550,0.773150
0.036400,0.016300,0.174300,0.773000
0.035650,0.017550,0.173950,0.772850
0.036200,0.017850,0.173550,0.772400
0.035900,0.016750,0.175200,0.772150
0.035600,0.015750,0.176000,0.772650
0.034500,0.016050,0.176200,0.773250
0.033700,0.016150,0.177300,0.772850
0.034200,0.016300,0.177700,0.771800
0.033200,0.015950,0.178150,0.772700
0.034050,0.015750,0.177750,0.772450
0.032500,0.016050,0.178250,0.773200
0.031500,0.015150,0.178400,0.774950
0.030150,0.015350,0.179100,0.775400
0.030600,0.015600,0.180400,0.773400
0.030550,0.016050,0.180650,0.772750
0.030800,0.015950,0.181500,0.771750
0.031800,0.015300,0.182200,0.770700
0.031350,0.015000,0.182600,0.771050
0.030600,0.014750,0.182950,0.771700
0.031450,0.015050,0.183300,0.770200
0.030850,0.015750,0.183800,0.769600
0.030350,0.014800,0.184500,0.770350
0.031350,0.014400,0.186050,0.768200
0.031400,0.014200,0.186750,0.767650
0.031100,0.014200,0.187750,0.766950
0.030550,0.015250,0.188950,0.765250
0.030450,0.015900,0.189200,0.764450
0.031050,0.014700,0.189700,0.764550
0.029650,0.015150,0.189700,0.765500
0.029550,0.015100,0.189950,0.765400
0.029650,0.015000,0.190550,0.764800
0.030600,0.013650,0.190950,0.764800
0.030150,0.014600,0.190400,0.764850
0.030750,0.014050,0.190600,0.764600
0.031100,0.014450,0.190300,0.764150
0.030400,0.015850,0.190900,0.762850
0.030700,0.015450,0.191000,0.762850
0.031350,0.015100,0.191250,0.762300
0.031700,0.014750,0.191600,0.761950
0.031750,0.015550,0.191900,0.760800
0.033200,0.014450,0.192650,0.759700
0.031750,0.015150,0.193350,0.759750
0.031050,0.015100,0.193800,0.760050
0.030800,0.015800,0.193500,0.759900
0.031950,0.015300,0.194300,0.758450
0.032050,0.015000,0.195300,0.757650
0.033000,0.014750,0.195350,0.756900
0.031900,0.015500,0.195250,0.757350
0.031050,0.015300,0.194800,0.758850
0.031650,0.014500,0.195000,0.758850
0.031550,0.015600,0.195200,0.757650
0.032150,0.015900,0.194950,0.757000
0.031300,0.016400,0.194250,0.758050
0.032000,0.015900,0.195450,0.756650
0.032350,0.016300,0.194750,0.756600
0.032550,0.016300,0.194300,0.756850
0.033050,0.016100,0.194850,0.756000
0.033050,0.016250,0.194400,0.756300
0.033400,0.016550,0.194650,0.755400
0.032950,0.017200,0.194650,0.755200
0.033500,0.016650,0.194850,0.755000
0.032150,0.017950,0.194250,0.755650
0.032500,0.016500,0.195450,0.755550
0.032750,0.016850,0.195400,0.755000
0.032400,0.017700,0.194550,0.755350
0.033100,0.016950,0.194350,0.755600
0.033500,0.016850,0.193500,0.756150
0.033600,0.017400,0.192900,0.756100
0.033100,0.017900,0.192050,0.756950
0.033100,0.018300,0.191750,0.756850
0.034500,0.018200,0.190850,0.756450
0.034600,0.018350,0.190050,0.757000
0.034600,0.018000,0.189750,0.757650
0.034750,0.017400,0.189450,0.758400
0.034950,0.017150,0.190900,0.757000
0.033900,0.017950,0.191050,0.757100
0.033350,0.017850,0.191050,0.757750
0.033800,0.017550,0.190700,0.757950
0.035000,0.016550,0.190900,0.757550
0.035250,0.016000,0.190800,0.757950
0.033950,0.016500,0.190950,0.758600
0.033400,0.016450,0.191000,0.759150
0.033800,0.015850,0.191350,0.759000
0.034350,0.016250,0.191100,0.758300
0.034100,0.016750,0.189300,0.759850
0.033650,0.016800,0.188550,0.761000
0.032800,0.017000,0.187950,0.762250
0.033050,0.016300,0.188250,0.762400
0.033200,0.017600,0.187250,0.761950
0.032750,0.017850,0.187050,0.762350
0.033100,0.017550,0.187800,0.761550
0.033200,0.016350,0.188300,0.762150
0.033200,0.015700,0.188450,0.762650
0.033000,0.015900,0.188750,0.762350
0.033150,0.014750,0.189350,0.762750
0.033500,0.014700,0.188400,0.763400
0.033050,0.015500,0.187250,0.764200
0.032750,0.016400,0.186650,0.764200
0.033850,0.015350,0.186250,0.764550
0.033450,0.015950,0.185800,0.764800
0.032550,0.016150,0.185700,0.765600
0.032850,0.016650,0.185200,0.765300
0.033600,0.016550,0.184900,0.764950
0.032950,0.016050,0.186350,0.764650
0.031850,0.016900,0.186350,0.764900
0.032750,0.016650,0.186750,0.763850
0.032450,0.016800,0.186850,0.763900
0.032300,0.016350,0.187350,0.764000
0.033650,0.015150,0.187450,0.763750
0.033300,0.015500,0.188650,0.762550
0.033750,0.015750,0.187250,0.763250
0.034150,0.015550,0.187100,0.763200
0.032950,0.016950,0.185900,0.764200
0.033850,0.016800,0.185250,0.764100
0.034050,0.016200,0.185350,0.764400
0.034350,0.016350,0.184950,0.764350
0.034750,0.016600,0.184550,0.764100
0.035350,0.015950,0.185650,0.763050
0.034200,0.017200,0.185300,0.763300
0.033950,0.016900,0.184900,0.764250
0.033000,0.017350,0.184850,0.764800
0.032650,0.016900,0.184550,0.765900
0.032850,0.016900,0.184200,0.766050
0.033250,0.016250,0.183900,0.766600
0.032900,0.015750,0.185150,0.766200
0.033250,0.014950,0.184600,0.767200
0.032350,0.014850,0.185750,0.767050
0.032200,0.015850,0.184700,0.767250
0.031550,0.016000,0.184550,0.767900
0.031750,0.016600,0.184100,0.767550
0.032600,0.017400,0.184800,0.765200
0.033400,0.018300,0.184800,0.763500
0.035450,0.017500,0.184800,0.762250
0.035900,0.016650,0.185250,0.762200
0.034350,0.017550,0.184500,0.763600
0.034300,0.016800,0.184300,0.764600
0.033600,0.017450,0.183400,0.765550
0.034900,0.016850,0.183000,0.765250
0.035200,0.017150,0.182200,0.765450
0.034850,0.016650,0.183250,0.765250
0.034600,0.017800,0.182450,0.765150
0.035000,0.017650,0.182700,0.764650
0.034000,0.017300,0.183500,0.765200
0.034000,0.016100,0.184400,0.765500
0.033900,0.015650,0.183800,0.766650
0.033700,0.016800,0.182800,0.766700
0.035100,0.016500,0.182300,0.766100
0.034900,0.017750,0.181250,0.766100
0.035750,0.016550,0.181950,0.765750
0.034750,0.016400,0.182000,0.766850
0.033200,0.017300,0.180800,0.768700
0.034200,0.017150,0.181050,0.767600
0.035300,0.015950,0.182050,0.766700
0.035800,0.015450,0.181600,0.767150
0.035600,0.016350,0.181150,0.766900
0.034800,0.016800,0.181350,0.767050
0.034800,0.016600,0.181000,0.767600
0.033700,0.016750,0.181050,0.768500
0.033250,0.016750,0.181500,0.768500
0.032600,0.017950,0.181300,0.768150
0.033500,0.017900,0.181850,0.766750
0.033250,0.018250,0.181700,0.766800
0.033650,0.018250,0.181550,0.766550
0.034800,0.017450,0.180950,0.766800
0.035150,0.018150,0.180450,0.766250
0.035150,0.017800,0.180650,0.766400
0.036000,0.017400,0.180050,0.766550
0.036450,0.017750,0.179650,0.766150
0.034900,0.017100,0.180500,0.767500
0.034800,0.017300,0.181300,0.766600
0.035100,0.017650,0.180700,0.766550
0.035350,0.017100,0.181250,0.766300
0.035500,0.017200,0.181500,0.765800
0.035700,0.016950,0.182900,0.764450
0.035250,0.016250,0.183900,0.764600
0.034250,0.017600,0.183800,0.764350
0.034500,0.017950,0.183050,0.764500
0.035350,0.018100,0.182550,0.764000
0.034000,0.018650,0.182300,0.765050
0.034850,0.017500,0.182450,0.765200
0.035200,0.017700,0.182650,0.764450
0.034650,0.017950,0.183000,0.764400
0.035000,0.018900,0.182250,0.763850
0.035600,0.018650,0.181500,0.764250
0.035100,0.018400,0.181850,0.764650
0.035150,0.017750,0.180700,0.766400
0.034500,0.017300,0.181000,0.767200
0.034450,0.017250,0.179850,0.768450
0.034450,0.018250,0.178700,0.768600
0.035950,0.016400,0.179400,0.768250
0.034900,0.017950,0.178250,0.768900
0.034200,0.017750,0.180000,0.768050
0.033700,0.018050,0.180600,0.767650
0.032750,0.018800,0.180500,0.767950
0.033050,0.018600,0.180650,0.767700
0.032850,0.018900,0.180850,0.767400
0.034150,0.017300,0.181600,0.766950
0.035050,0.017750,0.180350,0.766850
0.034400,0.017000,0.180350,0.768250
0.035250,0.016800,0.180100,0.767850
0.036150,0.016350,0.180700,0.766800
0.036500,0.016800,0.180900,0.765800
0.036250,0.017600,0.179650,0.766500
0.035900,0.017900,0.180250,0.765950
0.036500,0.017850,0.181100,0.764550
0.036500,0.017950,0.181150,0.764400
0.036800,0.017950,0.180250,0.765000
0.036800,0.018000,0.179550,0.765650
0.037200,0.017750,0.180050,0.765000
0.036250,0.017850,0.181000,0.764900
0.036600,0.017800,0.180400,0.765200
0.036150,0.018850,0.179700,0.765300
0.036750,0.018550,0.180450,0.764250
0.037050,0.019000,0.179750,0.764200
0.037600,0.018450,0.180300,0.763650
0.037600,0.017850,0.180950,0.763600
0.037400,0.018200,0.181300,0.763100
0.037150,0.017350,0.182300,0.763200
0.037250,0.016300,0.182500,0.763950
0.035750,0.017450,0.182550,0.764250
0.035550,0.018100,0.182500,0.763850
0.037150,0.016950,0.183200,0.762700
0.036650,0.017800,0.182050,0.763500
0.037650,0.016500,0.182350,0.763500
0.036450,0.017150,0.181800,0.764600
0.036000,0.017100,0.181700,0.765200
0.037050,0.016700,0.181350,0.764900
0.036850,0.017800,0.181100,0.764250
0.037400,0.018250,0.180850,0.763500
0.037450,0.018000,0.180550,0.764000
0.037200,0.018200,0.179350,0.765250
0.036100,0.018600,0.180400,0.764900
0.036300,0.017500,0.179950,0.766250
0.036450,0.018900,0.178400,0.766250
0.035650,0.019300,0.177900,0.767150
0.036100,0.018650,0.177950,0.767300
0.036200,0.019100,0.178250,0.766450
0.037200,0.019050,0.178650,0.765100
0.038300,0.018400,0.178100,0.765200
0.036700,0.018400,0.177450,0.767450
0.036150,0.019750,0.176300,0.767800
0.036550,0.019150,0.175900,0.768400
0.037200,0.019050,0.175800,0.767950
0.037200,0.018300,0.176400,0.768100
0.037950,0.016500,0.177100,0.768450
0.038200,0.016950,0.177100,0.767750
0.038350,0.017550,0.175200,0.768900
0.037800,0.017350,0.175250,0.769600
0.037200,0.017450,0.175750,0.769600
0.036350,0.017050,0.176000,0.770600
0.036250,0.017250,0.175700,0.770800
0.035650,0.016650,0.176350,0.771350
0.036450,0.016650,0.176250,0.770650
0.035550,0.016100,0.177050,0.771300
0.034750,0.016050,0.177550,0.771650
0.034550,0.016800,0.177750,0.770900
0.034500,0.016850,0.177650,0.771000
0.034400,0.017600,0.176750,0.771250
0.033700,0.017500,0.176850,0.771950
0.033600,0.016300,0.179300,0.770800
0.032700,0.015850,0.180050,0.771400
0.032550,0.015550,0.180300,0.771600
0.032550,0.015450,0.182050,0.769950
0.031950,0.016700,0.183450,0.767900
0.032600,0.015850,0.184100,0.767450
0.031150,0.016300,0.184950,0.767600
0.031100,0.016800,0.184800,0.767300
0.031250,0.016350,0.185000,0.767400
0.031100,0.015650,0.185650,0.767600
0.031400,0.015100,0.187250,0.766250
0.030850,0.015050,0.187950,0.766150
0.030500,0.015300,0.188450,0.765750
0.030700,0.015700,0.187700,0.765900
0.030000,0.015750,0.188650,0.765600
0.031050,0.015900,0.188100,0.764950
0.030400,0.016100,0.188950,0.764550
0.031000,0.015100,0.190250,0.763650
0.030250,0.015350,0.190250,0.764150
0.030600,0.015800,0.190600,0.763000
0.030900,0.016150,0.190550,0.762400
0.030750,0.016300,0.190950,0.762000
0.031700,0.015150,0.192500,0.760650
0.031500,0.016200,0.192100,0.760200
0.032350,0.016500,0.192800,0.758350
0.033350,0.016400,0.191400,0.758850
0.032900,0.018100,0.190800,0.758200
0.034450,0.017700,0.190750,0.757100
0.034800,0.017900,0.189200,0.758100
0.035350,0.018300,0.189400,0.756950
0.036650,0.018650,0.189300,0.755400
0.037050,0.018500,0.188900,0.755550
0.037350,0.019050,0.187450,0.756150
0.037000,0.019900,0.186550,0.756550
0.037450,0.019150,0.186400,0.757000
0.037400,0.018750,0.186400,0.757450
0.037900,0.019050,0.185650,0.757400
0.038950,0.017700,0.185850,0.757500
0.038300,0.016900,0.187000,0.757800
0.036500,0.017500,0.186800,0.759200
0.035850,0.017650,0.187150,0.759350
0.035750,0.017900,0.187600,0.758750
0.036300,0.017900,0.186650,0.759150
0.035900,0.019500,0.185800,0.758800
0.036900,0.017950,0.185950,0.759200
0.036500,0.019900,0.184200,0.759400
0.037050,0.018850,0.183550,0.760550
0.038000,0.018750,0.183550,0.759700
0.038100,0.017600,0.183050,0.761250
0.037750,0.017550,0.183400,0.761300
0.037200,0.019050,0.181550,0.762200
0.038100,0.018450,0.181600,0.761850
0.039350,0.018050,0.181000,0.761600
0.038350,0.018850,0.180100,0.762700
0.037950,0.018900,0.180000,0.763150
0.039150,0.018650,0.180250,0.761950
0.040050,0.019100,0.179150,0.761700
0.040250,0.018600,0.177950,0.763200
0.039350,0.020600,0.176800,0.763250
0.038550,0.020400,0.176400,0.764650
0.040050,0.019150,0.175850,0.764950
0.039500,0.020800,0.174950,0.764750
0.040350,0.020550,0.174400,0.764700
