I,E,S,R
0.001000,0.000750,0.998250,0.000000
0.001100,0.001400,0.997300,0.000200
0.001100,0.001850,0.996650,0.000400
0.001350,0.002400,0.995700,0.000550
0.001950,0.002900,0.994600,0.000550
0.001900,0.003900,0.993300,0.000900
0.003150,0.004250,0.991600,0.001000
0.004700,0.006050,0.988100,0.001150
0.005850,0.008400,0.984000,0.001750
0.007950,0.011150,0.978350,0.002550
0.009900,0.015250,0.971500,0.003350
0.012350,0.019500,0.963600,0.004550
0.016150,0.025300,0.952400,0.006150
0.020950,0.032750,0.937950,0.008350
0.027100,0.040000,0.921900,0.011000
0.034300,0.051700,0.899250,0.014750
0.044900,0.063950,0.872400,0.018750
0.056150,0.079600,0.839750,0.024500
0.071100,0.099550,0.798200,0.031150
0.090800,0.121800,0.747750,0.039650
0.111300,0.146450,0.690100,0.052150
0.141600,0.168050,0.624800,0.065550
0.169550,0.192100,0.553950,0.084400
0.200900,0.211450,0.480500,0.107150
0.233250,0.226850,0.406500,0.133400
0.266450,0.233000,0.335300,0.165250
0.297950,0.231850,0.269050,0.201150
0.328000,0.221100,0.212250,0.238650
0.344850,0.208150,0.163850,0.283150
0.358450,0.188550,0.127800,0.325200
0.363150,0.166500,0.098650,0.371700
0.361000,0.142050,0.076350,0.420600
0.352950,0.120200,0.059150,0.467700
0.338200,0.101150,0.046000,0.514650
0.323300,0.083700,0.036900,0.556100
0.303800,0.067750,0.030300,0.598150
0.282500,0.055450,0.026000,0.636050
0.259700,0.044300,0.024200,0.671800
0.237350,0.036500,0.022300,0.703850
0.213700,0.030250,0.020700,0.735350
0.193300,0.024700,0.020300,0.761700
0.173700,0.020300,0.020400,0.785600
0.156950,0.016650,0.020800,0.805600
0.140500,0.014300,0.020850,0.824350
0.124600,0.012550,0.020700,0.842150
0.111700,0.009750,0.021950,0.856600
0.099450,0.007700,0.023000,0.869850
0.088850,0.007050,0.024100,0.880000
0.077900,0.006150,0.025350,0.890600
0.070400,0.005550,0.027350,0.896700
0.062850,0.004800,0.029550,0.902800
0.055400,0.004850,0.032200,0.907550
0.049800,0.004650,0.033500,0.912050
0.043800,0.004700,0.035900,0.915600
0.039700,0.004450,0.036900,0.918950
0.035250,0.003700,0.039850,0.921200
0.032000,0.003450,0.042950,0.921600
0.027600,0.003250,0.045500,0.923650
0.023900,0.003200,0.047600,0.925300
0.021350,0.003200,0.050400,0.925050
0.019400,0.002650,0.053450,0.924500
0.017850,0.002200,0.056200,0.923750
0.015000,0.002300,0.058950,0.923750
0.013700,0.002050,0.062300,0.921950
0.012350,0.002250,0.065200,0.920200
0.011300,0.002050,0.067900,0.918750
0.010650,0.001800,0.070100,0.917450
0.009200,0.002000,0.072150,0.916650
0.008750,0.001350,0.074950,0.914950
0.008050,0.001600,0.077250,0.913100
0.007250,0.001650,0.079100,0.912000
0.007000,0.001550,0.081800,0.909650
0.006350,0.001500,0.084750,0.907400
0.005850,0.001600,0.087300,0.905250
0.005450,0.001450,0.090000,0.903100
0.005200,0.001500,0.092400,0.900900
0.004850,0.001200,0.095100,0.898850
0.004100,0.001050,0.097650,0.897200
0.003900,0.000850,0.100900,0.894350
0.003300,0.001100,0.102850,0.892750
0.003100,0.000900,0.105850,0.890150
0.003200,0.000750,0.108150,0.887900
0.002850,0.000950,0.110250,0.885950
0.002450,0.000950,0.112900,0.883700
0.002250,0.001050,0.115650,0.881050
0.002500,0.000800,0.118500,0.878200
0.002400,0.000950,0.120950,0.875700
0.002300,0.000900,0.123800,0.873000
0.002450,0.000800,0.126100,0.870650
0.002250,0.001100,0.128450,0.868200
0.002050,0.000850,0.130600,0.866500
0.001700,0.001100,0.132750,0.864450
0.001900,0.000850,0.135950,0.861300
0.001800,0.000850,0.138800,0.858550
0.001700,0.000850,0.141650,0.855800
0.001700,0.000500,0.144250,0.853550
0.001650,0.000500,0.146600,0.851250
0.001500,0.000400,0.149250,0.848850
0.001500,0.000550,0.150900,0.847050
0.001500,0.000550,0.153350,0.844600
0.001400,0.000400,0.156400,0.841800
0.001250,0.000500,0.158800,0.839450
0.001350,0.000500,0.161250,0.836900
0.001350,0.000350,0.163050,0.835250
0.001150,0.000700,0.165700,0.832450
0.001250,0.000600,0.168100,0.830050
0.001350,0.000500,0.170550,0.827600
0.001400,0.000500,0.173000,0.825100
0.001250,0.000550,0.175300,0.822900
0.001350,0.000500,0.178300,0.819850
0.001200,0.000500,0.180900,0.817400
0.001300,0.000500,0.183600,0.814600
0.001350,0.000450,0.185750,0.812450
0.001400,0.000400,0.188150,0.810050
0.001200,0.000350,0.190700,0.807750
0.001150,0.000350,0.192950,0.805550
0.001350,0.000450,0.194700,0.803500
0.001400,0.000500,0.196350,0.801750
0.001150,0.000600,0.198500,0.799750
0.001300,0.000450,0.200950,0.797300
0.001150,0.000600,0.203300,0.794950
0.001200,0.000500,0.205100,0.793200
0.001250,0.000500,0.207550,0.790700
0.001200,0.000600,0.209700,0.788500
0.001400,0.000500,0.212750,0.785350
0.001350,0.000450,0.215400,0.782800
0.001100,0.000600,0.217700,0.780600
0.001050,0.000650,0.219700,0.778600
0.000900,0.000550,0.221450,0.777100
0.001050,0.000600,0.223150,0.775200
0.001150,0.000650,0.224700,0.773500
0.001200,0.000850,0.226150,0.771800
0.001300,0.000900,0.228350,0.769450
0.001500,0.000950,0.230150,0.767400
0.001550,0.000950,0.232450,0.765050
0.001950,0.001050,0.233950,0.763050
0.001800,0.001100,0.236050,0.761050
0.001800,0.001000,0.237850,0.759350
0.001650,0.001200,0.240100,0.757050
0.001350,0.001250,0.241950,0.755450
0.001550,0.001600,0.243300,0.753550
0.001900,0.001450,0.245900,0.750750
0.001950,0.001500,0.247900,0.748650
0.002250,0.001300,0.249250,0.747200
0.002150,0.001300,0.251000,0.745550
0.001950,0.001600,0.251900,0.744550
0.002050,0.001750,0.253600,0.742600
0.002300,0.001500,0.255700,0.740500
0.002350,0.001550,0.257350,0.738750
0.002200,0.001750,0.259000,0.737050
0.002300,0.001850,0.260450,0.735400
0.002550,0.001550,0.263350,0.732550
0.002950,0.001450,0.265000,0.730600
0.003050,0.001300,0.267050,0.728600
0.002800,0.001850,0.268450,0.726900
0.002700,0.001800,0.270750,0.724750
0.002700,0.002050,0.272050,0.723200
0.003100,0.001700,0.273600,0.721600
0.003400,0.001800,0.275500,0.719300
0.003500,0.001800,0.277200,0.717500
0.003250,0.002050,0.278700,0.716000
0.003550,0.002100,0.280100,0.714250
0.003600,0.002750,0.281650,0.712000
0.004000,0.002600,0.283200,0.710200
0.004400,0.002650,0.284200,0.708750
0.004500,0.003000,0.285200,0.707300
0.005250,0.003250,0.286350,0.705150
0.005800,0.003550,0.287000,0.703650
0.006150,0.004500,0.286750,0.702600
0.006300,0.004550,0.287800,0.701350
0.007100,0.004150,0.288200,0.700550
0.007300,0.004500,0.288800,0.699400
0.007950,0.004950,0.288950,0.698150
0.008000,0.005650,0.288700,0.697650
0.009100,0.005050,0.288900,0.696950
0.008600,0.005850,0.289300,0.696250
0.009200,0.005950,0.289600,0.695250
0.009400,0.006350,0.289250,0.695000
0.009800,0.007500,0.288400,0.694300
0.010450,0.008100,0.287600,0.693850
0.011300,0.008500,0.287150,0.693050
0.012050,0.008500,0.286950,0.692500
0.012850,0.008800,0.286050,0.692300
0.013750,0.008750,0.286050,0.691450
0.014200,0.008500,0.285050,0.692250
0.014900,0.008500,0.284250,0.692350
0.015100,0.009550,0.283400,0.691950
0.015050,0.010000,0.282200,0.692750
0.016400,0.009550,0.281150,0.692900
0.016800,0.010750,0.279650,0.692800
0.017550,0.011400,0.277750,0.693300
0.017700,0.012750,0.276450,0.693100
0.019300,0.012950,0.275500,0.692250
0.021550,0.013100,0.273150,0.692200
0.022650,0.014950,0.269050,0.693350
0.023400,0.016150,0.265800,0.694650
0.024800,0.016700,0.263400,0.695100
0.026600,0.016300,0.260700,0.696400
0.027150,0.016950,0.258300,0.697600
0.028500,0.017450,0.255550,0.698500
0.029450,0.017750,0.253000,0.699800
0.029850,0.018400,0.249400,0.702350
0.030800,0.019400,0.246000,0.703800
0.031650,0.020000,0.242400,0.705950
0.032700,0.020250,0.238400,0.708650
0.034400,0.019400,0.235050,0.711150
0.035000,0.021350,0.230100,0.713550
0.035650,0.021400,0.226500,0.716450
0.036700,0.022200,0.222400,0.718700
0.038100,0.022400,0.217950,0.721550
0.038100,0.022850,0.214250,0.724800
0.038150,0.022350,0.211000,0.728500
0.039500,0.022300,0.208000,0.730200
0.040950,0.021850,0.204750,0.732450
0.041400,0.022750,0.201250,0.734600
0.042350,0.022100,0.198400,0.737150
0.042400,0.021600,0.195600,0.740400
0.043050,0.022350,0.191000,0.743600
0.045200,0.021050,0.188600,0.745150
0.043650,0.023150,0.184100,0.749100
0.043650,0.021350,0.182050,0.752950
0.045300,0.019600,0.179250,0.755850
0.044200,0.021050,0.175150,0.759600
0.044600,0.021150,0.172600,0.761650
0.044450,0.020500,0.169700,0.765350
0.045000,0.020800,0.167150,0.767050
0.043400,0.022050,0.163550,0.771000
0.043350,0.021950,0.160700,0.774000
0.044450,0.019700,0.159000,0.776850
0.043050,0.020000,0.157400,0.779550
0.042400,0.020850,0.155450,0.781300
0.042100,0.020600,0.153250,0.784050
0.042250,0.020500,0.151650,0.785600
0.041350,0.019750,0.150850,0.788050
0.041800,0.017900,0.149350,0.790950
0.040450,0.017150,0.147450,0.794950
0.040300,0.018750,0.145600,0.795350
0.040550,0.017450,0.144750,0.797250
0.039650,0.016650,0.144150,0.799550
0.038800,0.017150,0.143650,0.800400
0.038450,0.016350,0.143000,0.802200
0.038300,0.015650,0.143250,0.802800
0.037650,0.014950,0.142750,0.804650
0.036750,0.015000,0.141550,0.806700
0.034950,0.013850,0.141700,0.809500
0.033850,0.013950,0.142050,0.810150
0.032750,0.013900,0.142250,0.811100
0.032900,0.013950,0.141750,0.811400
0.032400,0.013550,0.143150,0.810900
0.032900,0.013650,0.143150,0.810300
0.032350,0.012850,0.143850,0.810950
0.029450,0.013900,0.143600,0.813050
0.029650,0.012250,0.145550,0.812550
0.028750,0.012050,0.146450,0.812750
0.028000,0.012450,0.146700,0.812850
0.027400,0.011500,0.149300,0.811800
0.026650,0.011600,0.150350,0.811400
0.025700,0.010750,0.152450,0.811100
0.025700,0.011450,0.152650,0.810200
0.025600,0.010800,0.154200,0.809400
0.025550,0.010000,0.155650,0.808800
0.024350,0.011100,0.155950,0.808600
0.023800,0.011350,0.156850,0.808000
0.023300,0.010750,0.158200,0.807750
0.023900,0.009800,0.160100,0.806200
0.022500,0.010300,0.161200,0.806000
0.022300,0.010700,0.162500,0.804500
0.022200,0.010150,0.164500,0.803150
0.022400,0.009900,0.165900,0.801800
0.021700,0.009600,0.167300,0.801400
0.021650,0.009600,0.168950,0.799800
0.021250,0.009500,0.171450,0.797800
0.021450,0.009300,0.172900,0.796350
0.020950,0.009600,0.175400,0.794050
0.020850,0.010100,0.176200,0.792850
0.020500,0.009750,0.178300,0.791450
0.019850,0.010450,0.178650,0.791050
0.020100,0.010700,0.180550,0.788650
0.020650,0.011100,0.182050,0.786200
0.021100,0.010450,0.182250,0.786200
0.021500,0.009800,0.184050,0.784650
0.022050,0.009100,0.184700,0.784150
0.021700,0.009250,0.186750,0.782300
0.021600,0.010100,0.186900,0.781400
0.020950,0.010350,0.188200,0.780500
0.021700,0.010500,0.190050,0.777750
0.022550,0.010150,0.190950,0.776350
0.022700,0.010300,0.192600,0.774400
0.021900,0.010350,0.194650,0.773100
0.021700,0.009850,0.196800,0.771650
0.021350,0.009850,0.198050,0.770750
0.021450,0.010800,0.199050,0.768700
0.021050,0.011000,0.199700,0.768250
0.021000,0.011950,0.199950,0.767100
0.022350,0.011550,0.201400,0.764700
0.022800,0.011500,0.201700,0.764000
0.023150,0.011900,0.202800,0.762150
0.022900,0.012650,0.204600,0.759850
0.023000,0.013550,0.205100,0.758350
0.023900,0.012900,0.205500,0.757700
0.024000,0.012600,0.206750,0.756650
0.024650,0.013100,0.206500,0.755750
0.023950,0.014200,0.206100,0.755750
0.024800,0.014300,0.206450,0.754450
0.025750,0.013700,0.207750,0.752800
0.026750,0.013400,0.208400,0.751450
0.027250,0.013750,0.208300,0.750700
0.026650,0.014850,0.206900,0.751600
0.026500,0.015200,0.205700,0.752600
0.026550,0.014600,0.205950,0.752900
0.026850,0.015200,0.206000,0.751950
0.027150,0.015650,0.205450,0.751750
0.027900,0.015500,0.205100,0.751500
0.027800,0.016100,0.205350,0.750750
0.028950,0.015650,0.205750,0.749650
0.030300,0.015850,0.204600,0.749250
0.029950,0.016700,0.204100,0.749250
0.031000,0.017550,0.202750,0.748700
0.031800,0.017050,0.202100,0.749050
0.031950,0.017150,0.201600,0.749300
0.031900,0.017050,0.201650,0.749400
0.031750,0.017150,0.201050,0.750050
0.032000,0.017300,0.200750,0.749950
0.031950,0.017850,0.199850,0.750350
0.031550,0.017600,0.199800,0.751050
0.032750,0.016450,0.200000,0.750800
0.032450,0.016900,0.198350,0.752300
0.033850,0.016750,0.198550,0.750850
0.033350,0.017250,0.198400,0.751000
0.033050,0.017500,0.197900,0.751550
0.033350,0.017550,0.198550,0.750550
0.033800,0.017200,0.197650,0.751350
0.032900,0.017600,0.197500,0.752000
0.033200,0.017750,0.196850,0.752200
0.035250,0.017650,0.196200,0.750900
0.035450,0.018150,0.195500,0.750900
0.035500,0.017950,0.194950,0.751600
0.035250,0.018200,0.194650,0.751900
0.035650,0.018750,0.195200,0.750400
0.036000,0.019400,0.194250,0.750350
0.037250,0.020000,0.193050,0.749700
0.038900,0.019250,0.191400,0.750450
0.039850,0.019250,0.190550,0.750350
0.040500,0.018800,0.191150,0.749550
0.040900,0.019200,0.189650,0.750250
0.040700,0.019600,0.188650,0.751050
0.040150,0.020450,0.187250,0.752150
0.040800,0.021400,0.185000,0.752800
0.040200,0.020350,0.184550,0.754900
0.040700,0.019750,0.184100,0.755450
0.041150,0.019950,0.182700,0.756200
0.042350,0.019350,0.182000,0.756300
0.042200,0.019450,0.180650,0.757700
0.041950,0.019850,0.179200,0.759000
0.042850,0.019450,0.177750,0.759950
0.042400,0.018750,0.178850,0.760000
0.041000,0.019100,0.178350,0.761550
0.041050,0.019100,0.178350,0.761500
0.040550,0.020150,0.176050,0.763250
0.040550,0.019450,0.174750,0.765250
0.040000,0.019450,0.173850,0.766700
0.039800,0.019900,0.173850,0.766450
0.039050,0.018850,0.174950,0.767150
0.039200,0.017350,0.175550,0.767900
0.039300,0.017150,0.174850,0.768700
0.037950,0.017400,0.174450,0.770200
0.037700,0.016500,0.175000,0.770800
0.037500,0.017800,0.173900,0.770800
0.037800,0.018200,0.172700,0.771300
0.038750,0.017900,0.171450,0.771900
0.037600,0.018350,0.171500,0.772550
0.037650,0.018100,0.171500,0.772750
0.036700,0.018900,0.171100,0.773300
0.037400,0.018700,0.170700,0.773200
0.037550,0.018250,0.171050,0.773150
0.037800,0.017400,0.171350,0.773450
0.037400,0.018050,0.170050,0.774500
0.038400,0.017650,0.169700,0.774250
0.039400,0.016350,0.169850,0.774400
0.039250,0.016600,0.170050,0.774100
0.039100,0.017950,0.168700,0.774250
0.037800,0.018150,0.169550,0.774500
0.039100,0.018100,0.168150,0.774650
0.037100,0.017900,0.168600,0.776400
0.038300,0.017900,0.168500,0.775300
0.036700,0.018900,0.167900,0.776500
0.037800,0.017400,0.168100,0.776700
0.035750,0.017900,0.168500,0.777850
0.037250,0.016700,0.169800,0.776250
0.036500,0.016700,0.169650,0.777150
0.035750,0.016700,0.170450,0.777100
0.034900,0.017750,0.170250,0.777100
0.036200,0.017000,0.170250,0.776550
0.036550,0.016700,0.170900,0.775850
0.035450,0.016300,0.171600,0.776650
0.035650,0.015400,0.172650,0.776300
0.035800,0.016150,0.172100,0.775950
0.036400,0.016500,0.172700,0.774400
0.035800,0.016650,0.172900,0.774650
0.034350,0.017250,0.172250,0.776150
0.035150,0.016050,0.173350,0.775450
0.034750,0.015200,0.174400,0.775650
0.034650,0.014750,0.175100,0.775500
0.034050,0.014350,0.175750,0.775850
0.032900,0.014800,0.176450,0.775850
0.031150,0.015600,0.177100,0.776150
0.030950,0.015450,0.178450,0.775150
0.029950,0.015750,0.178950,0.775350
0.030200,0.014100,0.179700,0.776000
0.029250,0.014450,0.181250,0.775050
0.029500,0.014750,0.182650,0.773100
0.030250,0.013900,0.184600,0.771250
0.031100,0.013650,0.184650,0.770600
0.030950,0.013450,0.185300,0.770300
0.030450,0.012800,0.187050,0.769700
0.030500,0.012550,0.188350,0.768600
0.030050,0.013800,0.189600,0.766550
0.028850,0.014900,0.189350,0.766900
0.028450,0.014900,0.189750,0.766900
0.028650,0.014800,0.189800,0.766750
0.028200,0.016450,0.189550,0.765800
0.028400,0.017750,0.189550,0.764300
0.029700,0.017050,0.190350,0.762900
0.029800,0.018000,0.190100,0.762100
0.030150,0.016950,0.190550,0.762350
0.030550,0.016650,0.190800,0.762000
0.032150,0.014600,0.190800,0.762450
0.031200,0.014850,0.190600,0.763350
0.030250,0.015650,0.191050,0.763050
0.031150,0.015350,0.192100,0.761400
0.031650,0.016350,0.190700,0.761300
0.032350,0.015650,0.190650,0.761350
0.032650,0.015850,0.190400,0.761100
0.031950,0.017550,0.188700,0.761800
0.032450,0.017450,0.187850,0.762250
0.033250,0.016650,0.188600,0.761500
0.034500,0.016550,0.188100,0.760850
0.034300,0.016750,0.188750,0.760200
0.033700,0.016700,0.188600,0.761000
0.034200,0.016600,0.188400,0.760800
0.033750,0.016450,0.188350,0.761450
0.033600,0.016700,0.188500,0.761200
0.033950,0.017400,0.187950,0.760700
0.033800,0.017300,0.187450,0.761450
0.033950,0.016900,0.188900,0.760250
0.033850,0.016200,0.189150,0.760800
0.033850,0.015900,0.188850,0.761400
0.034300,0.016100,0.189150,0.760450
0.033350,0.016800,0.189550,0.760300
0.033550,0.017550,0.188750,0.760150
0.033800,0.018150,0.188650,0.759400
0.035200,0.018000,0.187750,0.759050
0.035150,0.017600,0.188050,0.759200
0.034400,0.017300,0.188850,0.759450
0.034700,0.016750,0.189750,0.758800
0.034600,0.017250,0.189950,0.758200
0.034050,0.016900,0.189150,0.759900
0.034350,0.016100,0.189700,0.759850
0.035700,0.015850,0.190150,0.758300
0.035500,0.016850,0.190050,0.757600
0.035650,0.016600,0.189750,0.758000
0.035500,0.018300,0.187950,0.758250
0.035550,0.018250,0.187750,0.758450
0.036350,0.017750,0.187750,0.758150
0.035350,0.017100,0.187650,0.759900
0.036100,0.018100,0.187500,0.758300
0.036150,0.017850,0.187300,0.758700
0.036600,0.018050,0.186500,0.758850
0.036600,0.017900,0.185550,0.759950
0.036200,0.017850,0.185550,0.760400
0.037100,0.016950,0.185100,0.760850
0.036400,0.016850,0.185900,0.760850
0.036700,0.017300,0.184350,0.761650
0.035850,0.018200,0.183750,0.762200
0.036550,0.017300,0.182700,0.763450
0.037100,0.016950,0.182750,0.763200
0.036600,0.018600,0.181550,0.763250
0.037000,0.017750,0.181550,0.763700
0.037900,0.017400,0.181500,0.763200
0.038750,0.017800,0.179800,0.763650
0.038750,0.017300,0.178650,0.765300
0.038150,0.017500,0.178100,0.766250
0.038450,0.017550,0.177200,0.766800
0.038350,0.018000,0.176700,0.766950
0.038900,0.017100,0.176700,0.767300
0.039150,0.017050,0.175700,0.768100
0.038400,0.017500,0.175200,0.768900
0.038950,0.019000,0.174000,0.768050
0.039150,0.018900,0.172250,0.769700
0.040300,0.018650,0.170700,0.770350
0.039550,0.018950,0.169850,0.771650
0.037700,0.019650,0.169250,0.773400
0.037050,0.019050,0.169000,0.774900
0.037050,0.018850,0.168400,0.775700
0.038800,0.018050,0.167250,0.775900
0.037950,0.018600,0.167300,0.776150
0.037950,0.017300,0.168050,0.776700
0.037700,0.017600,0.167750,0.776950
0.037700,0.017050,0.167900,0.777350
0.038150,0.016550,0.167950,0.777350
0.037550,0.016300,0.167150,0.779000
0.035050,0.016600,0.167650,0.780700
0.034100,0.016300,0.167950,0.781650
0.033800,0.016100,0.168750,0.781350
0.033800,0.015600,0.169750,0.780850
0.033500,0.016550,0.168650,0.781300
0.034550,0.015150,0.169500,0.780800
0.033750,0.015600,0.169550,0.781100
0.033450,0.015300,0.172150,0.779100
0.033450,0.015650,0.172650,0.778250
0.033450,0.014900,0.174400,0.777250
0.032400,0.015050,0.175200,0.777350
0.031950,0.015250,0.175700,0.777100
0.031700,0.014700,0.177000,0.776600
0.032150,0.015150,0.176600,0.776100
0.032050,0.014050,0.178200,0.775700
0.031300,0.015050,0.178450,0.775200
0.031500,0.015100,0.178300,0.775100
0.030050,0.016500,0.178100,0.775350
0.030800,0.015800,0.179050,0.774350
0.031650,0.015500,0.179650,0.773200
0.031500,0.015200,0.181100,0.772200
0.031300,0.014550,0.181450,0.772700
0.031350,0.015450,0.181250,0.771950
0.031350,0.015900,0.180500,0.772250
0.030700,0.016950,0.180000,0.772350
0.030250,0.016350,0.181500,0.771900
0.031400,0.016650,0.181350,0.770600
0.031800,0.016200,0.181900,0.770100
0.032600,0.016100,0.181650,0.769650
0.033150,0.015200,0.182950,0.768700
0.033250,0.014400,0.183900,0.768450
0.032950,0.015200,0.184150,0.767700
0.031500,0.016100,0.183550,0.768850
0.031800,0.015850,0.182900,0.769450
0.032450,0.015050,0.182850,0.769650
0.032650,0.014150,0.183750,0.769450
0.033000,0.014400,0.184300,0.768300
0.032400,0.015700,0.184850,0.767050
0.032400,0.016100,0.186000,0.765500
0.032400,0.016700,0.185800,0.765100
0.032950,0.015700,0.187050,0.764300
0.032900,0.016050,0.186550,0.764500
0.033800,0.016000,0.187550,0.762650
0.032700,0.017100,0.187950,0.762250
0.033950,0.015900,0.188250,0.761900
0.033250,0.016300,0.187750,0.762700
0.033250,0.017150,0.186850,0.762750
0.033200,0.017000,0.186800,0.763000
0.033800,0.016400,0.186650,0.763150
0.032700,0.017300,0.186750,0.763250
0.033050,0.017500,0.186300,0.763150
0.033650,0.017250,0.185900,0.763200
0.034050,0.017200,0.185650,0.763100
0.034750,0.016550,0.185350,0.763350
0.036150,0.016550,0.184900,0.762400
0.035950,0.016400,0.185250,0.762400
0.035400,0.016950,0.183950,0.763700
0.035550,0.017800,0.183250,0.763400
0.035700,0.018150,0.182900,0.763250
0.035650,0.018200,0.182650,0.763500
0.036100,0.018400,0.182350,0.763150
0.036550,0.018550,0.182750,0.762150
0.037450,0.018850,0.182250,0.761450
0.038550,0.019150,0.180850,0.761450
0.038850,0.019500,0.180450,0.761200
0.038300,0.019750,0.179150,0.762800
0.039850,0.018650,0.178800,0.762700
0.040050,0.018300,0.176850,0.764800
0.039550,0.017900,0.176750,0.765800
0.038900,0.017800,0.177400,0.765900
0.039400,0.017900,0.177300,0.765400
0.037350,0.019800,0.176050,0.766800
0.038350,0.018700,0.176400,0.766550
0.039450,0.017750,0.176450,0.766350
0.039800,0.017900,0.175900,0.766400
0.038950,0.017700,0.176450,0.766900
0.038200,0.017600,0.176800,0.767400
0.038350,0.016350,0.178150,0.767150
0.038300,0.016400,0.178800,0.766500
0.038050,0.016950,0.179700,0.765300
0.037800,0.018000,0.179300,0.764900
0.038650,0.018200,0.178700,0.764450
0.039550,0.017350,0.178450,0.764650
0.039250,0.017500,0.177900,0.765350
0.038800,0.017600,0.176300,0.767300
0.038550,0.017500,0.176800,0.767150
0.039150,0.018500,0.175200,0.767150
0.038150,0.018950,0.174000,0.768900
0.037700,0.019100,0.173250,0.769950
0.038000,0.019300,0.173100,0.769600
0.038350,0.019700,0.171250,0.770700
0.038100,0.020200,0.170400,0.771300
0.038550,0.018250,0.170600,0.772600
0.038500,0.019650,0.170500,0.771350
0.038650,0.020200,0.169000,0.772150
0.038800,0.020250,0.168550,0.772400
0.039050,0.020100,0.168250,0.772600
0.038300,0.019700,0.168950,0.773050
0.039150,0.017050,0.169250,0.774550
0.038150,0.017350,0.169050,0.775450
0.038350,0.016750,0.169550,0.775350
0.038300,0.017250,0.169150,0.775300
0.038350,0.017650,0.168800,0.775200
0.037650,0.017650,0.168850,0.775850
0.037550,0.017200,0.168850,0.776400
0.037000,0.016650,0.168850,0.777500
0.035100,0.016750,0.170100,0.778050
0.035150,0.015800,0.171200,0.777850
0.034250,0.015700,0.172700,0.777350
0.033300,0.015500,0.173600,0.777600
0.033850,0.014300,0.173950,0.777900
0.033200,0.015100,0.174800,0.776900
0.033450,0.013850,0.176450,0.776250
0.032500,0.014700,0.176550,0.776250
0.032850,0.014200,0.178000,0.774950
0.032400,0.014000,0.178200,0.775400
0.032200,0.014900,0.178300,0.774600
0.031500,0.015100,0.180300,0.773100
0.031400,0.016650,0.180150,0.771800
0.031350,0.016450,0.180200,0.772000
0.032100,0.015850,0.180700,0.771350
0.031300,0.015550,0.182000,0.771150
0.031100,0.015650,0.183200,0.770050
0.032300,0.014950,0.183850,0.768900
0.032050,0.014400,0.184450,0.769100
0.032400,0.015200,0.184900,0.767500
0.033600,0.015050,0.185600,0.765750
0.033350,0.014650,0.186300,0.765700
0.032550,0.014150,0.187850,0.765450
0.031600,0.015700,0.187500,0.765200
0.031050,0.016900,0.187100,0.764950
0.031900,0.016850,0.188150,0.763100
0.032800,0.016450,0.189300,0.761450
0.032700,0.017300,0.189700,0.760300
0.032750,0.016900,0.190500,0.759850
0.033850,0.016950,0.190050,0.759150
0.033950,0.016950,0.190100,0.759000
0.034050,0.016700,0.189250,0.760000
0.034300,0.015950,0.190300,0.759450
0.034600,0.016500,0.190100,0.758800
0.035200,0.016200,0.190500,0.758100
0.034300,0.017000,0.190550,0.758150
0.034600,0.017900,0.189200,0.758300
0.034900,0.018450,0.189100,0.757550
0.034750,0.018850,0.188150,0.758250
0.035450,0.019550,0.188450,0.756550
0.036400,0.019450,0.187800,0.756350
0.037550,0.019050,0.187650,0.755750
0.038250,0.018300,0.187250,0.756200
0.037800,0.017650,0.187050,0.757500
0.038550,0.017500,0.187550,0.756400
0.037800,0.017200,0.187050,0.757950
0.037100,0.018000,0.186350,0.758550
0.036800,0.018950,0.185150,0.759100
0.037500,0.020050,0.184800,0.757650
0.038350,0.019800,0.184200,0.757650
0.039150,0.019450,0.183450,0.757950
0.039000,0.020000,0.182550,0.758450
0.038800,0.020350,0.181250,0.759600
0.038800,0.020850,0.180550,0.759800
0.039900,0.020500,0.179500,0.760100
0.041200,0.019350,0.179750,0.759700
0.041200,0.019000,0.179600,0.760200
0.040150,0.018850,0.179600,0.761400
0.040550,0.020650,0.176850,0.761950
0.040950,0.019800,0.175400,0.763850
0.040200,0.019850,0.174650,0.765300
0.041050,0.019250,0.173450,0.766250
0.042000,0.016950,0.173850,0.767200
0.041150,0.018100,0.172450,0.768300
0.040150,0.019600,0.171050,0.769200
0.040050,0.019250,0.171000,0.769700
0.039000,0.020200,0.169800,0.771000
0.038750,0.019400,0.171100,0.770750
0.039150,0.019600,0.169750,0.771500
0.039050,0.020500,0.169750,0.770700
0.040900,0.019000,0.169950,0.770150
0.041950,0.018650,0.169900,0.769500
0.041200,0.020000,0.167500,0.771300
0.040550,0.020850,0.165600,0.773000
0.039800,0.021050,0.165600,0.773550
0.040700,0.019600,0.165800,0.773900
0.040600,0.020500,0.164850,0.774050
0.041100,0.018600,0.165750,0.774550
0.040450,0.018300,0.165600,0.775650
0.039100,0.018700,0.165400,0.776800
0.038700,0.018800,0.165300,0.777200
0.038500,0.018450,0.165150,0.777900
0.038500,0.017750,0.165300,0.778450
0.038750,0.017200,0.166050,0.778000
0.037350,0.017200,0.166650,0.778800
0.037500,0.017100,0.166750,0.778650
0.038250,0.016650,0.167300,0.777800
0.037400,0.017300,0.166850,0.778450
0.037400,0.017450,0.166900,0.778250
0.036750,0.017150,0.167000,0.779100
0.037400,0.016500,0.167250,0.778850
0.037950,0.017300,0.166650,0.778100
0.037300,0.018000,0.165850,0.778850
0.036600,0.018700,0.164650,0.780050
0.037350,0.018650,0.163800,0.780200
0.037350,0.018200,0.163050,0.781400
0.037400,0.017650,0.162800,0.782150
0.037300,0.017750,0.163450,0.781500
0.036750,0.017200,0.164000,0.782050
0.036850,0.016100,0.165550,0.781500
0.035750,0.016800,0.166500,0.780950
0.035200,0.016700,0.167000,0.781100
0.034900,0.015500,0.169050,0.780550
0.033900,0.015350,0.169250,0.781500
0.033500,0.015450,0.170100,0.780950
0.033600,0.014750,0.170800,0.780850
0.032100,0.015700,0.171150,0.781050
0.031200,0.015100,0.172900,0.780800
0.031650,0.014650,0.174100,0.779600
0.031900,0.014100,0.174900,0.779100
0.030900,0.014800,0.175800,0.778500
0.030900,0.014550,0.176050,0.778500
0.031150,0.014700,0.176650,0.777500
0.030750,0.014100,0.177450,0.777700
0.030300,0.014500,0.178300,0.776900
0.030350,0.014650,0.179150,0.775850
0.030100,0.014650,0.179350,0.775900
0.030250,0.014100,0.180800,0.774850
0.029300,0.013450,0.181300,0.775950
0.028650,0.014250,0.181000,0.776100
0.028550,0.014150,0.183700,0.773600
0.028000,0.014400,0.185400,0.772200
0.028450,0.013550,0.186600,0.771400
