I,E,S,R
0.001,0.00045,0.99855,0
0.00105,0.0011,0.99775,0.0001
0.00155,0.00165,0.9967,0.0001
0.00165,0.00275,0.9952,0.0004
0.0022,0.0032,0.99405,0.00055
0.0027,0.00375,0.99255,0.001
0.00305,0.0054,0.9901,0.00145
0.0043,0.00745,0.98655,0.0017
0.00615,0.0095,0.98225,0.0021
0.0078,0.0122,0.9768,0.0032
0.01065,0.01475,0.9703,0.0043
0.0129,0.02155,0.9599,0.00565
0.0177,0.0279,0.9475,0.0069
0.0246,0.03555,0.9311,0.00875
0.0306,0.0469,0.9109,0.0116
0.03895,0.0597,0.8858,0.01555
0.0514,0.0721,0.85555,0.02095
0.06485,0.09,0.81785,0.0273
0.0835,0.1093,0.77215,0.03505
0.10545,0.1333,0.71625,0.045
0.1297,0.15775,0.65445,0.0581
0.15575,0.1831,0.58495,0.0762
0.1866,0.20895,0.5089,0.09555
0.222,0.2263,0.43285,0.11885
0.2579,0.2377,0.3571,0.1473
0.2871,0.24105,0.288,0.18385
0.3155,0.23225,0.2293,0.22295
0.33295,0.22055,0.1788,0.2677
0.3537,0.19955,0.1371,0.30965
0.3623,0.17885,0.1035,0.35535
0.3676,0.15115,0.0786,0.40265
0.3629,0.1275,0.05935,0.45025
0.34865,0.1078,0.0455,0.49805
0.33045,0.0887,0.036,0.54485
0.3132,0.0722,0.0284,0.5862
0.29235,0.0582,0.02315,0.6263
0.2664,0.0472,0.0207,0.6657
0.24445,0.0379,0.0192,0.69845
0.22435,0.02885,0.01895,0.72785
0.20205,0.0239,0.01875,0.7553
0.1825,0.02005,0.0189,0.77855
0.16295,0.01765,0.01815,0.80125
0.14545,0.0144,0.0191,0.82105
0.1304,0.01215,0.02005,0.8374
0.1162,0.01055,0.02095,0.8523
0.10445,0.009,0.0219,0.86465
0.0931,0.00785,0.02315,0.8759
0.0828,0.007,0.02415,0.88605
0.07395,0.0055,0.0259,0.89465
0.0654,0.00525,0.0275,0.90185
0.0576,0.00505,0.02905,0.9083
0.05125,0.00425,0.03115,0.91335
0.046,0.00425,0.03295,0.9168
0.04075,0.0039,0.03565,0.9197
0.03665,0.00355,0.03885,0.92095
0.03205,0.0035,0.04165,0.9228
0.0288,0.0032,0.0451,0.9229
0.0249,0.00295,0.0473,0.92485
0.02285,0.00285,0.0498,0.9245
0.02115,0.0022,0.05325,0.9234
0.01825,0.0025,0.0553,0.92395
0.0158,0.00255,0.05725,0.9244
0.0136,0.0027,0.05915,0.92455
0.0124,0.00245,0.06165,0.9235
0.01125,0.00285,0.0639,0.922
0.0105,0.0025,0.0666,0.9204
0.0092,0.00235,0.07005,0.9184
0.0081,0.0023,0.0726,0.917
0.00755,0.0018,0.0752,0.91545
0.00705,0.00165,0.07755,0.91375
0.00665,0.00155,0.0806,0.9112
0.00585,0.0014,0.0832,0.90955
0.00535,0.0012,0.08575,0.9077
0.00455,0.00105,0.0887,0.9057
0.004,0.00105,0.0918,0.90315
0.0037,0.0011,0.0938,0.9014
0.003,0.00115,0.0971,0.89875
0.00285,0.00085,0.0996,0.8967
0.0028,0.00075,0.10245,0.894
0.00225,0.00075,0.105,0.892
0.002,0.0008,0.10825,0.88895
0.00195,0.0007,0.11075,0.8866
0.00175,0.0007,0.114,0.88355
0.00165,0.0006,0.1171,0.88065
0.00175,0.00065,0.11985,0.87775
0.00125,0.0008,0.12265,0.8753
0.00125,0.00085,0.12535,0.87255
0.0013,0.0007,0.128,0.87
0.0013,0.00055,0.1306,0.86755
0.0012,0.0006,0.13325,0.86495
0.0009,0.00065,0.1359,0.86255
0.001,0.00065,0.13865,0.8597
0.0009,0.0006,0.14195,0.85655
0.00095,0.0005,0.14445,0.8541
0.00085,0.0005,0.1469,0.85175
0.001,0.0004,0.1501,0.8485
0.00095,0.0004,0.1528,0.84585
0.00075,0.00045,0.15555,0.84325
0.00075,0.0006,0.15785,0.8408
0.00075,0.00065,0.16065,0.83795
0.00085,0.0005,0.16225,0.8364
0.00065,0.00065,0.16525,0.83345
0.0006,0.0007,0.1671,0.8316
0.00055,0.00065,0.1697,0.8291
0.00045,0.00065,0.17225,0.82665
0.0005,0.00065,0.17455,0.8243
0.0006,0.0005,0.17725,0.82165
0.00065,0.00055,0.179,0.8198
0.00085,0.00045,0.1814,0.8173
0.0009,0.0006,0.18335,0.81515
0.00105,0.00075,0.18525,0.81295
0.00115,0.0011,0.1876,0.81015
0.00135,0.00105,0.18955,0.80805
0.00135,0.00085,0.19185,0.80595
0.0014,0.0008,0.1938,0.804
0.00145,0.0009,0.19565,0.802
0.00145,0.00085,0.19795,0.79975
0.00165,0.0011,0.1997,0.79755
0.00155,0.0011,0.20115,0.7962
0.00165,0.00095,0.20235,0.79505
0.00145,0.001,0.20435,0.7932
0.0016,0.0009,0.20655,0.79095
0.0018,0.0006,0.20835,0.78925
0.00165,0.0007,0.2101,0.78755
0.0016,0.00065,0.21235,0.7854
0.00155,0.0007,0.2142,0.78355
0.00145,0.0008,0.21575,0.782
0.0015,0.00065,0.21885,0.779
0.00125,0.00075,0.22115,0.77685
0.0013,0.0008,0.22335,0.77455
0.00135,0.00085,0.22485,0.77295
0.0016,0.00075,0.2276,0.77005
0.00185,0.00075,0.2289,0.7685
0.0021,0.00085,0.2309,0.76615
0.00205,0.0009,0.23305,0.764
0.0017,0.0011,0.23535,0.76185
0.00175,0.00095,0.2374,0.7599
0.0018,0.00095,0.2394,0.75785
0.0019,0.00085,0.24065,0.7566
0.0019,0.0012,0.24185,0.75505
0.00215,0.0011,0.24355,0.7532
0.00215,0.00115,0.24485,0.75185
0.0021,0.0013,0.2463,0.7503
0.00195,0.00135,0.2477,0.749
0.00185,0.0014,0.24985,0.7469
0.0018,0.0016,0.251,0.7456
0.0021,0.00145,0.25255,0.7439
0.00225,0.0018,0.2537,0.74225
0.00215,0.0017,0.25605,0.7401
0.00225,0.0016,0.25785,0.7383
0.0024,0.0017,0.2593,0.7366
0.00255,0.00195,0.2612,0.7343
0.00285,0.00185,0.26355,0.73175
0.00305,0.00215,0.2653,0.7295
0.00315,0.00245,0.2665,0.7279
0.0033,0.0024,0.268,0.7263
0.00365,0.0027,0.26925,0.7244
0.00365,0.00285,0.27105,0.72245
0.00375,0.0034,0.27285,0.72
0.0042,0.0035,0.2738,0.7185
0.0047,0.0035,0.275,0.7168
0.00505,0.0035,0.2759,0.71555
0.0052,0.0033,0.2773,0.7142
0.00505,0.00425,0.27795,0.71275
0.0057,0.00365,0.27925,0.7114
0.0063,0.00355,0.27975,0.7104
0.0058,0.00435,0.28025,0.7096
0.00595,0.0049,0.2809,0.70825
0.00635,0.0048,0.28135,0.7075
0.00635,0.0051,0.28215,0.7064
0.00715,0.0051,0.2825,0.70525
0.008,0.00545,0.28335,0.7032
0.0094,0.0053,0.28305,0.70225
0.0098,0.00605,0.283,0.70115
0.01075,0.0057,0.2831,0.70045
0.0107,0.0063,0.28335,0.69965
0.01155,0.0064,0.28305,0.699
0.0115,0.00725,0.2825,0.69875
0.01185,0.0085,0.28115,0.6985
0.0125,0.009,0.28055,0.69795
0.0136,0.0091,0.2798,0.6975
0.014,0.00915,0.28025,0.6966
0.0144,0.01015,0.27935,0.6961
0.01495,0.0102,0.27825,0.6966
0.01525,0.0113,0.27605,0.6974
0.0168,0.0111,0.2753,0.6968
0.0178,0.0113,0.27355,0.69735
0.01785,0.01315,0.2711,0.6979
0.0194,0.01335,0.2687,0.69855
0.02035,0.01425,0.26625,0.69915
0.02145,0.01425,0.26455,0.69975
0.02275,0.015,0.2619,0.70035
0.02365,0.01585,0.25875,0.70175
0.02495,0.016,0.2569,0.70215
0.02685,0.0165,0.25375,0.7029
0.02805,0.01735,0.2506,0.704
0.029,0.0173,0.2478,0.7059
0.02895,0.018,0.2447,0.70835
0.02935,0.0185,0.24145,0.7107
0.0306,0.018,0.2389,0.7125
0.0315,0.01895,0.23665,0.7129
0.03255,0.01925,0.23355,0.71465
0.03385,0.01845,0.23045,0.71725
0.0342,0.0194,0.2277,0.7187
0.0355,0.0189,0.22495,0.72065
0.03625,0.01935,0.22115,0.72325
0.03675,0.0196,0.21775,0.7259
0.0376,0.0211,0.21315,0.72815
0.0384,0.0204,0.2107,0.7305
0.0389,0.0206,0.2072,0.7333
0.03925,0.02115,0.20355,0.73605
0.0401,0.0215,0.1998,0.7386
0.04065,0.02085,0.19705,0.74145
0.04095,0.02095,0.19405,0.74405
0.0417,0.02045,0.19085,0.747
0.04115,0.02105,0.1879,0.7499
0.04235,0.0206,0.1845,0.75255
0.04215,0.02075,0.1816,0.7555
0.04255,0.0201,0.1801,0.75725
0.0429,0.01985,0.17745,0.7598
0.0424,0.01965,0.17505,0.7629
0.04155,0.02135,0.1721,0.765
0.04235,0.02055,0.16965,0.76745
0.0432,0.01945,0.1678,0.76955
0.04215,0.01925,0.16565,0.77295
0.0429,0.0196,0.1626,0.7749
0.04325,0.0182,0.1616,0.77695
0.0428,0.01775,0.1603,0.77915
0.04155,0.0189,0.1585,0.78105
0.04055,0.01935,0.1561,0.784
0.0412,0.0187,0.15435,0.78575
0.04115,0.01785,0.1529,0.7881
0.042,0.017,0.1522,0.7888
0.04165,0.01775,0.14955,0.79105
0.04205,0.01555,0.1484,0.794
0.04075,0.0159,0.146,0.79735
0.03945,0.01495,0.1462,0.7994
0.039,0.01525,0.1455,0.80025
0.0379,0.014,0.1458,0.8023
0.0366,0.01405,0.14605,0.8033
0.03505,0.01475,0.14505,0.80515
0.0337,0.015,0.1453,0.806
0.03335,0.01415,0.1446,0.8079
0.03205,0.0149,0.1452,0.80785
0.0311,0.01475,0.1448,0.80935
0.0311,0.01405,0.14505,0.8098
0.02995,0.0134,0.1462,0.81045
0.0292,0.0139,0.147,0.8099
0.0288,0.01345,0.1477,0.81005
0.02915,0.01245,0.14955,0.80885
0.0294,0.0117,0.15055,0.80835
0.0282,0.0117,0.15125,0.80885
0.0278,0.01155,0.15275,0.8079
0.0267,0.01155,0.1539,0.80785
0.02615,0.01065,0.15445,0.80875
0.02555,0.01105,0.15655,0.80685
0.02535,0.0111,0.15755,0.806
0.0257,0.01125,0.1571,0.80595
0.0264,0.01045,0.158,0.80515
0.0268,0.00955,0.16,0.80365
0.0258,0.0096,0.1618,0.8028
0.02475,0.01095,0.1614,0.8029
0.02405,0.0112,0.16335,0.8014
0.02425,0.011,0.164,0.80075
0.02345,0.0118,0.1657,0.79905
0.02375,0.0106,0.168,0.79765
0.0234,0.0103,0.16945,0.79685
0.0229,0.01035,0.1704,0.79635
0.0224,0.0107,0.17155,0.79535
0.0221,0.0106,0.17305,0.79425
0.0213,0.01105,0.17335,0.7943
0.02125,0.01045,0.1744,0.7939
0.0211,0.01035,0.17565,0.7929
0.02075,0.01055,0.17685,0.79185
0.02065,0.0106,0.17865,0.7901
0.02065,0.00985,0.17995,0.78955
0.0208,0.0102,0.1819,0.7871
0.0206,0.01,0.18305,0.78635
0.02115,0.00915,0.186,0.7837
0.02095,0.01005,0.18785,0.78115
0.0213,0.0102,0.189,0.7795
0.0213,0.01095,0.18965,0.7781
0.02045,0.011,0.1911,0.77745
0.02045,0.01185,0.19205,0.77565
0.02055,0.01185,0.19355,0.77405
0.0205,0.011,0.1953,0.7732
0.02075,0.01135,0.1964,0.7715
0.02105,0.0111,0.19765,0.7702
0.0217,0.01095,0.19925,0.7681
0.0215,0.01135,0.1997,0.76745
0.02095,0.01205,0.2003,0.7667
0.02235,0.0109,0.20235,0.7644
0.02195,0.01135,0.20305,0.76365
0.0224,0.01205,0.20355,0.762
0.0234,0.0118,0.20475,0.76005
0.02335,0.01225,0.20475,0.75965
0.02325,0.01215,0.20535,0.75925
0.02385,0.0123,0.20555,0.7583
0.02475,0.01255,0.2062,0.7565
0.02495,0.0136,0.2067,0.75475
0.0251,0.0138,0.207,0.7541
0.0249,0.01455,0.20675,0.7538
0.0257,0.0142,0.2072,0.7529
0.0261,0.0135,0.20865,0.75175
0.02595,0.0144,0.20825,0.7514
0.02695,0.01485,0.20865,0.74955
0.0275,0.01485,0.2085,0.74915
0.02775,0.01475,0.20825,0.74925
0.02835,0.01475,0.20845,0.74845
0.02875,0.01475,0.20835,0.74815
0.02925,0.01555,0.20655,0.74865
0.0301,0.01555,0.2063,0.74805
0.03085,0.0152,0.2072,0.74675
0.0306,0.015,0.20695,0.74745
0.03075,0.015,0.20725,0.747
0.03,0.01645,0.20645,0.7471
0.03,0.0163,0.2063,0.7474
0.0303,0.01785,0.2048,0.74705
0.0315,0.01755,0.20435,0.7466
0.0319,0.0168,0.20345,0.74785
0.03345,0.01625,0.2024,0.7479
0.03285,0.01865,0.1998,0.7487
0.03405,0.01835,0.1987,0.7489
0.0344,0.0181,0.1981,0.7494
0.03605,0.0172,0.19765,0.7491
0.0353,0.0188,0.19635,0.74955
0.03615,0.0186,0.196,0.74925
0.036,0.01935,0.1956,0.74905
0.0368,0.0195,0.19455,0.74915
0.03685,0.0186,0.1944,0.75015
0.0373,0.01945,0.1929,0.75035
0.03805,0.01965,0.1911,0.7512
0.0384,0.0197,0.19,0.7519
0.0389,0.0197,0.18955,0.75185
0.03955,0.0193,0.1877,0.75345
0.04005,0.0192,0.1865,0.75425
0.03985,0.02045,0.18505,0.75465
0.04085,0.02,0.18365,0.7555
0.04095,0.02075,0.1817,0.7566
0.0418,0.0201,0.18,0.7581
0.0421,0.01905,0.1794,0.75945
0.0412,0.01955,0.1786,0.76065
0.0423,0.01825,0.17675,0.7627
0.04225,0.01895,0.17555,0.76325
0.0422,0.01955,0.1744,0.76385
0.04305,0.01985,0.172,0.7651
0.04295,0.0193,0.1719,0.76585
0.04305,0.01955,0.1708,0.7666
0.0423,0.0194,0.17035,0.76795
0.04115,0.01965,0.16925,0.76995
0.0409,0.0184,0.1698,0.7709
0.0403,0.01825,0.1687,0.77275
0.0392,0.0188,0.16775,0.77425
0.039,0.0177,0.16785,0.77545
0.03715,0.0182,0.16805,0.7766
0.03705,0.01795,0.16805,0.77695
0.03535,0.01835,0.16915,0.77715
0.0352,0.0173,0.17145,0.77605
0.03605,0.0168,0.1719,0.77525
0.035,0.01705,0.17285,0.7751
0.0355,0.0162,0.17425,0.77405
0.03455,0.01705,0.1742,0.7742
0.03545,0.0174,0.17385,0.7733
0.035,0.0167,0.17425,0.77405
0.03455,0.0176,0.17415,0.7737
0.0351,0.01705,0.1746,0.77325
0.03545,0.01785,0.17455,0.77215
0.0361,0.0165,0.1751,0.7723
0.03495,0.01665,0.17525,0.77315
0.03375,0.01655,0.1757,0.774
0.03305,0.0172,0.17605,0.7737
0.03435,0.0166,0.176,0.77305
0.0342,0.0172,0.17575,0.77285
0.03435,0.017,0.1758,0.77285
0.0358,0.01655,0.17545,0.7722
0.03545,0.01645,0.17615,0.77195
0.03435,0.01645,0.1757,0.7735
0.0353,0.01605,0.1753,0.77335
0.0359,0.01555,0.1754,0.77315
0.0352,0.0159,0.1753,0.7736
0.0354,0.01535,0.17635,0.7729
0.0364,0.01555,0.1765,0.77155
0.0366,0.0156,0.1763,0.7715
0.03635,0.0166,0.17585,0.7712
0.03505,0.0165,0.1753,0.77315
0.03515,0.01595,0.17615,0.77275
0.03405,0.01735,0.17575,0.77285
0.03495,0.01665,0.1762,0.7722
0.03565,0.01555,0.1767,0.7721
0.03555,0.0157,0.1771,0.77165
0.0347,0.0155,0.1785,0.7713
0.03425,0.016,0.1788,0.77095
0.0342,0.0171,0.17765,0.77105
0.0345,0.0174,0.17845,0.76965
0.0331,0.01695,0.17865,0.7713
0.03365,0.01575,0.17905,0.77155
0.03325,0.01525,0.1802,0.7713
0.03285,0.01615,0.1799,0.7711
0.0321,0.0168,0.18005,0.77105
0.0324,0.0157,0.18095,0.77095
0.03255,0.0159,0.18075,0.7708
0.0334,0.01655,0.18115,0.7689
0.0337,0.01635,0.17985,0.7701
0.03405,0.01685,0.17935,0.76975
0.0344,0.0156,0.1804,0.7696
0.03385,0.01775,0.1795,0.7689
0.03425,0.01755,0.17875,0.76945
0.03435,0.0171,0.17935,0.7692
0.0335,0.0179,0.18,0.7686
0.03485,0.0173,0.1798,0.76805
0.0344,0.0165,0.18055,0.76855
0.0348,0.01615,0.18175,0.7673
0.03565,0.01605,0.1817,0.7666
0.0353,0.01615,0.18125,0.7673
0.0353,0.0164,0.18095,0.76735
0.03505,0.01695,0.18095,0.76705
0.03435,0.0167,0.1807,0.76825
0.0347,0.01555,0.1814,0.76835
0.03435,0.01615,0.1809,0.7686
0.03405,0.01565,0.18165,0.76865
0.0342,0.0164,0.18065,0.76875
0.03535,0.0161,0.18015,0.7684
0.03615,0.01635,0.1795,0.768
0.03605,0.01655,0.1798,0.7676
0.03585,0.017,0.17895,0.7682
0.036,0.01775,0.17795,0.7683
0.036,0.0163,0.1801,0.7676
0.03605,0.0166,0.1804,0.76695
0.03535,0.01635,0.18105,0.76725
0.0348,0.01775,0.17985,0.7676
0.03525,0.0177,0.17845,0.7686
0.0358,0.0176,0.1777,0.7689
0.0357,0.01675,0.17875,0.7688
0.035,0.0162,0.17905,0.76975
0.03495,0.0166,0.179,0.76945
0.0347,0.0171,0.1784,0.7698
0.0341,0.0175,0.1787,0.7697
0.03455,0.0169,0.17875,0.7698
0.035,0.0165,0.1789,0.7696
0.0337,0.0171,0.1788,0.7704
0.0349,0.0167,0.17985,0.76855
0.03535,0.01595,0.17985,0.76885
0.0342,0.0166,0.17945,0.76975
0.034,0.0162,0.1804,0.7694
0.0344,0.0164,0.1802,0.769
0.0337,0.01705,0.18085,0.7684
0.0332,0.01715,0.18055,0.7691
0.0325,0.0176,0.18155,0.76835
0.0329,0.01655,0.1828,0.76775
0.03315,0.0168,0.18225,0.7678
0.0345,0.01605,0.1823,0.76715
0.03435,0.01645,0.18265,0.76655
0.034,0.01765,0.18205,0.7663
0.03345,0.0166,0.1822,0.76775
0.0334,0.0153,0.18225,0.76905
0.03265,0.0161,0.1818,0.76945
0.03255,0.01635,0.18115,0.76995
0.03275,0.016,0.18145,0.7698
0.0316,0.0164,0.18165,0.77035
0.03085,0.01705,0.1821,0.77
0.0308,0.01585,0.1829,0.77045
0.031,0.01565,0.18335,0.77
0.0307,0.01555,0.1836,0.77015
0.03025,0.0158,0.18455,0.7694
0.03095,0.01595,0.1852,0.7679
0.0311,0.0151,0.18565,0.76815
0.03135,0.0149,0.1858,0.76795
0.03075,0.0152,0.1855,0.76855
0.0318,0.0151,0.18505,0.76805
0.0319,0.01565,0.1851,0.76735
0.03315,0.0152,0.18515,0.7665
0.0333,0.01515,0.18595,0.7656
0.0316,0.0163,0.1857,0.7664
0.03185,0.01675,0.18535,0.76605
0.0326,0.0159,0.18695,0.76455
0.0331,0.01595,0.1869,0.76405
0.0328,0.0166,0.18685,0.76375
0.033,0.01625,0.1866,0.76415
0.0348,0.015,0.1873,0.7629
0.0339,0.0162,0.1879,0.762
0.0349,0.01625,0.1873,0.76155
0.03555,0.01505,0.1879,0.7615
0.0343,0.0165,0.1872,0.762
0.0346,0.016,0.18795,0.76145
0.03375,0.0164,0.18795,0.7619
0.0331,0.0172,0.1876,0.7621
0.0331,0.01685,0.18785,0.7622
0.0327,0.0177,0.1875,0.7621
0.03435,0.01645,0.18805,0.76115
0.03375,0.01685,0.1882,0.7612
0.03455,0.0164,0.1884,0.76065
0.035,0.01595,0.18835,0.7607
0.0351,0.0178,0.18575,0.76135
0.0345,0.01895,0.1848,0.76175
0.035,0.0187,0.1843,0.762
0.03425,0.01755,0.18555,0.76265
0.03445,0.017,0.1857,0.76285
0.0346,0.01725,0.1858,0.76235
0.034,0.0171,0.18615,0.76275
0.0346,0.01645,0.186,0.76295
0.03425,0.0167,0.18695,0.7621
0.0338,0.0166,0.1867,0.7629
0.034,0.0168,0.1866,0.7626
0.03365,0.01685,0.1867,0.7628
0.0329,0.0178,0.18605,0.76325
0.03385,0.01805,0.1868,0.7613
0.03415,0.01755,0.18655,0.76175
0.0326,0.01885,0.18565,0.7629
0.0329,0.0195,0.1858,0.7618
0.0337,0.01925,0.18515,0.7619
0.0349,0.01825,0.1851,0.76175
0.03585,0.01695,0.18545,0.76175
0.03565,0.01655,0.1846,0.7632
0.03485,0.01735,0.1847,0.7631
0.03445,0.0169,0.18485,0.7638
0.0355,0.01645,0.18345,0.7646
0.03545,0.01635,0.18315,0.76505
0.0348,0.01625,0.18295,0.766
0.0356,0.01605,0.1827,0.76565
0.03495,0.0162,0.1825,0.76635
0.0338,0.0163,0.18275,0.76715
0.03435,0.0161,0.1818,0.76775
0.0337,0.01685,0.1819,0.76755
0.03495,0.01665,0.18185,0.76655
0.03455,0.0174,0.18205,0.766
0.0348,0.01735,0.182,0.76585
0.0348,0.01765,0.18195,0.7656
0.03565,0.01755,0.1816,0.7652
0.0362,0.0168,0.18115,0.76585
0.03605,0.017,0.18115,0.7658
0.03665,0.01695,0.181,0.7654
0.0383,0.0161,0.1816,0.764
0.03785,0.01585,0.1818,0.7645
0.0376,0.0163,0.18165,0.76445
0.0372,0.0163,0.18175,0.76475
0.03725,0.0158,0.18255,0.7644
0.036,0.0162,0.18285,0.76495
0.03525,0.0171,0.18285,0.7648
0.03495,0.01715,0.1817,0.7662
0.03525,0.01705,0.18065,0.76705
0.03505,0.0166,0.18075,0.7676
0.03495,0.01675,0.1808,0.7675
0.034,0.01725,0.18045,0.7683
0.03435,0.01685,0.1803,0.7685
0.03445,0.0158,0.18165,0.7681
0.034,0.01545,0.18255,0.768
0.03435,0.0152,0.1826,0.76785
0.0339,0.01555,0.18335,0.7672
0.0339,0.0143,0.18485,0.76695
0.0327,0.0154,0.1851,0.7668
0.0317,0.01455,0.18625,0.7675
0.03145,0.0148,0.18635,0.7674
0.03095,0.0153,0.1863,0.76745
0.02995,0.01535,0.188,0.7667
0.03025,0.01505,0.18955,0.76515
0.02975,0.0157,0.1904,0.76415
0.031,0.01515,0.19125,0.7626
0.03085,0.0149,0.19255,0.7617
0.0299,0.0153,0.19355,0.76125
0.0309,0.0157,0.19315,0.76025
0.0318,0.0152,0.19415,0.75885
0.0306,0.01535,0.1941,0.75995
0.03045,0.0148,0.1958,0.75895
0.02895,0.01625,0.19545,0.75935
0.0302,0.01635,0.19475,0.7587
0.0304,0.016,0.19495,0.75865
0.03095,0.01525,0.19665,0.75715
0.03065,0.016,0.1962,0.75715
0.0307,0.01595,0.1954,0.75795
0.03145,0.01535,0.1956,0.7576
0.032,0.0146,0.1952,0.7582
0.03145,0.01535,0.19535,0.75785
0.03255,0.01515,0.1956,0.7567
0.0327,0.01465,0.19635,0.7563
0.03375,0.0149,0.1959,0.75545
0.0337,0.01555,0.19525,0.7555
0.03385,0.0161,0.19435,0.7557
0.03365,0.01625,0.19465,0.75545
0.03405,0.0166,0.19485,0.7545
0.0347,0.0166,0.19485,0.75385
0.03515,0.01715,0.19395,0.75375
0.03725,0.01675,0.1933,0.7527
0.03515,0.01755,0.19335,0.75395
0.03585,0.0181,0.19285,0.7532
0.0357,0.0188,0.1932,0.7523
0.0357,0.0184,0.1932,0.7527
0.0362,0.01845,0.1925,0.75285
0.03565,0.02025,0.19135,0.75275
0.0357,0.01985,0.19135,0.7531
0.0356,0.02035,0.19105,0.753
0.03655,0.0186,0.1906,0.75425
0.0377,0.01775,0.19015,0.7544
0.0371,0.01865,0.18985,0.7544
0.0364,0.01895,0.18975,0.7549
0.03685,0.01845,0.18945,0.75525
0.0372,0.01855,0.1891,0.75515
0.03805,0.01835,0.1882,0.7554
0.03785,0.0192,0.18695,0.756
0.03685,0.02005,0.18545,0.75765
0.038,0.02,0.18455,0.75745
0.03915,0.01925,0.1848,0.7568
0.04095,0.01855,0.18295,0.75755
0.04115,0.01725,0.18335,0.75825
0.04035,0.01865,0.18275,0.75825
0.03935,0.0184,0.1826,0.75965
0.0391,0.01835,0.1822,0.76035
0.03955,0.01855,0.1828,0.7591
0.0397,0.0177,0.18305,0.75955
0.0388,0.01825,0.18205,0.7609
0.0385,0.0177,0.18185,0.76195
0.03885,0.01785,0.18105,0.76225
0.0382,0.0182,0.1812,0.7624
0.0373,0.0186,0.18015,0.76395
0.03705,0.0177,0.181,0.76425
0.03645,0.0176,0.181,0.76495
0.03695,0.0181,0.1802,0.76475
0.0371,0.01865,0.17935,0.7649
0.0359,0.01935,0.1793,0.76545
0.03685,0.0177,0.17955,0.7659
0.03625,0.01745,0.17905,0.76725
0.03785,0.01615,0.17915,0.76685
0.0373,0.0162,0.17815,0.76835
0.0374,0.01695,0.17705,0.7686
0.03755,0.01675,0.17715,0.76855
0.03785,0.0163,0.1781,0.76775
0.03845,0.01545,0.1794,0.7667
0.03685,0.0165,0.17935,0.7673
0.0359,0.0169,0.17885,0.76835
0.0356,0.01685,0.1795,0.76805
0.03515,0.0184,0.1787,0.76775
0.0361,0.0197,0.17685,0.76735
0.03715,0.01915,0.1774,0.7663
0.0376,0.01915,0.1777,0.76555
0.03775,0.0189,0.17825,0.7651
0.03765,0.0195,0.178,0.76485
0.0378,0.0178,0.17915,0.76525
0.0376,0.01805,0.1793,0.76505
0.0373,0.0188,0.1785,0.7654
0.03805,0.01875,0.17875,0.76445
0.0386,0.01805,0.1781,0.76525
0.03795,0.01805,0.1779,0.7661
0.03755,0.01905,0.1765,0.7669
0.0382,0.019,0.17655,0.76625
0.0387,0.0192,0.1764,0.7657
0.0402,0.0194,0.1748,0.7656
0.03975,0.0196,0.1733,0.76735
0.03925,0.01915,0.17385,0.76775
0.03955,0.019,0.17515,0.7663
0.0398,0.01795,0.1756,0.76665
0.03895,0.01865,0.17505,0.76735
0.0387,0.0186,0.1748,0.7679
0.0388,0.01885,0.1742,0.76815
0.0392,0.01845,0.17415,0.7682
0.0392,0.0184,0.1743,0.7681
0.03925,0.0184,0.17475,0.7676
0.03935,0.01875,0.1745,0.7674
0.0393,0.01845,0.1735,0.76875
0.0397,0.0182,0.17315,0.76895
0.03925,0.0179,0.17295,0.7699
0.039,0.01775,0.1731,0.77015
0.04005,0.01795,0.17135,0.77065
0.04075,0.018,0.17,0.77125
0.0404,0.01935,0.16835,0.7719
0.04005,0.01925,0.16815,0.77255
0.0414,0.0196,0.16635,0.77265
0.04175,0.019,0.1651,0.77415
0.0402,0.01835,0.16645,0.775
0.04085,0.01885,0.1656,0.7747
0.0405,0.0174,0.16685,0.77525
0.03965,0.0165,0.16745,0.7764
0.03835,0.01725,0.1669,0.7775
0.0381,0.0175,0.1662,0.7782
0.0374,0.01855,0.16605,0.778
0.03845,0.0178,0.1673,0.77645
0.03815,0.0185,0.16675,0.7766
0.0387,0.01805,0.1669,0.77635
0.0382,0.01815,0.16805,0.7756
0.03835,0.01805,0.1676,0.776
0.0388,0.01825,0.1672,0.77575
0.03945,0.018,0.1679,0.77465
0.03895,0.01815,0.16795,0.77495
0.0392,0.01725,0.16795,0.7756
0.0386,0.01735,0.168,0.77605
0.0388,0.01765,0.16755,0.776
0.0389,0.0176,0.1663,0.7772
0.03845,0.018,0.1652,0.77835
0.03765,0.0172,0.166,0.77915
0.03745,0.01735,0.16635,0.77885
0.03715,0.01695,0.16715,0.77875
0.0355,0.0171,0.16765,0.77975
0.035,0.01725,0.167,0.78075
0.0346,0.01745,0.167,0.78095
0.03455,0.0163,0.1679,0.78125
0.03455,0.01635,0.16885,0.78025
0.0352,0.01615,0.1691,0.77955
0.03445,0.01595,0.17005,0.77955
0.03385,0.01545,0.17075,0.77995
0.03385,0.015,0.1714,0.77975
0.03355,0.0145,0.1733,0.77865
0.0329,0.0146,0.17365,0.77885
0.03335,0.01405,0.17425,0.77835
0.0335,0.01425,0.17475,0.7775
0.03255,0.0156,0.17445,0.7774
0.0323,0.01525,0.17495,0.7775
0.03225,0.01455,0.17535,0.77785
0.0327,0.0138,0.17565,0.77785
0.0313,0.01505,0.1756,0.77805
0.02975,0.01525,0.1765,0.7785
0.02985,0.0144,0.17725,0.7785
0.0295,0.01385,0.17865,0.778
0.02995,0.0135,0.17925,0.7773
0.02915,0.01395,0.18055,0.77635
0.02935,0.0142,0.181,0.77545
0.0284,0.0148,0.18085,0.77595
0.02845,0.01485,0.18075,0.77595
0.0277,0.01555,0.1806,0.77615
0.0297,0.01365,0.18175,0.7749
0.02985,0.014,0.1818,0.77435
0.02975,0.01345,0.1833,0.7735
0.0298,0.0135,0.1838,0.7729
0.02805,0.01465,0.1841,0.7732
0.02805,0.015,0.1848,0.77215
0.0287,0.0149,0.18535,0.77105
0.0292,0.0142,0.1864,0.7702
0.02865,0.01445,0.187,0.7699
0.02895,0.0146,0.18845,0.768
0.03005,0.01485,0.18895,0.76615
0.02975,0.0157,0.18855,0.766
0.0307,0.0149,0.18915,0.76525
0.0307,0.01545,0.18945,0.7644
