I,E,S,R
0.001000,0.000600,0.998400,0.000000
0.001050,0.001400,0.997450,0.000100
0.001300,0.002200,0.996300,0.000200
0.001700,0.002550,0.995400,0.000350
0.002250,0.002950,0.994300,0.000500
0.002900,0.004250,0.992050,0.000800
0.003950,0.006400,0.988750,0.000900
0.004950,0.008300,0.985350,0.001400
0.006950,0.010200,0.980850,0.002000
0.008450,0.013850,0.974600,0.003100
0.011300,0.016650,0.967500,0.004550
0.014200,0.022250,0.957500,0.006050
0.018400,0.029300,0.944650,0.007650
0.024200,0.039050,0.926850,0.009900
0.033100,0.048100,0.905500,0.013300
0.043450,0.061500,0.877850,0.017200
0.055350,0.076650,0.845200,0.022800
0.069300,0.096650,0.803200,0.030850
0.088300,0.118250,0.754500,0.038950
0.111850,0.139700,0.697950,0.050500
0.137700,0.163700,0.634200,0.064400
0.165250,0.187300,0.564000,0.083450
0.195650,0.208450,0.491500,0.104400
0.229800,0.224600,0.415650,0.129950
0.264300,0.232350,0.343200,0.160150
0.296750,0.231350,0.278000,0.193900
0.321600,0.227050,0.218550,0.232800
0.343550,0.210300,0.170450,0.275700
0.357950,0.191300,0.130350,0.320400
0.364800,0.169350,0.098350,0.367500
0.363900,0.146100,0.074000,0.416000
0.356150,0.123900,0.055750,0.464200
0.344450,0.101400,0.043950,0.510200
0.329000,0.082850,0.034850,0.553300
0.310600,0.067000,0.028800,0.593600
0.288600,0.053350,0.024250,0.633800
0.266450,0.042800,0.021150,0.669600
0.243300,0.035500,0.018400,0.702800
0.223250,0.027700,0.017750,0.731300
0.200800,0.022600,0.017150,0.759450
0.182850,0.019450,0.017000,0.780700
0.162600,0.015850,0.017450,0.804100
0.146900,0.013100,0.017850,0.822150
0.129850,0.010150,0.020250,0.839750
0.113900,0.009700,0.021600,0.854800
0.101400,0.008600,0.022200,0.867800
0.089350,0.007050,0.024000,0.879600
0.078250,0.006300,0.025550,0.889900
0.068850,0.005650,0.027750,0.897750
0.060750,0.005050,0.030050,0.904150
0.054500,0.005300,0.032400,0.907800
0.047800,0.005250,0.033950,0.913000
0.043450,0.005200,0.035550,0.915800
0.039400,0.004600,0.036950,0.919050
0.035250,0.003750,0.039600,0.921400
0.031150,0.003500,0.042950,0.922400
0.026900,0.003100,0.045350,0.924650
0.023800,0.003000,0.047950,0.925250
0.021450,0.002800,0.051350,0.924400
0.019000,0.002650,0.054150,0.924200
0.016550,0.002550,0.056400,0.924500
0.015250,0.002200,0.059050,0.923500
0.013550,0.002100,0.062050,0.922300
0.011900,0.002400,0.065300,0.920400
0.011250,0.002300,0.068500,0.917950
0.010550,0.002200,0.071050,0.916200
0.009400,0.002050,0.073800,0.914750
0.008900,0.002100,0.076700,0.912300
0.008250,0.002200,0.079150,0.910400
0.007750,0.002000,0.082450,0.907800
0.007050,0.001750,0.085400,0.905800
0.006500,0.001700,0.087800,0.904000
0.005850,0.001800,0.090300,0.902050
0.005750,0.001600,0.093150,0.899500
0.005050,0.001850,0.095100,0.898000
0.005050,0.001650,0.097300,0.896000
0.004850,0.001800,0.099900,0.893450
0.004700,0.001600,0.102850,0.890850
0.004350,0.001800,0.104600,0.889250
0.004350,0.001450,0.107900,0.886300
0.004100,0.001400,0.110950,0.883550
0.004150,0.001200,0.113800,0.880850
0.004000,0.001300,0.116800,0.877900
0.003850,0.001250,0.119600,0.875300
0.003650,0.001200,0.121700,0.873450
0.003500,0.001100,0.124500,0.870900
0.002750,0.001400,0.126550,0.869300
0.002650,0.001600,0.129200,0.866550
0.002550,0.001550,0.131300,0.864600
0.002450,0.001300,0.133450,0.862800
0.002400,0.001300,0.136150,0.860150
0.002400,0.001250,0.138150,0.858200
0.002100,0.001150,0.140400,0.856350
0.002200,0.001050,0.142900,0.853850
0.002150,0.001000,0.145050,0.851800
0.001950,0.000900,0.147650,0.849500
0.002050,0.001000,0.149950,0.847000
0.001900,0.000900,0.152800,0.844400
0.001750,0.001000,0.155300,0.841950
0.002050,0.000700,0.157650,0.839600
0.002000,0.000650,0.160350,0.837000
0.001750,0.000850,0.162350,0.835050
0.001950,0.000700,0.164450,0.832900
0.001800,0.001200,0.166600,0.830400
0.001850,0.001200,0.169250,0.827700
0.001750,0.001050,0.171050,0.826150
0.001750,0.001100,0.173000,0.824150
0.001900,0.000950,0.175650,0.821500
0.001850,0.001300,0.177350,0.819500
0.002000,0.001300,0.180000,0.816700
0.002200,0.001050,0.181800,0.814950
0.002350,0.000950,0.184100,0.812600
0.002050,0.001100,0.186100,0.810750
0.002200,0.001000,0.188000,0.808800
0.002100,0.001100,0.190050,0.806750
0.002300,0.000850,0.192000,0.804850
0.002050,0.001250,0.194300,0.802400
0.002050,0.001350,0.196400,0.800200
0.002150,0.001150,0.199050,0.797650
0.002350,0.001000,0.201800,0.794850
0.002150,0.001350,0.203700,0.792800
0.002150,0.001300,0.205750,0.790800
0.002150,0.001350,0.206750,0.789750
0.002050,0.001300,0.209050,0.787600
0.002250,0.001300,0.210950,0.785500
0.002300,0.001200,0.213250,0.783250
0.002300,0.001500,0.215350,0.780850
0.002350,0.001400,0.217350,0.778900
0.002500,0.001250,0.219250,0.777000
0.002550,0.001250,0.221250,0.774950
0.002350,0.001250,0.222800,0.773600
0.002500,0.000950,0.224600,0.771950
0.002400,0.001150,0.226300,0.770150
0.002750,0.001050,0.228300,0.767900
0.002750,0.001300,0.230200,0.765750
0.002400,0.001700,0.232450,0.763450
0.002750,0.001950,0.234150,0.761150
0.002950,0.001700,0.235750,0.759600
0.003050,0.001650,0.237600,0.757700
0.003300,0.001700,0.239900,0.755100
0.003050,0.002050,0.241600,0.753300
0.003550,0.002000,0.243150,0.751300
0.003150,0.002300,0.244850,0.749700
0.003250,0.002200,0.246800,0.747750
0.004100,0.001950,0.247750,0.746200
0.003550,0.002100,0.249050,0.745300
0.003700,0.002050,0.250750,0.743500
0.003650,0.002000,0.252550,0.741800
0.003800,0.002150,0.253900,0.740150
0.003600,0.002100,0.255500,0.738800
0.003550,0.002800,0.256200,0.737450
0.003750,0.002800,0.257650,0.735800
0.003900,0.002550,0.259200,0.734350
0.004000,0.002350,0.260000,0.733650
0.004050,0.002700,0.261150,0.732100
0.003850,0.002950,0.261900,0.731300
0.003950,0.002700,0.263050,0.730300
0.004250,0.002650,0.265050,0.728050
0.004750,0.002550,0.266500,0.726200
0.004650,0.002650,0.267950,0.724750
0.004750,0.002700,0.269300,0.723250
0.005300,0.002400,0.270600,0.721700
0.005350,0.003050,0.271900,0.719700
0.005350,0.003200,0.272950,0.718500
0.006250,0.003600,0.273500,0.716650
0.006200,0.003950,0.273900,0.715950
0.006850,0.003800,0.274850,0.714500
0.007200,0.004200,0.275900,0.712700
0.008000,0.003500,0.277700,0.710800
0.007900,0.004100,0.278900,0.709100
0.008350,0.004950,0.278600,0.708100
0.008750,0.004900,0.279600,0.706750
0.009000,0.005400,0.279600,0.706000
0.010050,0.006050,0.278850,0.705050
0.009700,0.006450,0.279150,0.704700
0.010600,0.006600,0.279400,0.703400
0.011050,0.007300,0.279350,0.702300
0.011000,0.008850,0.278450,0.701700
0.012500,0.009150,0.277000,0.701350
0.014100,0.009050,0.276150,0.700700
0.014900,0.010000,0.274850,0.700250
0.016650,0.009950,0.273850,0.699550
0.016950,0.010450,0.273000,0.699600
0.017250,0.011700,0.271000,0.700050
0.018450,0.011350,0.269650,0.700550
0.018900,0.012050,0.268500,0.700550
0.020600,0.011950,0.266150,0.701300
0.021500,0.013000,0.265000,0.700500
0.022200,0.014150,0.261700,0.701950
0.023950,0.014750,0.259600,0.701700
0.024200,0.014350,0.258500,0.702950
0.024650,0.015850,0.256250,0.703250
0.025500,0.016850,0.253150,0.704500
0.026450,0.017400,0.249250,0.706900
0.028000,0.017200,0.246600,0.708200
0.029700,0.017900,0.243050,0.709350
0.030750,0.018250,0.239650,0.711350
0.032950,0.018600,0.236150,0.712300
0.033250,0.019400,0.233600,0.713750
0.035950,0.020200,0.228700,0.715150
0.036150,0.020700,0.224950,0.718200
0.035200,0.021950,0.221500,0.721350
0.036600,0.020250,0.219750,0.723400
0.038300,0.020300,0.216000,0.725400
0.038550,0.021100,0.212400,0.727950
0.040300,0.022050,0.206950,0.730700
0.041700,0.022750,0.202000,0.733550
0.043800,0.022450,0.198300,0.735450
0.044850,0.022950,0.195050,0.737150
0.044650,0.023400,0.191600,0.740350
0.045150,0.023900,0.187300,0.743650
0.045200,0.024450,0.184200,0.746150
0.045400,0.024900,0.180000,0.749700
0.047150,0.023750,0.176600,0.752500
0.048150,0.021950,0.174300,0.755600
0.047700,0.022200,0.170850,0.759250
0.049300,0.021350,0.167250,0.762100
0.049600,0.020750,0.164250,0.765400
0.049400,0.021000,0.160350,0.769250
0.048350,0.020750,0.159000,0.771900
0.048050,0.020750,0.156550,0.774650
0.046750,0.020050,0.155150,0.778050
0.046350,0.019400,0.153650,0.780600
0.045800,0.018500,0.152050,0.783650
0.045550,0.018750,0.149700,0.786000
0.043900,0.018950,0.149300,0.787850
0.043250,0.020050,0.147300,0.789400
0.044050,0.018550,0.145900,0.791500
0.043750,0.017650,0.144950,0.793650
0.042500,0.018100,0.143750,0.795650
0.041500,0.017750,0.143000,0.797750
0.041650,0.018100,0.141100,0.799150
0.041250,0.016550,0.141500,0.800700
0.040050,0.016850,0.140600,0.802500
0.039650,0.016250,0.140950,0.803150
0.037300,0.015400,0.141750,0.805550
0.036300,0.015700,0.141300,0.806700
0.035750,0.015200,0.141100,0.807950
0.035100,0.014200,0.141550,0.809150
0.034350,0.013650,0.141750,0.810250
0.033950,0.012250,0.141950,0.811850
0.032500,0.011700,0.143400,0.812400
0.031900,0.012100,0.143300,0.812700
0.030750,0.012250,0.143950,0.813050
0.030050,0.010900,0.145000,0.814050
0.028950,0.010550,0.146150,0.814350
0.028550,0.010550,0.147550,0.813350
0.027800,0.010850,0.147950,0.813400
0.027350,0.010400,0.150250,0.812000
0.026600,0.010100,0.152750,0.810550
0.025300,0.009700,0.154850,0.810150
0.025400,0.009600,0.156350,0.808650
0.024150,0.010250,0.156750,0.808850
0.023750,0.010150,0.158550,0.807550
0.023000,0.010600,0.159050,0.807350
0.022900,0.009750,0.161000,0.806350
0.023150,0.009350,0.162200,0.805300
0.022400,0.009350,0.164900,0.803350
0.022050,0.009400,0.165700,0.802850
0.022450,0.009950,0.167450,0.800150
0.021550,0.010050,0.169700,0.798700
0.021700,0.009850,0.171300,0.797150
0.021700,0.009500,0.173550,0.795250
0.022050,0.009450,0.176050,0.792450
0.020850,0.009700,0.178100,0.791350
0.021000,0.009500,0.179850,0.789650
0.020800,0.009600,0.181200,0.788400
0.021250,0.010000,0.182850,0.785900
0.020800,0.009800,0.184550,0.784850
0.020000,0.009450,0.186850,0.783700
0.020400,0.009500,0.188200,0.781900
0.020800,0.009100,0.189600,0.780500
0.020450,0.008950,0.191900,0.778700
0.020750,0.009250,0.192900,0.777100
0.019750,0.010350,0.193350,0.776550
0.020150,0.009550,0.195400,0.774900
0.020850,0.010300,0.195500,0.773350
0.021200,0.010100,0.197000,0.771700
0.021500,0.009950,0.198100,0.770450
0.020650,0.010450,0.199000,0.769900
0.021050,0.009750,0.201100,0.768100
0.020700,0.010300,0.201700,0.767300
0.020650,0.010300,0.203400,0.765650
0.021150,0.010050,0.204050,0.764750
0.020900,0.010150,0.205550,0.763400
0.021350,0.010500,0.206200,0.761950
0.021400,0.011300,0.206500,0.760800
0.021500,0.011100,0.208350,0.759050
0.021550,0.011400,0.209700,0.757350
0.021850,0.011250,0.210750,0.756150
0.021950,0.011900,0.211650,0.754500
0.022650,0.012250,0.212100,0.753000
0.022750,0.012500,0.213000,0.751750
0.022400,0.012750,0.214450,0.750400
0.022900,0.012600,0.215950,0.748550
0.022750,0.013500,0.215600,0.748150
0.024050,0.012450,0.215950,0.747550
0.024800,0.012150,0.216400,0.746650
0.024850,0.012750,0.217250,0.745150
0.025050,0.013100,0.218250,0.743600
0.025350,0.013450,0.218400,0.742800
0.025550,0.013100,0.218500,0.742850
0.024900,0.013850,0.218800,0.742450
0.025450,0.015250,0.217500,0.741800
0.025350,0.017000,0.216700,0.740950
0.026900,0.017000,0.216000,0.740100
0.028250,0.016200,0.216300,0.739250
0.029450,0.016600,0.216000,0.737950
0.030350,0.016600,0.215650,0.737400
0.030450,0.016800,0.214900,0.737850
0.031050,0.017450,0.214500,0.737000
0.032700,0.017200,0.212200,0.737900
0.033000,0.017000,0.210700,0.739300
0.033750,0.017150,0.208450,0.740650
0.033850,0.017850,0.207450,0.740850
0.035200,0.017700,0.206200,0.740900
0.035950,0.016850,0.206150,0.741050
0.036750,0.016400,0.205300,0.741550
0.036000,0.017350,0.203950,0.742700
0.035100,0.018600,0.203100,0.743200
0.036350,0.019300,0.201450,0.742900
0.037550,0.018300,0.200600,0.743550
0.036750,0.018700,0.200400,0.744150
0.038150,0.018450,0.200300,0.743100
0.037500,0.018700,0.198900,0.744900
0.036600,0.019350,0.197950,0.746100
0.038300,0.019050,0.196100,0.746550
0.039750,0.019400,0.194200,0.746650
0.039250,0.020000,0.193100,0.747650
0.039800,0.019650,0.192650,0.747900
0.039950,0.018750,0.192450,0.748850
0.040750,0.019400,0.189800,0.750050
0.040650,0.020000,0.188350,0.751000
0.041100,0.020550,0.187050,0.751300
0.040750,0.021700,0.185050,0.752500
0.040650,0.021650,0.183500,0.754200
0.041550,0.022000,0.181450,0.755000
0.041750,0.021250,0.181300,0.755700
0.042800,0.020650,0.180400,0.756150
0.042550,0.020450,0.180050,0.756950
0.041900,0.021400,0.178200,0.758500
0.041850,0.021300,0.176950,0.759900
0.043400,0.020250,0.177400,0.758950
0.043750,0.020100,0.176600,0.759550
0.042050,0.020650,0.176350,0.760950
0.042000,0.020200,0.176500,0.761300
0.042400,0.019400,0.176750,0.761450
0.042150,0.020000,0.175800,0.762050
0.041800,0.019750,0.174750,0.763700
0.041600,0.020450,0.173300,0.764650
0.041050,0.020800,0.171700,0.766450
0.041650,0.019950,0.171400,0.767000
0.041800,0.020150,0.171150,0.766900
0.041450,0.019400,0.170850,0.768300
0.040600,0.019850,0.170900,0.768650
0.041300,0.018850,0.170350,0.769500
0.041800,0.019800,0.170500,0.767900
0.042000,0.018450,0.171100,0.768450
0.041650,0.018300,0.170050,0.770000
0.041600,0.017350,0.169950,0.771100
0.042150,0.016150,0.169050,0.772650
0.040300,0.018150,0.167650,0.773900
0.040250,0.017350,0.168000,0.774400
0.039700,0.017600,0.167400,0.775300
0.039050,0.017400,0.167250,0.776300
0.038600,0.017150,0.167150,0.777100
0.037750,0.018100,0.167850,0.776300
0.036750,0.019250,0.165900,0.778100
0.037600,0.018200,0.166150,0.778050
0.037850,0.017800,0.167100,0.777250
0.038350,0.017500,0.167050,0.777100
0.038400,0.017800,0.166950,0.776850
0.039350,0.017000,0.166850,0.776800
0.038700,0.017300,0.166450,0.777550
0.038800,0.018150,0.165850,0.777200
0.039000,0.018000,0.166800,0.776200
0.039000,0.018200,0.166800,0.776000
0.040250,0.017600,0.166100,0.776050
0.038600,0.017650,0.166700,0.777050
0.037800,0.019150,0.166250,0.776800
0.037850,0.018550,0.166200,0.777400
0.038250,0.018450,0.165600,0.777700
0.037150,0.018050,0.166250,0.778550
0.036750,0.016900,0.167900,0.778450
0.035650,0.016300,0.169500,0.778550
0.035000,0.015900,0.169850,0.779250
0.035450,0.015700,0.170100,0.778750
0.035200,0.015000,0.170450,0.779350
0.035200,0.015150,0.171450,0.778200
0.035550,0.015100,0.171200,0.778150
0.035650,0.014650,0.171350,0.778350
0.034950,0.014600,0.171950,0.778500
0.034550,0.015050,0.172750,0.777650
0.033600,0.015300,0.174250,0.776850
0.033300,0.015250,0.175150,0.776300
0.032550,0.015950,0.174850,0.776650
0.032800,0.014550,0.176250,0.776400
0.032200,0.014450,0.176900,0.776450
0.031600,0.014800,0.177950,0.775650
0.031150,0.015700,0.178400,0.774750
0.031600,0.015100,0.178850,0.774450
0.031950,0.014250,0.179850,0.773950
0.031400,0.014650,0.180250,0.773700
0.030750,0.015250,0.180550,0.773450
0.030200,0.016100,0.180750,0.772950
0.031350,0.014900,0.181650,0.772100
0.032350,0.014550,0.181400,0.771700
0.032250,0.015500,0.181350,0.770900
0.032650,0.015400,0.180850,0.771100
0.032450,0.016250,0.180550,0.770750
0.033050,0.016600,0.180450,0.769900
0.033800,0.015750,0.181750,0.768700
0.034700,0.016050,0.181350,0.767900
0.034500,0.016850,0.181700,0.766950
0.033000,0.017200,0.181950,0.767850
0.033100,0.016500,0.182700,0.767700
0.033050,0.017450,0.182950,0.766550
0.033650,0.017900,0.182950,0.765500
0.034200,0.017950,0.182900,0.764950
0.035550,0.016900,0.183050,0.764500
0.035550,0.017400,0.182200,0.764850
0.034400,0.018250,0.181500,0.765850
0.034600,0.019200,0.181800,0.764400
0.035500,0.018400,0.182050,0.764050
0.036850,0.017800,0.182250,0.763100
0.036950,0.016200,0.183200,0.763650
0.036300,0.016600,0.182750,0.764350
0.036700,0.016750,0.182300,0.764250
0.036850,0.017350,0.181600,0.764200
0.036950,0.017750,0.180050,0.765250
0.037250,0.018600,0.178350,0.765800
0.037400,0.018600,0.177700,0.766300
0.038250,0.016700,0.178350,0.766700
0.038050,0.016550,0.177300,0.768100
0.038000,0.016200,0.176500,0.769300
0.038550,0.017150,0.175650,0.768650
0.038550,0.017250,0.174200,0.770000
0.038450,0.017500,0.174100,0.769950
0.037950,0.018850,0.172950,0.770250
0.037950,0.018650,0.172950,0.770450
0.038000,0.019700,0.172000,0.770300
0.038150,0.019400,0.172250,0.770200
0.039200,0.019000,0.171650,0.770150
0.039200,0.019300,0.171050,0.770450
0.039600,0.018500,0.171100,0.770800
0.039800,0.018100,0.170100,0.772000
0.039850,0.018600,0.168450,0.773100
0.039450,0.019600,0.166500,0.774450
0.039150,0.019750,0.166350,0.774750
0.040300,0.018350,0.166200,0.775150
0.039850,0.017450,0.166600,0.776100
0.040100,0.017650,0.165750,0.776500
0.040200,0.017050,0.165650,0.777100
0.040150,0.017400,0.164900,0.777550
0.040300,0.017000,0.164650,0.778050
0.038700,0.017850,0.163550,0.779900
0.039250,0.017150,0.164000,0.779600
0.039050,0.016850,0.164350,0.779750
0.038950,0.017350,0.163700,0.780000
0.037000,0.017700,0.163750,0.781550
0.037100,0.016950,0.164000,0.781950
0.036100,0.016950,0.164300,0.782650
0.034600,0.017600,0.163500,0.784300
0.033650,0.017600,0.163850,0.784900
0.034000,0.017050,0.163950,0.785000
0.035100,0.015700,0.164150,0.785050
0.033500,0.016750,0.165000,0.784750
0.033800,0.015900,0.165600,0.784700
0.032850,0.015800,0.166250,0.785100
0.033250,0.016000,0.165950,0.784800
0.033750,0.015700,0.166050,0.784500
0.033650,0.015200,0.166450,0.784700
0.033200,0.016150,0.167200,0.783450
0.034000,0.014850,0.168750,0.782400
0.033000,0.015900,0.168450,0.782650
0.033950,0.015700,0.169900,0.780450
0.033200,0.016050,0.170650,0.780100
0.033200,0.015850,0.170650,0.780300
0.032700,0.016550,0.171100,0.779650
0.033350,0.017300,0.170500,0.778850
0.033400,0.017900,0.170200,0.778500
0.034750,0.016900,0.169350,0.779000
0.035250,0.016450,0.170700,0.777600
0.035050,0.016000,0.170600,0.778350
0.035400,0.016350,0.171200,0.777050
0.034750,0.016250,0.171650,0.777350
0.035100,0.015950,0.172250,0.776700
0.034300,0.016150,0.172450,0.777100
0.033750,0.015750,0.172950,0.777550
0.033900,0.015100,0.174700,0.776300
0.033450,0.015150,0.175800,0.775600
0.033400,0.015900,0.176900,0.773800
0.032550,0.015750,0.176700,0.775000
0.032150,0.015150,0.178050,0.774650
0.032500,0.014750,0.178500,0.774250
0.032750,0.015000,0.179200,0.773050
0.033850,0.014500,0.178900,0.772750
0.034200,0.014500,0.179550,0.771750
0.033250,0.015050,0.180550,0.771150
0.034000,0.015100,0.180550,0.770350
0.033000,0.015650,0.180450,0.770900
0.032350,0.015250,0.181150,0.771250
0.032450,0.015550,0.180300,0.771700
0.032600,0.016600,0.180100,0.770700
0.034200,0.015500,0.180050,0.770250
0.033000,0.015600,0.180350,0.771050
0.033850,0.014700,0.181250,0.770200
0.033600,0.016500,0.180000,0.769900
0.034350,0.015200,0.180800,0.769650
0.033350,0.015050,0.181700,0.769900
0.033700,0.015750,0.180950,0.769600
0.032850,0.016800,0.180600,0.769750
0.033550,0.016950,0.180700,0.768800
0.034550,0.015500,0.182000,0.767950
0.034300,0.015400,0.183250,0.767050
0.033700,0.016550,0.183000,0.766750
0.034000,0.015050,0.184750,0.766200
0.033650,0.014800,0.185650,0.765900
0.033650,0.014400,0.186050,0.765900
0.033500,0.014850,0.186100,0.765550
0.032350,0.016900,0.185750,0.765000
0.032900,0.016050,0.185750,0.765300
0.031950,0.016450,0.186050,0.765550
0.032450,0.015950,0.186500,0.765100
0.033150,0.015450,0.185750,0.765650
0.033500,0.015550,0.185850,0.765100
0.032750,0.015300,0.186250,0.765700
0.032250,0.016150,0.185950,0.765650
0.032600,0.017400,0.184700,0.765300
0.032950,0.016750,0.185350,0.764950
0.033700,0.016750,0.185150,0.764400
0.033800,0.016900,0.185550,0.763750
0.035050,0.016700,0.184600,0.763650
0.033850,0.017900,0.183900,0.764350
0.034400,0.017000,0.182850,0.765750
0.033550,0.017500,0.182000,0.766950
0.034850,0.016700,0.182350,0.766100
0.035700,0.015950,0.182950,0.765400
0.035300,0.016800,0.181750,0.766150
0.035500,0.018000,0.180950,0.765550
0.036300,0.017750,0.180200,0.765750
0.036500,0.017250,0.181250,0.765000
0.036400,0.017000,0.181500,0.765100
0.036950,0.016450,0.181400,0.765200
0.035600,0.016250,0.183000,0.765150
0.035150,0.016000,0.183850,0.765000
0.035450,0.015100,0.183700,0.765750
0.033850,0.016200,0.183400,0.766550
0.033150,0.016050,0.183950,0.766850
0.033950,0.015200,0.185250,0.765600
0.032900,0.015800,0.186400,0.764900
0.032650,0.015700,0.187350,0.764300
0.033300,0.015800,0.186800,0.764100
0.033150,0.015900,0.187450,0.763500
0.032750,0.015000,0.187750,0.764500
0.033050,0.014700,0.188950,0.763300
0.033300,0.015650,0.189600,0.761450
0.032950,0.016250,0.189400,0.761400
0.033800,0.016100,0.189150,0.760950
0.033850,0.016050,0.189450,0.760650
0.034400,0.015950,0.189600,0.760050
0.034850,0.016650,0.188500,0.760000
0.036450,0.015450,0.189750,0.758350
0.036200,0.015800,0.189800,0.758200
0.035550,0.015300,0.190600,0.758550
0.035450,0.016650,0.190350,0.757550
0.034900,0.018100,0.189850,0.757150
0.035450,0.017950,0.190350,0.756250
0.035750,0.018400,0.188900,0.756950
0.035350,0.017700,0.188700,0.758250
0.035650,0.017500,0.188150,0.758700
0.035050,0.017800,0.188300,0.758850
0.035950,0.016650,0.190000,0.757400
0.035300,0.016750,0.189500,0.758450
0.034550,0.017500,0.188700,0.759250
0.034450,0.018900,0.187700,0.758950
0.035600,0.017750,0.187700,0.758950
0.036550,0.017600,0.188350,0.757500
0.036850,0.017250,0.187700,0.758200
0.036550,0.017650,0.187450,0.758350
0.036550,0.017950,0.186700,0.758800
0.036800,0.018550,0.185550,0.759100
0.037800,0.018000,0.185400,0.758800
0.038000,0.017750,0.185050,0.759200
0.037800,0.016850,0.186150,0.759200
0.036900,0.018500,0.184950,0.759650
0.037450,0.017500,0.185750,0.759300
0.037800,0.017400,0.185900,0.758900
0.037500,0.017350,0.185750,0.759400
0.037600,0.017100,0.186400,0.758900
0.037600,0.017500,0.186450,0.758450
0.037650,0.017500,0.186950,0.757900
0.037550,0.018750,0.186550,0.757150
0.038000,0.018850,0.186500,0.756650
0.037900,0.018900,0.186200,0.757000
0.039600,0.018950,0.186150,0.755300
0.039300,0.018750,0.185800,0.756150
0.040150,0.017800,0.185350,0.756700
0.040000,0.018200,0.185650,0.756150
0.039950,0.018300,0.186200,0.755550
0.039900,0.017700,0.186200,0.756200
0.039400,0.018650,0.185100,0.756850
0.039550,0.018300,0.185550,0.756600
0.038850,0.019500,0.185000,0.756650
0.039350,0.020300,0.182750,0.757600
0.040650,0.020400,0.181250,0.757700
0.040400,0.020150,0.181700,0.757750
0.040750,0.019600,0.181500,0.758150
0.040750,0.019400,0.180500,0.759350
0.041300,0.019650,0.179550,0.759500
0.042150,0.019400,0.178350,0.760100
0.041700,0.020050,0.176250,0.762000
0.042250,0.019550,0.176000,0.762200
0.043150,0.018600,0.175250,0.763000
0.041750,0.019200,0.174400,0.764650
0.041050,0.019400,0.174100,0.765450
0.040750,0.020000,0.173000,0.766250
0.040750,0.019450,0.174100,0.765700
0.040900,0.018850,0.174450,0.765800
0.042300,0.018150,0.172850,0.766700
0.041600,0.018250,0.172400,0.767750
0.041700,0.018900,0.171550,0.767850
0.041650,0.018350,0.170800,0.769200
0.040450,0.019750,0.169650,0.770150
0.040300,0.019000,0.168950,0.771750
0.040500,0.019900,0.167900,0.771700
0.040300,0.020000,0.167150,0.772550
0.041000,0.019400,0.167150,0.772450
0.039200,0.019650,0.166650,0.774500
0.038950,0.019250,0.166700,0.775100
0.038450,0.019050,0.167750,0.774750
0.038650,0.018150,0.168750,0.774450
0.038050,0.018300,0.168200,0.775450
0.037950,0.018450,0.167750,0.775850
0.038250,0.018100,0.167800,0.775850
0.037550,0.019250,0.166700,0.776500
0.038650,0.018700,0.166750,0.775900
0.040050,0.018100,0.166850,0.775000
0.038800,0.018150,0.166750,0.776300
0.038700,0.017600,0.167900,0.775800
0.039000,0.018100,0.167100,0.775800
0.037850,0.017250,0.167850,0.777050
0.038200,0.017150,0.168400,0.776250
0.038650,0.016750,0.168450,0.776150
0.039000,0.015450,0.169700,0.775850
0.038400,0.014850,0.170300,0.776450
0.037500,0.015050,0.170200,0.777250
0.037350,0.017000,0.168650,0.777000
0.037300,0.017500,0.168650,0.776550
0.037950,0.016850,0.169000,0.776200
0.038700,0.016950,0.168550,0.775800
0.038150,0.017050,0.169200,0.775600
0.037800,0.016950,0.168250,0.777000
0.037600,0.016150,0.168500,0.777750
0.037500,0.016050,0.168950,0.777500
0.036400,0.016800,0.169400,0.777400
0.036650,0.015850,0.170650,0.776850
0.035750,0.016050,0.171000,0.777200
0.035800,0.016150,0.171000,0.777050
0.036050,0.015550,0.171100,0.777300
0.035550,0.016400,0.171200,0.776850
0.035100,0.016000,0.171750,0.777150
0.035200,0.016450,0.171650,0.776700
0.034300,0.016850,0.172600,0.776250
0.033850,0.017300,0.173350,0.775500
0.033850,0.017200,0.173850,0.775100
0.035150,0.016700,0.173900,0.774250
0.035600,0.015750,0.175250,0.773400
0.035000,0.016650,0.175050,0.773300
0.034800,0.016800,0.174000,0.774400
0.035050,0.016400,0.175600,0.772950
0.035350,0.015500,0.175950,0.773200
0.035150,0.015750,0.176950,0.772150
0.034150,0.017750,0.177300,0.770800
0.034800,0.017500,0.177400,0.770300
0.035750,0.016450,0.178050,0.769750
0.034300,0.017550,0.178150,0.770000
0.034000,0.017300,0.178900,0.769800
0.034950,0.016250,0.178950,0.769850
0.034200,0.017100,0.178950,0.769750
0.035800,0.015350,0.179250,0.769600
0.035100,0.015450,0.179050,0.770400
0.034700,0.017000,0.179250,0.769050
0.034350,0.017600,0.179400,0.768650
0.034500,0.018300,0.179050,0.768150
0.035100,0.018250,0.179150,0.767500
0.035600,0.017950,0.177650,0.768800
0.035500,0.017750,0.178100,0.768650
0.036300,0.017800,0.177300,0.768600
0.036100,0.016950,0.177650,0.769300
0.035700,0.016850,0.178100,0.769350
0.035050,0.017000,0.177600,0.770350
0.035200,0.018200,0.178050,0.768550
0.034100,0.019300,0.177950,0.768650
0.034800,0.018600,0.177050,0.769550
0.036100,0.018750,0.177300,0.767850
0.036450,0.018550,0.178150,0.766850
0.036500,0.018550,0.177400,0.767550
0.035650,0.017050,0.178200,0.769100
0.036100,0.016900,0.178050,0.768950
0.035900,0.016550,0.178150,0.769400
0.035700,0.016950,0.178150,0.769200
0.035700,0.017400,0.177200,0.769700
0.035400,0.016950,0.176400,0.771250
0.035050,0.017300,0.176300,0.771350
0.035400,0.016300,0.176050,0.772250
0.035700,0.016500,0.175300,0.772500
0.035600,0.016900,0.174100,0.773400
0.035350,0.016700,0.174550,0.773400
0.036450,0.015500,0.176050,0.772000
0.034950,0.016100,0.175700,0.773250
0.035300,0.016200,0.175400,0.773100
0.035400,0.016150,0.175350,0.773100
0.034650,0.016550,0.176450,0.772350
0.035000,0.016550,0.176050,0.772400
0.034600,0.015600,0.177500,0.772300
0.034050,0.016300,0.177500,0.772150
0.033350,0.017200,0.177350,0.772100
0.034350,0.017150,0.177100,0.771400
0.035100,0.015950,0.177800,0.771150
0.034900,0.015650,0.177550,0.771900
0.034550,0.016950,0.176900,0.771600
0.035750,0.016650,0.176500,0.771100
0.035400,0.017900,0.175900,0.770800
0.035300,0.017700,0.177500,0.769500
0.035150,0.017400,0.177100,0.770350
0.036200,0.016700,0.178300,0.768800
0.036550,0.016750,0.178500,0.768200
0.036600,0.017000,0.178050,0.768350
0.037000,0.017150,0.176900,0.768950
