I,E,S,R
0.001000,0.000900,0.998100,0.000000
0.001050,0.001300,0.997500,0.000150
0.001200,0.001950,0.996400,0.000450
0.001750,0.002350,0.995400,0.000500
0.002350,0.002900,0.994200,0.000550
0.002650,0.004750,0.991800,0.000800
0.003950,0.005950,0.989150,0.000950
0.005600,0.008000,0.984950,0.001450
0.007550,0.010550,0.979900,0.002000
0.009100,0.014200,0.973400,0.003300
0.011600,0.018300,0.965250,0.004850
0.016100,0.024250,0.953250,0.006400
0.020700,0.030850,0.939950,0.008500
0.026350,0.039050,0.923500,0.011100
0.033450,0.047800,0.903600,0.015150
0.042250,0.060800,0.877100,0.019850
0.053100,0.077050,0.844350,0.025500
0.067100,0.095450,0.805150,0.032300
0.083350,0.115700,0.759300,0.041650
0.105550,0.138400,0.704100,0.051950
0.130350,0.165250,0.639050,0.065350
0.157500,0.188050,0.571350,0.083100
0.190800,0.206200,0.499500,0.103500
0.225600,0.222650,0.424400,0.127350
0.258150,0.229250,0.353450,0.159150
0.291150,0.228800,0.286400,0.193650
0.319050,0.226200,0.223750,0.231000
0.337900,0.214200,0.172950,0.274950
0.353250,0.195700,0.130300,0.320750
0.360500,0.174500,0.098650,0.366350
0.362350,0.150750,0.073700,0.413200
0.356650,0.123750,0.057850,0.461750
0.343050,0.103700,0.044900,0.508350
0.325700,0.084950,0.037050,0.552300
0.308000,0.067200,0.031750,0.593050
0.286100,0.054800,0.026700,0.632400
0.262500,0.044450,0.022800,0.670250
0.238500,0.035850,0.021550,0.704100
0.216300,0.029150,0.019850,0.734700
0.193800,0.024150,0.018950,0.763100
0.173200,0.019750,0.019150,0.787900
0.155950,0.016700,0.018750,0.808600
0.139500,0.014000,0.019700,0.826800
0.124900,0.011900,0.020550,0.842650
0.109900,0.009650,0.021350,0.859100
0.098550,0.008050,0.022650,0.870750
0.086850,0.006750,0.025100,0.881300
0.078200,0.006050,0.027500,0.888250
0.069050,0.005950,0.029050,0.895950
0.059150,0.005900,0.030850,0.904100
0.053400,0.005850,0.032600,0.908150
0.047650,0.005400,0.033950,0.913000
0.042150,0.004850,0.035850,0.917150
0.037850,0.004050,0.038250,0.919850
0.034000,0.003450,0.041100,0.921450
0.030200,0.003250,0.043100,0.923450
0.027200,0.003150,0.045850,0.923800
0.024150,0.003250,0.048250,0.924350
0.021900,0.003650,0.050700,0.923750
0.019550,0.003750,0.052800,0.923900
0.018300,0.003250,0.054100,0.924350
0.016450,0.003100,0.056950,0.923500
0.015350,0.003300,0.059250,0.922100
0.013700,0.003000,0.062300,0.921000
0.012700,0.002950,0.064750,0.919600
0.011350,0.002600,0.067600,0.918450
0.010550,0.002750,0.070300,0.916400
0.009150,0.002850,0.072600,0.915400
0.008900,0.002300,0.075950,0.912850
0.008600,0.002250,0.078000,0.911150
0.008250,0.002150,0.080450,0.909150
0.007500,0.001950,0.082650,0.907900
0.006800,0.001700,0.085750,0.905750
0.006700,0.001750,0.088000,0.903550
0.005900,0.001850,0.090500,0.901750
0.005450,0.001950,0.093000,0.899600
0.005150,0.002150,0.095750,0.896950
0.004900,0.001850,0.097800,0.895450
0.004800,0.001400,0.100200,0.893600
0.004600,0.001150,0.103000,0.891250
0.004200,0.001200,0.104900,0.889700
0.004050,0.001200,0.107750,0.887000
0.003800,0.001350,0.110450,0.884400
0.003600,0.000900,0.113000,0.882500
0.003200,0.000950,0.115300,0.880550
0.003200,0.000900,0.118050,0.877850
0.003200,0.001000,0.120900,0.874900
0.002950,0.001150,0.123400,0.872500
0.002700,0.001250,0.126300,0.869750
0.002600,0.001150,0.129300,0.866950
0.002450,0.001100,0.131700,0.864750
0.002350,0.000950,0.134450,0.862250
0.002400,0.000850,0.136750,0.860000
0.002350,0.000850,0.138750,0.858050
0.002200,0.000950,0.141400,0.855450
0.002250,0.000800,0.144450,0.852500
0.002200,0.000650,0.146850,0.850300
0.002100,0.000700,0.149450,0.847750
0.002050,0.000750,0.151800,0.845400
0.001650,0.000800,0.153850,0.843700
0.001650,0.000550,0.156200,0.841600
0.001600,0.000500,0.159050,0.838850
0.001600,0.000600,0.161700,0.836100
0.001550,0.000700,0.164450,0.833300
0.001450,0.000700,0.166950,0.830900
0.001500,0.000500,0.170000,0.828000
0.001450,0.000400,0.172850,0.825300
0.001450,0.000500,0.175200,0.822850
0.001450,0.000550,0.177350,0.820650
0.001250,0.000650,0.179550,0.818550
0.001350,0.000800,0.181450,0.816400
0.001350,0.000950,0.183350,0.814350
0.001400,0.000850,0.185200,0.812550
0.001400,0.000950,0.186450,0.811200
0.001550,0.000900,0.188750,0.808800
0.001500,0.000750,0.190950,0.806800
0.001400,0.000800,0.193100,0.804700
0.001500,0.000750,0.195850,0.801900
0.001500,0.000650,0.198250,0.799600
0.001150,0.000750,0.200300,0.797800
0.001200,0.000550,0.202900,0.795350
0.001000,0.000700,0.204800,0.793500
0.001100,0.000450,0.207550,0.790900
0.001050,0.000650,0.209900,0.788400
0.001000,0.000700,0.211900,0.786400
0.000850,0.000750,0.214650,0.783750
0.000850,0.000850,0.217100,0.781200
0.001050,0.000600,0.219600,0.778750
0.001050,0.000550,0.221700,0.776700
0.001000,0.000700,0.224200,0.774100
0.001100,0.000700,0.226150,0.772050
0.001050,0.000850,0.228200,0.769900
0.001200,0.000900,0.230000,0.767900
0.001150,0.000900,0.232300,0.765650
0.001100,0.000900,0.233950,0.764050
0.001100,0.001000,0.235750,0.762150
0.001300,0.001100,0.237500,0.760100
0.001400,0.001250,0.238950,0.758400
0.001600,0.001050,0.240350,0.757000
0.001600,0.000900,0.242800,0.754700
0.001650,0.001200,0.244300,0.752850
0.001800,0.001150,0.246000,0.751050
0.002100,0.000950,0.247500,0.749450
0.002050,0.001250,0.248400,0.748300
0.001950,0.001400,0.250000,0.746650
0.001950,0.001450,0.251900,0.744700
0.002300,0.001400,0.254050,0.742250
0.002350,0.001600,0.255650,0.740400
0.002350,0.001550,0.257650,0.738450
0.002600,0.001300,0.259700,0.736400
0.002450,0.001350,0.261600,0.734600
0.002850,0.001200,0.263300,0.732650
0.003100,0.001600,0.264300,0.731000
0.002950,0.001600,0.265700,0.729750
0.002950,0.002000,0.266800,0.728250
0.003250,0.002200,0.268050,0.726500
0.003350,0.002600,0.269500,0.724550
0.003500,0.003100,0.270700,0.722700
0.003850,0.003000,0.272050,0.721100
0.004300,0.003000,0.273150,0.719550
0.004250,0.003350,0.273900,0.718500
0.004550,0.003650,0.275250,0.716550
0.005050,0.003800,0.276350,0.714800
0.005450,0.003700,0.277850,0.713000
0.005150,0.004550,0.278600,0.711700
0.005650,0.004200,0.279700,0.710450
0.006250,0.004000,0.280100,0.709650
0.006700,0.003900,0.281100,0.708300
0.007200,0.004100,0.281500,0.707200
0.007250,0.004650,0.282150,0.705950
0.007850,0.004750,0.282550,0.704850
0.007950,0.005000,0.282950,0.704100
0.008200,0.005300,0.283900,0.702600
0.008050,0.005600,0.283900,0.702450
0.008350,0.006300,0.283600,0.701750
0.009700,0.005100,0.284450,0.700750
0.009800,0.005900,0.284200,0.700100
0.010700,0.006450,0.283950,0.698900
0.010850,0.007100,0.283400,0.698650
0.011100,0.007350,0.283100,0.698450
0.011300,0.007600,0.282750,0.698350
0.011700,0.008700,0.281950,0.697650
0.012650,0.009100,0.281200,0.697050
0.012950,0.008800,0.281600,0.696650
0.014300,0.008850,0.280800,0.696050
0.014750,0.010250,0.279850,0.695150
0.015250,0.009950,0.279950,0.694850
0.016200,0.010800,0.278150,0.694850
0.016250,0.011650,0.276750,0.695350
0.017200,0.012600,0.274250,0.695950
0.018000,0.013750,0.272000,0.696250
0.019600,0.013850,0.269850,0.696700
0.020100,0.015150,0.267000,0.697750
0.021500,0.015650,0.264750,0.698100
0.023100,0.016400,0.261550,0.698950
0.025400,0.016100,0.259300,0.699200
0.025350,0.016950,0.256700,0.701000
0.026250,0.018300,0.253300,0.702150
0.027900,0.018100,0.250850,0.703150
0.029400,0.018200,0.248350,0.704050
0.030850,0.018700,0.244850,0.705600
0.032150,0.019200,0.241300,0.707350
0.032650,0.019450,0.237600,0.710300
0.033400,0.021000,0.233800,0.711800
0.035450,0.020600,0.230200,0.713750
0.037150,0.021000,0.226250,0.715600
0.037900,0.021250,0.222500,0.718350
0.038550,0.022100,0.218450,0.720900
0.039250,0.022350,0.214550,0.723850
0.039050,0.022700,0.210100,0.728150
0.039150,0.023900,0.206750,0.730200
0.040250,0.024150,0.202100,0.733500
0.041700,0.023200,0.199050,0.736050
0.043100,0.022100,0.196950,0.737850
0.044450,0.022850,0.192450,0.740250
0.043850,0.023600,0.188600,0.743950
0.044500,0.023250,0.185350,0.746900
0.045000,0.023800,0.181450,0.749750
0.045950,0.024550,0.176550,0.752950
0.046300,0.024150,0.173050,0.756500
0.046750,0.023250,0.169650,0.760350
0.046400,0.023650,0.166100,0.763850
0.044850,0.023800,0.162500,0.768850
0.046250,0.022400,0.159500,0.771850
0.047950,0.021750,0.156400,0.773900
0.048100,0.021150,0.154800,0.775950
0.047450,0.021950,0.152000,0.778600
0.046450,0.020800,0.150350,0.782400
0.047300,0.019500,0.148550,0.784650
0.045100,0.020050,0.146500,0.788350
0.045200,0.019150,0.144650,0.791000
0.044750,0.018250,0.143050,0.793950
0.044800,0.018000,0.141700,0.795500
0.043350,0.017200,0.141000,0.798450
0.041750,0.016350,0.140850,0.801050
0.040050,0.015800,0.141050,0.803100
0.038750,0.015350,0.140150,0.805750
0.037600,0.015350,0.140300,0.806750
0.035750,0.015450,0.139700,0.809100
0.035400,0.014650,0.140000,0.809950
0.033650,0.014450,0.140550,0.811350
0.032900,0.014750,0.141200,0.811150
0.032750,0.013750,0.141500,0.812000
0.032350,0.013400,0.141600,0.812650
0.031500,0.013100,0.142200,0.813200
0.030450,0.011850,0.144550,0.813150
0.029350,0.012500,0.144900,0.813250
0.028100,0.012550,0.146950,0.812400
0.027500,0.011950,0.147250,0.813300
0.026200,0.012000,0.148500,0.813300
0.025600,0.011200,0.149600,0.813600
0.025450,0.009250,0.151850,0.813450
0.024350,0.010350,0.152450,0.812850
0.023300,0.010150,0.154350,0.812200
0.023700,0.009600,0.155250,0.811450
0.023100,0.009500,0.156600,0.810800
0.022750,0.009700,0.157500,0.810050
0.021700,0.010200,0.158200,0.809900
0.020350,0.009750,0.160100,0.809800
0.019350,0.009600,0.162300,0.808750
0.019850,0.008500,0.163900,0.807750
0.020250,0.008300,0.166200,0.805250
0.019900,0.008100,0.168800,0.803200
0.019300,0.008000,0.170500,0.802200
0.018550,0.008100,0.171500,0.801850
0.018550,0.007700,0.173550,0.800200
0.018900,0.008450,0.175000,0.797650
0.017800,0.008800,0.176200,0.797200
0.017250,0.009050,0.178550,0.795150
0.017600,0.007900,0.181900,0.792600
0.017300,0.008300,0.184450,0.789950
0.016650,0.008200,0.186700,0.788450
0.016850,0.007850,0.189750,0.785550
0.017050,0.008050,0.191200,0.783700
0.017050,0.008650,0.192200,0.782100
0.016600,0.008850,0.193450,0.781100
0.017250,0.008600,0.195450,0.778700
0.017500,0.008550,0.197250,0.776700
0.017900,0.008850,0.198950,0.774300
0.017400,0.009500,0.200700,0.772400
0.017500,0.009450,0.202550,0.770500
0.018650,0.008700,0.204200,0.768450
0.018600,0.008900,0.206000,0.766500
0.018600,0.009350,0.206500,0.765550
0.019100,0.008700,0.208500,0.763700
0.018500,0.009300,0.209850,0.762350
0.017500,0.009650,0.210650,0.762200
0.017700,0.009700,0.212150,0.760450
0.018200,0.009750,0.213350,0.758700
0.018400,0.010100,0.214050,0.757450
0.018950,0.010150,0.215400,0.755500
0.018650,0.010850,0.216550,0.753950
0.018800,0.011400,0.216900,0.752900
0.019500,0.011000,0.218150,0.751350
0.020450,0.011550,0.218600,0.749400
0.021550,0.011150,0.219150,0.748150
0.021750,0.011300,0.220650,0.746300
0.021200,0.011850,0.220700,0.746250
0.020950,0.012900,0.221000,0.745150
0.022200,0.012400,0.221500,0.743900
0.023100,0.013100,0.221200,0.742600
0.023600,0.014050,0.221600,0.740750
0.023300,0.014300,0.222100,0.740300
0.024250,0.013900,0.222800,0.739050
0.024300,0.014400,0.222900,0.738400
0.025050,0.014200,0.222200,0.738550
0.025600,0.014550,0.221400,0.738450
0.025250,0.016250,0.220350,0.738150
0.026650,0.016400,0.219150,0.737800
0.027900,0.015950,0.219950,0.736200
0.029450,0.015750,0.219050,0.735750
0.029350,0.016450,0.218150,0.736050
0.029650,0.016350,0.216700,0.737300
0.029750,0.015750,0.217350,0.737150
0.030800,0.016550,0.215400,0.737250
0.030950,0.016850,0.214550,0.737650
0.031600,0.016150,0.214900,0.737350
0.031500,0.016000,0.214750,0.737750
0.032350,0.016950,0.214300,0.736400
0.033350,0.017550,0.212850,0.736250
0.034600,0.017650,0.212650,0.735100
0.035150,0.017800,0.211700,0.735350
0.035300,0.019150,0.209700,0.735850
0.035500,0.018550,0.208900,0.737050
0.035850,0.020050,0.205850,0.738250
0.037050,0.020550,0.203950,0.738450
0.038000,0.020050,0.202350,0.739600
0.037800,0.021250,0.200550,0.740400
0.039100,0.019900,0.199200,0.741800
0.039050,0.020750,0.197350,0.742850
0.038600,0.021250,0.196200,0.743950
0.039950,0.021050,0.195700,0.743300
0.042100,0.020300,0.193700,0.743900
0.041600,0.020900,0.191800,0.745700
0.042250,0.020500,0.189850,0.747400
0.041800,0.020250,0.188500,0.749450
0.040400,0.021300,0.186500,0.751800
0.039600,0.021500,0.185500,0.753400
0.038900,0.022350,0.184300,0.754450
0.039500,0.022500,0.181850,0.756150
0.039600,0.022250,0.181150,0.757000
0.040950,0.020750,0.179850,0.758450
0.042000,0.018950,0.178850,0.760200
0.041150,0.019000,0.177500,0.762350
0.040450,0.017800,0.176950,0.764800
0.039950,0.017400,0.176900,0.765750
0.039050,0.018050,0.176150,0.766750
0.039800,0.017650,0.175800,0.766750
0.038100,0.018650,0.175450,0.767800
0.038900,0.018250,0.175100,0.767750
0.038550,0.018400,0.174550,0.768500
0.037750,0.018400,0.172800,0.771050
0.037450,0.018600,0.172900,0.771050
0.036800,0.019000,0.172550,0.771650
0.037950,0.017550,0.172650,0.771850
0.036900,0.018500,0.172300,0.772300
0.037100,0.017350,0.172700,0.772850
0.036900,0.015850,0.173750,0.773500
0.035950,0.016250,0.175200,0.772600
0.034600,0.016900,0.175450,0.773050
0.033800,0.017300,0.175050,0.773850
0.033800,0.016700,0.175200,0.774300
0.032750,0.016750,0.175500,0.775000
0.033400,0.016700,0.176000,0.773900
0.033500,0.016800,0.176300,0.773400
0.033250,0.016950,0.176900,0.772900
0.033950,0.016550,0.177350,0.772150
0.034050,0.016850,0.178500,0.770600
0.034100,0.017150,0.178050,0.770700
0.034300,0.017600,0.177200,0.770900
0.035850,0.016900,0.178150,0.769100
0.035800,0.016550,0.178250,0.769400
0.035700,0.016700,0.177900,0.769700
0.034550,0.016450,0.179050,0.769950
0.034250,0.016650,0.179000,0.770100
0.034500,0.015900,0.178900,0.770700
0.034150,0.015800,0.178850,0.771200
0.033850,0.016350,0.179250,0.770550
0.033550,0.017000,0.178700,0.770750
0.034050,0.016100,0.179650,0.770200
0.032650,0.016450,0.181300,0.769600
0.034000,0.015950,0.180900,0.769150
0.033650,0.017000,0.179650,0.769700
0.033350,0.017050,0.180100,0.769500
0.033550,0.016100,0.180850,0.769500
0.033550,0.015550,0.181650,0.769250
0.033500,0.014700,0.182600,0.769200
0.033400,0.013500,0.184700,0.768400
0.031250,0.015550,0.184850,0.768350
0.031700,0.014700,0.185350,0.768250
0.031850,0.014750,0.185950,0.767450
0.031550,0.015350,0.185800,0.767300
0.031200,0.015500,0.185500,0.767800
0.032100,0.015450,0.185500,0.766950
0.032500,0.014900,0.186100,0.766500
0.033450,0.015550,0.184850,0.766150
0.033550,0.015350,0.185650,0.765450
0.033250,0.015300,0.186200,0.765250
0.032700,0.015850,0.186100,0.765350
0.033100,0.016800,0.185100,0.765000
0.032850,0.016550,0.185600,0.765000
0.033200,0.016200,0.186550,0.764050
0.032700,0.015900,0.187500,0.763900
0.033000,0.016450,0.186500,0.764050
0.033850,0.016100,0.186850,0.763200
0.034800,0.016150,0.186600,0.762450
0.034650,0.016650,0.186600,0.762100
0.033000,0.017600,0.185600,0.763800
0.031800,0.018000,0.185950,0.764250
0.032150,0.017100,0.187450,0.763300
0.032600,0.016950,0.188350,0.762100
0.034100,0.016150,0.187500,0.762250
0.033600,0.017600,0.186850,0.761950
0.033300,0.016850,0.187550,0.762300
0.033300,0.015900,0.188450,0.762350
0.032950,0.016200,0.187600,0.763250
0.033150,0.016550,0.187450,0.762850
0.032950,0.016900,0.186350,0.763800
0.033750,0.016950,0.185100,0.764200
0.033450,0.015850,0.185600,0.765100
0.033050,0.017000,0.184850,0.765100
0.032900,0.016600,0.185750,0.764750
0.032400,0.017350,0.185400,0.764850
0.032750,0.016100,0.186550,0.764600
0.032650,0.016050,0.187450,0.763850
0.032600,0.016300,0.186850,0.764250
0.033600,0.015850,0.187000,0.763550
0.032600,0.016550,0.186800,0.764050
0.033150,0.016100,0.186800,0.763950
0.032550,0.017650,0.185650,0.764150
0.033450,0.016650,0.186250,0.763650
0.032950,0.016500,0.187100,0.763450
0.033150,0.016950,0.186500,0.763400
0.033300,0.016600,0.185750,0.764350
0.033950,0.017550,0.184300,0.764200
0.033800,0.017200,0.185350,0.763650
0.033900,0.017250,0.184650,0.764200
0.034550,0.017650,0.184000,0.763800
0.035100,0.016500,0.184500,0.763900
0.033950,0.018400,0.183050,0.764600
0.034400,0.017950,0.182250,0.765400
0.033800,0.019050,0.181000,0.766150
0.035450,0.018100,0.180900,0.765550
0.035650,0.018350,0.179650,0.766350
0.035950,0.016900,0.179450,0.767700
0.036050,0.017400,0.178350,0.768200
0.035000,0.016950,0.178900,0.769150
0.035850,0.015850,0.179000,0.769300
0.035350,0.016400,0.179050,0.769200
0.034300,0.016300,0.179500,0.769900
0.035150,0.015900,0.178850,0.770100
0.035100,0.016300,0.178800,0.769800
0.034350,0.015950,0.178850,0.770850
0.034400,0.015900,0.178450,0.771250
0.034400,0.016400,0.178400,0.770800
0.033600,0.016150,0.178700,0.771550
0.033900,0.016150,0.178700,0.771250
0.033450,0.016950,0.177700,0.771900
0.032700,0.016100,0.178300,0.772900
0.032150,0.015500,0.179400,0.772950
0.031650,0.015750,0.179650,0.772950
0.031300,0.016550,0.179900,0.772250
0.031500,0.016850,0.180500,0.771150
0.031900,0.016800,0.179450,0.771850
0.032350,0.016500,0.179850,0.771300
0.033100,0.016450,0.179550,0.770900
0.032550,0.017400,0.178900,0.771150
0.032850,0.016850,0.179850,0.770450
0.032750,0.016750,0.179050,0.771450
0.032850,0.016700,0.178850,0.771600
0.033350,0.015700,0.179700,0.771250
0.032050,0.015750,0.180450,0.771750
0.031950,0.014700,0.181350,0.772000
0.032000,0.014750,0.181300,0.771950
0.031300,0.014750,0.182050,0.771900
0.030250,0.014800,0.182750,0.772200
0.031000,0.014150,0.182850,0.772000
0.030550,0.014450,0.183600,0.771400
0.030100,0.014700,0.182850,0.772350
0.030000,0.014700,0.183700,0.771600
0.030200,0.014500,0.184100,0.771200
0.030500,0.015250,0.183400,0.770850
0.030250,0.014850,0.183100,0.771800
0.029500,0.014950,0.183650,0.771900
0.029050,0.014650,0.183650,0.772650
0.029200,0.013950,0.185600,0.771250
0.029550,0.013900,0.186200,0.770350
0.029400,0.014700,0.186700,0.769200
0.030000,0.014500,0.187750,0.767750
0.029800,0.014500,0.188800,0.766900
0.029050,0.014400,0.189600,0.766950
0.029950,0.014400,0.189900,0.765750
0.029250,0.014750,0.190100,0.765900
0.028700,0.015700,0.189850,0.765750
0.028850,0.014900,0.191750,0.764500
0.029450,0.014900,0.191600,0.764050
0.029950,0.014650,0.192200,0.763200
0.029500,0.015100,0.192400,0.763000
0.029750,0.015250,0.191750,0.763250
0.030100,0.014400,0.193150,0.762350
0.029850,0.014550,0.193350,0.762250
0.029700,0.014850,0.193200,0.762250
0.030450,0.015150,0.193300,0.761100
0.029950,0.015300,0.193850,0.760900
0.029800,0.016750,0.192900,0.760550
0.030550,0.015300,0.194200,0.759950
0.030350,0.015150,0.194500,0.760000
0.031200,0.015200,0.194050,0.759550
0.031750,0.014250,0.195650,0.758350
0.031450,0.014600,0.195300,0.758650
0.031850,0.015050,0.195500,0.757600
0.031900,0.015150,0.195550,0.757400
0.031050,0.016050,0.194300,0.758600
0.031150,0.016050,0.194650,0.758150
0.031050,0.016450,0.195350,0.757150
0.030600,0.016600,0.195650,0.757150
0.031950,0.016100,0.196000,0.755950
0.031900,0.016200,0.196600,0.755300
0.032000,0.015400,0.197200,0.755400
0.032100,0.016050,0.197000,0.754850
0.030900,0.017250,0.196300,0.755550
0.031000,0.016450,0.195700,0.756850
0.031300,0.016000,0.195350,0.757350
0.030600,0.014900,0.196650,0.757850
0.030250,0.014750,0.197050,0.757950
0.030900,0.016100,0.196500,0.756500
0.030650,0.016900,0.197100,0.755350
0.031400,0.016750,0.196600,0.755250
0.031350,0.017700,0.196400,0.754550
0.033700,0.017350,0.195800,0.753150
0.033300,0.017350,0.195500,0.753850
0.032650,0.017850,0.194600,0.754900
0.034050,0.017350,0.194650,0.753950
0.034600,0.017150,0.193850,0.754400
0.035300,0.016500,0.194000,0.754200
0.035400,0.017750,0.192900,0.753950
0.035250,0.017550,0.192300,0.754900
0.036500,0.017150,0.192300,0.754050
0.036700,0.019800,0.190300,0.753200
0.037550,0.019700,0.189450,0.753300
0.038350,0.019950,0.188750,0.752950
0.038500,0.020000,0.186700,0.754800
0.039050,0.018300,0.187500,0.755150
0.038150,0.019950,0.186800,0.755100
0.037800,0.019950,0.185700,0.756550
0.038350,0.020100,0.185200,0.756350
0.039000,0.019950,0.185400,0.755650
0.038850,0.019300,0.184800,0.757050
0.038950,0.019400,0.184250,0.757400
0.039000,0.019750,0.183000,0.758250
0.038250,0.019850,0.182550,0.759350
0.039450,0.018750,0.182300,0.759500
0.038750,0.017950,0.182900,0.760400
0.037950,0.018850,0.181850,0.761350
0.038300,0.018150,0.181500,0.762050
0.037450,0.020150,0.179300,0.763100
0.037050,0.020050,0.179500,0.763400
0.037800,0.019750,0.178450,0.764000
0.038250,0.020500,0.177200,0.764050
0.039350,0.018350,0.177850,0.764450
0.038650,0.019650,0.177100,0.764600
0.039550,0.019550,0.175300,0.765600
0.040400,0.019950,0.173850,0.765800
0.041250,0.020150,0.173050,0.765550
0.041100,0.018950,0.173300,0.766650
0.042000,0.018350,0.171900,0.767750
0.041850,0.018750,0.171050,0.768350
0.042700,0.017600,0.170800,0.768900
0.041450,0.018450,0.169100,0.771000
0.042300,0.018850,0.168050,0.770800
0.040800,0.018800,0.167850,0.772550
0.041250,0.019250,0.167000,0.772500
0.040500,0.019900,0.166400,0.773200
0.040300,0.018400,0.166750,0.774550
0.039300,0.018700,0.166900,0.775100
0.037850,0.019750,0.165800,0.776600
0.037100,0.019550,0.166650,0.776700
0.038300,0.018550,0.166050,0.777100
0.038500,0.017550,0.166550,0.777400
0.037400,0.018250,0.166550,0.777800
0.036550,0.018950,0.165900,0.778600
0.036200,0.018600,0.166900,0.778300
0.037300,0.017850,0.167550,0.777300
0.036750,0.018050,0.167150,0.778050
0.037050,0.019600,0.166650,0.776700
0.036750,0.018200,0.166800,0.778250
0.037050,0.017050,0.167950,0.777950
0.036500,0.018100,0.167750,0.777650
0.035900,0.017400,0.169750,0.776950
0.035000,0.017500,0.169850,0.777650
0.034450,0.017850,0.169450,0.778250
0.034650,0.018100,0.170200,0.777050
0.036450,0.016600,0.170600,0.776350
0.035000,0.017200,0.172100,0.775700
0.034700,0.017150,0.172650,0.775500
0.035300,0.015800,0.174500,0.774400
0.035150,0.015800,0.175050,0.774000
0.034800,0.016450,0.174550,0.774200
0.034550,0.016400,0.175400,0.773650
0.035250,0.015850,0.175900,0.773000
0.035650,0.015750,0.176300,0.772300
0.033850,0.016300,0.176700,0.773150
0.033000,0.017050,0.177150,0.772800
0.034150,0.016250,0.178100,0.771500
0.033950,0.016250,0.178400,0.771400
0.033600,0.016300,0.180150,0.769950
0.032550,0.017700,0.180550,0.769200
0.033400,0.017350,0.180350,0.768900
0.033650,0.018350,0.179150,0.768850
0.032900,0.017900,0.179700,0.769500
0.033750,0.016700,0.179950,0.769600
0.033500,0.016750,0.181600,0.768150
0.033750,0.016650,0.182750,0.766850
0.032400,0.017500,0.182400,0.767700
0.033600,0.015950,0.183800,0.766650
0.032650,0.014850,0.184050,0.768450
0.032050,0.017100,0.183400,0.767450
0.033450,0.016550,0.182850,0.767150
0.034000,0.016450,0.183400,0.766150
0.034100,0.016600,0.183850,0.765450
0.034450,0.016400,0.183700,0.765450
0.034450,0.017050,0.183500,0.765000
0.035000,0.016500,0.184600,0.763900
0.033700,0.017900,0.184100,0.764300
0.033750,0.017850,0.183700,0.764700
0.033650,0.017550,0.183950,0.764850
0.034700,0.017400,0.184850,0.763050
0.034600,0.017850,0.184200,0.763350
0.034300,0.019050,0.184050,0.762600
0.036050,0.018200,0.184050,0.761700
0.035600,0.020100,0.183800,0.760500
0.035450,0.019400,0.184750,0.760400
0.035850,0.018700,0.185750,0.759700
0.036500,0.018900,0.185700,0.758900
0.036250,0.017950,0.186400,0.759400
0.036250,0.018100,0.185650,0.760000
0.035500,0.017800,0.185800,0.760900
0.036000,0.017850,0.184900,0.761250
0.035550,0.017550,0.184900,0.762000
0.035850,0.017100,0.184950,0.762100
0.035300,0.016000,0.186650,0.762050
0.035250,0.016650,0.186200,0.761900
0.035050,0.017550,0.185250,0.762150
0.035250,0.016700,0.185550,0.762500
0.034900,0.018550,0.184100,0.762450
0.035000,0.018850,0.183200,0.762950
0.036250,0.018050,0.183600,0.762100
0.035700,0.018000,0.184000,0.762300
0.036200,0.018400,0.181500,0.763900
0.036400,0.017750,0.182200,0.763650
0.036150,0.017100,0.182150,0.764600
0.036500,0.015950,0.183150,0.764400
0.036500,0.014800,0.183650,0.765050
0.036200,0.014600,0.183750,0.765450
0.035950,0.014800,0.184950,0.764300
0.033850,0.014900,0.186600,0.764650
0.033400,0.016150,0.186700,0.763750
0.033900,0.015750,0.187150,0.763200
0.032950,0.015250,0.188250,0.763550
0.032350,0.016400,0.189100,0.762150
0.032700,0.015900,0.189450,0.761950
0.031750,0.015600,0.190800,0.761850
0.032000,0.014050,0.192500,0.761450
0.031050,0.015250,0.192250,0.761450
0.031500,0.016050,0.191650,0.760800
0.030950,0.016550,0.191950,0.760550
0.031000,0.016850,0.192750,0.759400
0.032050,0.016650,0.192450,0.758850
0.032700,0.015750,0.192750,0.758800
0.033450,0.017150,0.190550,0.758850
0.034150,0.016950,0.190600,0.758300
0.034550,0.017150,0.190150,0.758150
0.033250,0.018600,0.190150,0.758000
0.033200,0.019500,0.188900,0.758400
0.034250,0.017900,0.189650,0.758200
0.034800,0.017550,0.189100,0.758550
0.034150,0.017450,0.189000,0.759400
0.035000,0.017850,0.188350,0.758800
0.034800,0.018300,0.187450,0.759450
0.036000,0.019100,0.185750,0.759150
0.036500,0.018550,0.185400,0.759550
0.036050,0.019700,0.185350,0.758900
0.036400,0.017650,0.186650,0.759300
0.035450,0.018550,0.185600,0.760400
0.034650,0.018900,0.184600,0.761850
0.034450,0.016750,0.185800,0.763000
0.035050,0.016500,0.186500,0.761950
0.034000,0.016550,0.186200,0.763250
0.034050,0.017050,0.186450,0.762450
0.033800,0.016650,0.187050,0.762500
0.033950,0.017950,0.186700,0.761400
0.033950,0.018200,0.186550,0.761300
0.034100,0.018150,0.186200,0.761550
0.033600,0.018150,0.185900,0.762350
0.034000,0.017700,0.185400,0.762900
0.034850,0.017450,0.184800,0.762900
0.034650,0.018450,0.183600,0.763300
0.033700,0.019350,0.182800,0.764150
0.034300,0.018150,0.183400,0.764150
0.033500,0.017800,0.183400,0.765300
0.033500,0.017300,0.184100,0.765100
0.034400,0.016350,0.184850,0.764400
0.033950,0.016750,0.185050,0.764250
0.033800,0.016950,0.185000,0.764250
0.033850,0.017350,0.184750,0.764050
0.034450,0.017300,0.185300,0.762950
0.033750,0.016950,0.185650,0.763650
0.034100,0.017850,0.184950,0.763100
0.033550,0.017850,0.184600,0.764000
0.033250,0.017850,0.184550,0.764350
0.034550,0.016750,0.185650,0.763050
0.034550,0.017300,0.184800,0.763350
0.035950,0.016400,0.183900,0.763750
0.035800,0.016100,0.183450,0.764650
0.035350,0.015550,0.183400,0.765700
0.035250,0.016450,0.182100,0.766200
0.034950,0.016500,0.182000,0.766550
0.035600,0.016900,0.181200,0.766300
0.034750,0.017150,0.181200,0.766900
0.035250,0.016300,0.182300,0.766150
0.035050,0.016050,0.182600,0.766300
0.034700,0.016250,0.182750,0.766300
0.035250,0.017000,0.181950,0.765800
0.036100,0.017650,0.181000,0.765250
0.036050,0.017650,0.179800,0.766500
0.034600,0.017650,0.179950,0.767800
0.034500,0.017800,0.180150,0.767550
0.032900,0.019000,0.180000,0.768100
0.035350,0.016350,0.181500,0.766800
0.035150,0.017000,0.181050,0.766800
