I,E,S,R
0.001,0.00055,0.99845,0
0.0013,0.0007,0.998,0
0.00135,0.0017,0.9968,0.00015
0.00175,0.00215,0.99575,0.00035
0.0022,0.003,0.9942,0.0006
0.00295,0.00435,0.9917,0.001
0.00365,0.0058,0.9891,0.00145
0.00465,0.00755,0.9859,0.0019
0.0065,0.00955,0.98155,0.0024
0.00805,0.0125,0.9761,0.00335
0.01035,0.01565,0.96985,0.00415
0.01295,0.0205,0.96085,0.0057
0.0183,0.0263,0.9485,0.0069
0.02305,0.0343,0.9329,0.00975
0.02885,0.0426,0.9151,0.01345
0.03795,0.05285,0.89195,0.01725
0.04785,0.0672,0.86225,0.0227
0.0628,0.0824,0.8263,0.0285
0.07585,0.1026,0.78375,0.0378
0.096,0.1247,0.7323,0.047
0.1184,0.14865,0.67315,0.0598
0.1471,0.1686,0.6082,0.0761
0.17555,0.19285,0.53575,0.09585
0.20805,0.2141,0.46035,0.1175
0.2402,0.22715,0.38735,0.1453
0.2706,0.2377,0.3149,0.1768
0.2995,0.2382,0.2507,0.2116
0.3284,0.2263,0.19585,0.24945
0.3478,0.20665,0.1517,0.29385
0.35765,0.1875,0.1147,0.34015
0.36275,0.1624,0.0893,0.38555
0.3583,0.13955,0.06865,0.4335
0.3493,0.11715,0.0522,0.48135
0.3343,0.0971,0.0404,0.5282
0.3184,0.07725,0.03365,0.5707
0.2992,0.06185,0.028,0.61095
0.27565,0.0494,0.0239,0.65105
0.25135,0.0398,0.0222,0.68665
0.23085,0.03105,0.02185,0.71625
0.20725,0.026,0.02025,0.7465
0.1869,0.0222,0.0199,0.771
0.16785,0.01795,0.0198,0.7944
0.1507,0.01575,0.0197,0.81385
0.13555,0.0127,0.021,0.83075
0.12035,0.01055,0.02295,0.84615
0.1067,0.0096,0.0246,0.8591
0.0961,0.0078,0.02515,0.87095
0.085,0.00785,0.0268,0.88035
0.07585,0.0067,0.0284,0.88905
0.0682,0.0058,0.0304,0.8956
0.0592,0.0053,0.0331,0.9024
0.053,0.00545,0.0348,0.90675
0.04735,0.005,0.0372,0.91045
0.0419,0.00485,0.03935,0.9139
0.03855,0.00435,0.0412,0.9159
0.0346,0.00445,0.04295,0.918
0.03095,0.0044,0.04475,0.9199
0.02845,0.00325,0.0472,0.9211
0.025,0.00345,0.0493,0.92225
0.02155,0.00345,0.0518,0.9232
0.01965,0.0033,0.0544,0.92265
0.01815,0.00295,0.0574,0.9215
0.01625,0.003,0.0601,0.92065
0.01465,0.003,0.0627,0.91965
0.0135,0.00275,0.06485,0.9189
0.01265,0.00255,0.067,0.9178
0.01095,0.00205,0.06955,0.91745
0.01005,0.0019,0.07215,0.9159
0.0088,0.00155,0.07455,0.9151
0.00755,0.00145,0.07795,0.91305
0.00675,0.00155,0.08125,0.91045
0.00625,0.00135,0.0839,0.9085
0.00575,0.0012,0.0868,0.90625
0.00495,0.00115,0.09025,0.90365
0.00445,0.0012,0.09335,0.901
0.00385,0.001,0.0963,0.89885
0.0037,0.00065,0.09895,0.8967
0.0032,0.00075,0.1015,0.89455
0.0033,0.00065,0.1036,0.89245
0.00315,0.00095,0.1066,0.8893
0.0031,0.00085,0.10945,0.8866
0.0029,0.0008,0.112,0.8843
0.00265,0.0006,0.11505,0.8817
0.0025,0.0007,0.117,0.8798
0.00215,0.0008,0.12005,0.877
0.00185,0.0008,0.123,0.87435
0.00185,0.00095,0.1252,0.872
0.0018,0.00095,0.12775,0.8695
0.0019,0.0006,0.1304,0.8671
0.0016,0.0007,0.1324,0.8653
0.00155,0.0007,0.1353,0.86245
0.00155,0.00075,0.13755,0.86015
0.0015,0.0008,0.14035,0.85735
0.0016,0.0008,0.1425,0.8551
0.0018,0.0006,0.14465,0.85295
0.0015,0.0008,0.14715,0.85055
0.00155,0.0007,0.15,0.84775
0.00155,0.00055,0.1523,0.8456
0.00145,0.00055,0.15545,0.84255
0.00145,0.0007,0.1574,0.84045
0.00135,0.0009,0.159,0.83875
0.00145,0.0007,0.1619,0.83595
0.00145,0.00055,0.1644,0.8336
0.00155,0.00055,0.167,0.8309
0.0013,0.0007,0.16995,0.82805
0.00135,0.0007,0.1715,0.82645
0.00135,0.0007,0.1741,0.82385
0.0017,0.00045,0.1765,0.82135
0.0015,0.0007,0.1786,0.8192
0.00145,0.0007,0.18005,0.8178
0.00165,0.00055,0.18235,0.81545
0.0018,0.00075,0.18515,0.8123
0.00175,0.00085,0.18715,0.81025
0.00205,0.00065,0.18925,0.80805
0.00205,0.0007,0.1912,0.80605
0.002,0.0008,0.193,0.8042
0.00195,0.0007,0.19545,0.8019
0.00175,0.00075,0.19845,0.79905
0.00165,0.00095,0.20065,0.79675
0.0018,0.00115,0.20225,0.7948
0.00185,0.00115,0.20425,0.79275
0.00195,0.0012,0.20595,0.7909
0.00225,0.00125,0.20775,0.78875
0.0023,0.00125,0.20975,0.7867
0.0025,0.00085,0.2116,0.78505
0.0027,0.00075,0.2139,0.78265
0.0024,0.00095,0.2156,0.78105
0.00215,0.0013,0.2174,0.77915
0.00195,0.00135,0.2193,0.7774
0.0021,0.00105,0.2225,0.77435
0.0019,0.00125,0.22435,0.7725
0.0021,0.0012,0.22675,0.76995
0.002,0.0012,0.2291,0.7677
0.00205,0.0014,0.23125,0.7653
0.00205,0.0016,0.23335,0.763
0.0025,0.00145,0.23505,0.761
0.0028,0.0015,0.2368,0.7589
0.00285,0.00125,0.23865,0.75725
0.00255,0.0015,0.2404,0.75555
0.00265,0.00155,0.2419,0.7539
0.00285,0.00185,0.2438,0.7515
0.00315,0.0017,0.2456,0.74955
0.0033,0.0019,0.2472,0.7476
0.0035,0.00195,0.2488,0.74575
0.00325,0.0023,0.24995,0.7445
0.00345,0.0021,0.25165,0.7428
0.00385,0.0021,0.2534,0.74065
0.0039,0.0025,0.2549,0.7387
0.004,0.00245,0.256,0.73755
0.00445,0.00235,0.25755,0.73565
0.0044,0.00275,0.2591,0.73375
0.00485,0.0027,0.26045,0.732
0.0047,0.00325,0.2618,0.73025
0.005,0.00355,0.26325,0.7282
0.0054,0.00355,0.26425,0.7268
0.006,0.00335,0.2653,0.72535
0.0062,0.00385,0.26565,0.7243
0.0066,0.00415,0.26665,0.7226
0.007,0.00465,0.26725,0.7211
0.00745,0.0053,0.26765,0.7196
0.00875,0.00475,0.26855,0.71795
0.0085,0.00605,0.26885,0.7166
0.00925,0.00595,0.2689,0.7159
0.0103,0.00575,0.2695,0.71445
0.0108,0.00655,0.26915,0.7135
0.01085,0.00735,0.269,0.7128
0.0118,0.00775,0.26825,0.7122
0.0118,0.0076,0.2678,0.7128
0.01215,0.00755,0.2677,0.7126
0.0128,0.0071,0.26795,0.71215
0.01295,0.00765,0.2678,0.7116
0.01335,0.0081,0.26755,0.711
0.01355,0.0086,0.2671,0.71075
0.0139,0.00915,0.2659,0.71105
0.01455,0.0095,0.2653,0.71065
0.0148,0.00985,0.2651,0.71025
0.0153,0.01145,0.2633,0.70995
0.016,0.01135,0.2623,0.71035
0.0168,0.0118,0.261,0.7104
0.0185,0.01165,0.26015,0.7097
0.0193,0.01145,0.2593,0.70995
0.0204,0.01175,0.2569,0.71095
0.02125,0.0114,0.2563,0.71105
0.02145,0.0131,0.2543,0.71115
0.02275,0.01295,0.252,0.7123
0.02325,0.015,0.24835,0.7134
0.02385,0.01605,0.2454,0.7147
0.02425,0.0168,0.24305,0.7159
0.0256,0.0176,0.2396,0.7172
0.028,0.01615,0.2374,0.71845
0.02765,0.0163,0.23545,0.7206
0.0299,0.01645,0.233,0.72065
0.0307,0.01755,0.22905,0.7227
0.03165,0.0181,0.22615,0.7241
0.03215,0.0181,0.2238,0.72595
0.03305,0.019,0.22045,0.7275
0.03355,0.01965,0.21795,0.72885
0.0349,0.01995,0.21435,0.7308
0.0361,0.02065,0.21085,0.7324
0.03875,0.01985,0.2083,0.7331
0.03985,0.02145,0.204,0.7347
0.04105,0.0211,0.2001,0.73775
0.0423,0.02125,0.1959,0.74055
0.04235,0.0214,0.192,0.74425
0.04375,0.0213,0.1893,0.74565
0.044,0.02305,0.1844,0.74855
0.04495,0.0225,0.1812,0.75135
0.04515,0.02265,0.17765,0.75455
0.04575,0.02195,0.17475,0.75755
0.04665,0.021,0.17205,0.7603
0.04595,0.02205,0.169,0.763
0.04575,0.02265,0.16505,0.76655
0.04545,0.02055,0.16335,0.77065
0.0455,0.01995,0.1603,0.77425
0.0452,0.0194,0.15765,0.77775
0.04425,0.01925,0.1551,0.7814
0.0437,0.0183,0.15395,0.78405
0.0412,0.0193,0.1516,0.7879
0.04055,0.0191,0.1508,0.78955
0.0409,0.01805,0.14985,0.7912
0.03975,0.0185,0.14815,0.7936
0.0395,0.01825,0.1471,0.79515
0.0374,0.0167,0.1468,0.7991
0.03675,0.01605,0.14705,0.80015
0.03645,0.01465,0.147,0.8019
0.03485,0.01555,0.14575,0.80385
0.03465,0.015,0.14585,0.8045
0.03315,0.0152,0.14575,0.8059
0.03235,0.013,0.14745,0.8072
0.03115,0.01295,0.1477,0.8082
0.03,0.01325,0.1487,0.80805
0.0297,0.01215,0.1502,0.80795
0.02865,0.01235,0.14975,0.80925
0.02785,0.0123,0.1507,0.80915
0.02745,0.01185,0.1521,0.8086
0.0276,0.01125,0.15255,0.8086
0.02675,0.0122,0.15205,0.809
0.0257,0.0118,0.15315,0.80935
0.02565,0.0118,0.15365,0.8089
0.0257,0.012,0.15405,0.80825
0.02645,0.0114,0.1549,0.80725
0.02595,0.0102,0.1556,0.80825
0.0253,0.01035,0.15815,0.8062
0.025,0.0109,0.1589,0.8052
0.0247,0.01105,0.1599,0.80435
0.0243,0.0113,0.16075,0.80365
0.02405,0.01115,0.16215,0.80265
0.0235,0.01115,0.16475,0.8006
0.02325,0.0101,0.16615,0.8005
0.02305,0.00975,0.16745,0.79975
0.0234,0.01025,0.1679,0.79845
0.0229,0.0099,0.16965,0.79755
0.0235,0.0086,0.17165,0.79625
0.02295,0.00985,0.17255,0.79465
0.02255,0.01,0.17355,0.7939
0.02195,0.0107,0.1751,0.79225
0.02215,0.01055,0.17585,0.79145
0.0222,0.01065,0.17605,0.7911
0.0225,0.01,0.17765,0.78985
0.0228,0.01065,0.17795,0.7886
0.02315,0.01,0.1794,0.78745
0.0238,0.00965,0.18075,0.7858
0.02325,0.0101,0.18145,0.7852
0.0222,0.0103,0.18295,0.78455
0.02125,0.01055,0.18365,0.78455
0.0208,0.01135,0.18395,0.7839
0.0211,0.011,0.1856,0.7823
0.0222,0.01015,0.18755,0.7801
0.02265,0.0097,0.1895,0.77815
0.02235,0.01135,0.18995,0.77635
0.02295,0.01155,0.1905,0.775
0.02315,0.01235,0.1906,0.7739
0.0233,0.0127,0.19175,0.77225
0.0234,0.0137,0.19175,0.77115
0.0245,0.01355,0.19215,0.7698
0.02615,0.01285,0.19265,0.76835
0.02645,0.0134,0.1915,0.76865
0.02625,0.01485,0.19065,0.76825
0.02725,0.0154,0.18985,0.7675
0.02775,0.0153,0.19,0.76695
0.02905,0.0143,0.1901,0.76655
0.02935,0.01355,0.19175,0.76535
0.03,0.01405,0.192,0.76395
0.0294,0.0148,0.19225,0.76355
0.0298,0.01555,0.1916,0.76305
0.0303,0.0153,0.1913,0.7631
0.031,0.0157,0.1902,0.7631
0.03135,0.01555,0.1897,0.7634
0.0329,0.01525,0.1886,0.76325
0.03235,0.01505,0.18885,0.76375
0.03185,0.0149,0.18905,0.7642
0.0321,0.0148,0.18965,0.76345
0.0327,0.0149,0.18895,0.76345
0.032,0.0152,0.18845,0.76435
0.03185,0.01555,0.1889,0.7637
0.0308,0.01625,0.18955,0.7634
0.0313,0.0166,0.1893,0.7628
0.0325,0.01625,0.18865,0.7626
0.03215,0.0179,0.18785,0.7621
0.03305,0.01795,0.1878,0.7612
0.03325,0.0174,0.18745,0.7619
0.0341,0.0169,0.18755,0.76145
0.034,0.01685,0.18685,0.7623
0.0341,0.0175,0.187,0.7614
0.03505,0.01705,0.1862,0.7617
0.0351,0.01795,0.1855,0.76145
0.03635,0.01845,0.18455,0.76065
0.03795,0.01775,0.18415,0.76015
0.03765,0.01815,0.1825,0.7617
0.03715,0.01935,0.1814,0.7621
0.03815,0.0191,0.18085,0.7619
0.03835,0.0185,0.18045,0.7627
0.03965,0.018,0.1791,0.76325
0.03865,0.01755,0.1796,0.7642
0.0384,0.0179,0.17955,0.76415
0.03825,0.01795,0.17875,0.76505
0.0376,0.0181,0.1786,0.7657
0.03855,0.0178,0.1779,0.76575
0.0379,0.01835,0.17755,0.7662
0.0377,0.0186,0.17695,0.76675
0.0383,0.01895,0.17555,0.7672
0.0371,0.0197,0.1747,0.7685
0.03785,0.0185,0.1754,0.76825
0.0375,0.0185,0.1758,0.7682
0.03855,0.01745,0.17565,0.76835
0.03895,0.0182,0.1743,0.76855
0.0379,0.018,0.1742,0.7699
0.03675,0.01805,0.1752,0.77
0.0368,0.01765,0.17505,0.7705
0.03635,0.018,0.1737,0.77195
0.03575,0.01775,0.1735,0.773
0.03585,0.01825,0.17345,0.77245
0.03635,0.01725,0.17515,0.77125
0.03725,0.0171,0.17535,0.7703
0.0379,0.01665,0.1754,0.77005
0.0391,0.01515,0.1755,0.77025
0.03795,0.0163,0.17535,0.7704
0.0376,0.0171,0.1745,0.7708
0.03755,0.01765,0.174,0.7708
0.03815,0.01675,0.17355,0.77155
0.03745,0.01735,0.17315,0.77205
0.0381,0.01775,0.1722,0.77195
0.0368,0.01755,0.17155,0.7741
0.0374,0.01715,0.1714,0.77405
0.0371,0.0185,0.1693,0.7751
0.03805,0.01725,0.16995,0.77475
0.0373,0.0172,0.17065,0.77485
0.03665,0.01755,0.1705,0.7753
0.0369,0.01695,0.17015,0.776
0.03635,0.0161,0.171,0.77655
0.03605,0.01665,0.17035,0.77695
0.0351,0.017,0.171,0.7769
0.0357,0.0164,0.1721,0.7758
0.03565,0.01495,0.17355,0.77585
0.0339,0.01625,0.17335,0.7765
0.03425,0.0171,0.17265,0.776
0.03385,0.0173,0.1726,0.77625
0.0335,0.0176,0.17285,0.77605
0.033,0.0164,0.17305,0.77755
0.03265,0.0164,0.1746,0.77635
0.03265,0.01695,0.1736,0.7768
0.03235,0.01695,0.1734,0.7773
0.03235,0.01625,0.17465,0.77675
0.0323,0.01625,0.1737,0.77775
0.0333,0.0158,0.1737,0.7772
0.03315,0.01555,0.17405,0.77725
0.03275,0.0156,0.17445,0.7772
0.0332,0.0147,0.17505,0.77705
0.0318,0.0158,0.17515,0.77725
0.03115,0.01605,0.17555,0.77725
0.0315,0.01625,0.17615,0.7761
0.03225,0.0161,0.17625,0.7754
0.03275,0.01545,0.17645,0.77535
0.03185,0.01595,0.17665,0.77555
0.0318,0.01615,0.1763,0.77575
0.03265,0.0154,0.17855,0.7734
0.032,0.01635,0.17935,0.7723
0.0314,0.01535,0.1809,0.77235
0.03205,0.01505,0.18145,0.77145
0.0319,0.01495,0.18225,0.7709
0.0323,0.0154,0.18185,0.77045
0.0322,0.0159,0.1819,0.77
0.03255,0.01665,0.18095,0.76985
0.03355,0.01695,0.18045,0.76905
0.0337,0.01615,0.1806,0.76955
0.03315,0.0163,0.18155,0.769
0.03275,0.01685,0.18185,0.76855
0.03195,0.0172,0.1829,0.76795
0.03245,0.0167,0.18265,0.7682
0.0331,0.01705,0.1823,0.76755
0.03315,0.01735,0.18275,0.76675
0.03325,0.01775,0.18265,0.76635
0.0341,0.01775,0.1828,0.76535
0.03525,0.01695,0.18225,0.76555
0.0357,0.0169,0.182,0.7654
0.03625,0.0167,0.18245,0.7646
0.0361,0.0184,0.18025,0.76525
0.03605,0.01775,0.1807,0.7655
0.0365,0.0174,0.18135,0.76475
0.03665,0.017,0.1815,0.76485
0.0369,0.01755,0.181,0.76455
0.0356,0.0181,0.1803,0.766
0.0363,0.0174,0.1798,0.7665
0.03685,0.0163,0.17975,0.7671
0.03685,0.01715,0.17905,0.76695
0.0358,0.0182,0.1788,0.7672
0.03615,0.01815,0.17775,0.76795
0.03485,0.01835,0.1777,0.7691
0.0351,0.0171,0.17725,0.77055
0.03545,0.01665,0.17705,0.77085
0.036,0.0153,0.1772,0.7715
0.03475,0.0167,0.17695,0.7716
0.03415,0.0165,0.1771,0.77225
0.0336,0.01595,0.1782,0.77225
0.0324,0.0167,0.1783,0.7726
0.0327,0.01645,0.17845,0.7724
0.0322,0.0164,0.1786,0.7728
0.03225,0.0161,0.17845,0.7732
0.03315,0.01475,0.17845,0.77365
0.03245,0.0151,0.17875,0.7737
0.0323,0.01475,0.17945,0.7735
0.03235,0.015,0.17935,0.7733
0.03275,0.01525,0.1795,0.7725
0.03365,0.01505,0.1799,0.7714
0.03395,0.015,0.18,0.77105
0.0337,0.01485,0.18,0.77145
0.0327,0.0151,0.1792,0.773
0.0321,0.0171,0.1779,0.7729
0.0315,0.017,0.17775,0.77375
0.03115,0.01725,0.1776,0.774
0.0316,0.0164,0.17815,0.77385
0.0318,0.01555,0.17885,0.7738
0.0319,0.0155,0.1802,0.7724
0.032,0.0153,0.1817,0.771
0.0323,0.01495,0.1818,0.77095
0.03175,0.0153,0.18185,0.7711
0.03175,0.01465,0.18265,0.77095
0.03195,0.01465,0.1832,0.7702
0.03215,0.01425,0.18395,0.76965
0.03185,0.0153,0.1833,0.76955
0.0317,0.0155,0.1841,0.7687
0.031,0.0165,0.18355,0.76895
0.03105,0.01615,0.18485,0.76795
0.0317,0.01455,0.1855,0.76825
0.0314,0.01505,0.1858,0.76775
0.0315,0.016,0.18605,0.76645
0.032,0.0158,0.1857,0.7665
0.0319,0.0157,0.1856,0.7668
0.0321,0.01535,0.18575,0.7668
0.03095,0.01595,0.18555,0.76755
0.0304,0.0165,0.1867,0.7664
0.03115,0.01615,0.1865,0.7662
0.03065,0.01655,0.18685,0.76595
0.0324,0.01575,0.18785,0.764
0.0326,0.01605,0.18695,0.7644
0.03215,0.01595,0.18715,0.76475
0.03195,0.01535,0.18705,0.76565
0.03305,0.01475,0.18735,0.76485
0.03255,0.0158,0.18685,0.7648
0.03265,0.0157,0.1869,0.76475
0.03325,0.01575,0.1882,0.7628
0.0335,0.01505,0.1891,0.76235
0.03345,0.0152,0.18965,0.7617
0.03355,0.0155,0.1894,0.76155
0.03415,0.0153,0.18965,0.7609
0.03385,0.0162,0.1897,0.76025
0.03305,0.01645,0.1906,0.7599
0.0327,0.0161,0.19105,0.76015
0.0332,0.0163,0.19105,0.75945
0.0329,0.01665,0.19115,0.7593
0.0339,0.0167,0.19085,0.75855
0.03475,0.0175,0.1894,0.75835
0.0357,0.01785,0.18845,0.758
0.03545,0.01815,0.1873,0.7591
0.03595,0.01785,0.1866,0.7596
0.03635,0.01785,0.1861,0.7597
0.0371,0.01705,0.1855,0.76035
0.03705,0.01755,0.186,0.7594
0.03755,0.01785,0.1853,0.7593
0.03825,0.017,0.1852,0.75955
0.0384,0.016,0.1855,0.7601
0.03855,0.0163,0.1845,0.76065
0.03855,0.017,0.18335,0.7611
0.03865,0.0174,0.18225,0.7617
0.0372,0.01785,0.18215,0.7628
0.03765,0.01815,0.1824,0.7618
0.03755,0.0198,0.18015,0.7625
0.03805,0.01985,0.1796,0.7625
0.03725,0.0195,0.1802,0.76305
0.0385,0.0194,0.17915,0.76295
0.03915,0.01965,0.17745,0.76375
0.0393,0.0187,0.1776,0.7644
0.03955,0.0197,0.17595,0.7648
0.0393,0.01955,0.17585,0.7653
0.0391,0.0191,0.17595,0.76585
0.03955,0.0197,0.1744,0.76635
0.0386,0.0199,0.1732,0.7683
0.0389,0.0194,0.17315,0.76855
0.03785,0.02015,0.1721,0.7699
0.0385,0.02075,0.17025,0.7705
0.03955,0.019,0.1699,0.77155
0.0393,0.01875,0.16915,0.7728
0.03975,0.01785,0.16995,0.77245
0.03985,0.0181,0.1687,0.77335
0.03935,0.0182,0.16885,0.7736
0.0383,0.01725,0.16875,0.7757
0.03695,0.0184,0.16885,0.7758
0.0368,0.0177,0.16845,0.77705
0.03625,0.0179,0.16865,0.7772
0.03835,0.01625,0.16845,0.77695
0.03735,0.01605,0.1688,0.7778
0.03665,0.0166,0.168,0.77875
0.0357,0.0167,0.16845,0.77915
0.03605,0.01665,0.16855,0.77875
0.0361,0.01655,0.16935,0.778
0.0351,0.01695,0.17075,0.7772
0.0361,0.0159,0.17115,0.77685
0.03535,0.01665,0.1708,0.7772
0.0359,0.01735,0.16985,0.7769
0.0366,0.018,0.1698,0.7756
0.03805,0.01765,0.16895,0.77535
0.0375,0.01695,0.1686,0.77695
0.0376,0.01635,0.16905,0.777
0.03765,0.01545,0.17015,0.77675
0.03605,0.01625,0.1708,0.7769
0.03675,0.0165,0.1703,0.77645
0.0364,0.01535,0.1715,0.77675
0.03655,0.0158,0.1712,0.77645
0.03595,0.016,0.17115,0.7769
0.03595,0.0157,0.1718,0.77655
0.03605,0.0158,0.17095,0.7772
0.03665,0.01605,0.1706,0.7767
0.03625,0.01555,0.1718,0.7764
0.0359,0.01595,0.17185,0.7763
0.035,0.0165,0.1715,0.777
0.03505,0.01675,0.172,0.7762
0.03585,0.01575,0.1723,0.7761
0.03435,0.01665,0.17345,0.77555
0.0349,0.0166,0.17365,0.77485
0.0344,0.01685,0.17385,0.7749
0.03445,0.01765,0.1738,0.7741
0.03385,0.0178,0.1743,0.77405
0.0343,0.01775,0.17475,0.7732
0.035,0.01605,0.17545,0.7735
0.0351,0.01595,0.1757,0.77325
0.03515,0.01655,0.17525,0.77305
0.035,0.01725,0.17505,0.7727
0.0363,0.0165,0.17635,0.77085
0.0359,0.01805,0.1741,0.77195
0.03645,0.0184,0.1737,0.77145
0.0378,0.01815,0.17285,0.7712
0.03775,0.01875,0.1729,0.7706
0.03745,0.0185,0.1739,0.77015
0.0381,0.0181,0.17345,0.77035
0.03785,0.01775,0.1736,0.7708
0.03745,0.0178,0.1737,0.77105
0.0374,0.0182,0.1745,0.7699
0.03745,0.01795,0.1746,0.77
0.0375,0.01765,0.17525,0.7696
0.03645,0.0183,0.1749,0.77035
0.0366,0.0173,0.17535,0.77075
0.03555,0.01695,0.17555,0.77195
0.03635,0.0169,0.1754,0.77135
0.0371,0.0159,0.1759,0.7711
0.03695,0.01565,0.1769,0.7705
0.0367,0.01485,0.1779,0.77055
0.036,0.0164,0.1782,0.7694
0.03565,0.0165,0.1781,0.76975
0.0353,0.01805,0.17775,0.7689
0.03535,0.01705,0.17875,0.76885
0.0352,0.01725,0.17905,0.7685
0.03565,0.01685,0.1784,0.7691
0.0358,0.01695,0.1786,0.76865
0.0354,0.01675,0.17925,0.7686
0.03515,0.01725,0.17885,0.76875
0.03585,0.01755,0.1792,0.7674
0.03635,0.0173,0.1792,0.76715
0.03575,0.0168,0.1813,0.76615
0.03595,0.01655,0.18185,0.76565
0.0355,0.01715,0.18155,0.7658
0.03545,0.0175,0.1819,0.76515
0.036,0.01705,0.18315,0.7638
0.0358,0.01735,0.18315,0.7637
0.0359,0.01765,0.18265,0.7638
0.0364,0.0172,0.18365,0.76275
0.03575,0.01725,0.1835,0.7635
0.03625,0.01735,0.1835,0.7629
0.0358,0.01745,0.18355,0.7632
0.0351,0.01845,0.1823,0.76415
0.03505,0.01905,0.18275,0.76315
0.0357,0.01825,0.18355,0.7625
0.0362,0.0181,0.18295,0.76275
0.0365,0.0173,0.1836,0.7626
0.037,0.01745,0.1833,0.76225
0.037,0.01715,0.18315,0.7627
0.03635,0.01665,0.18365,0.76335
0.03535,0.0171,0.18375,0.7638
0.03565,0.0161,0.18465,0.7636
0.03565,0.01685,0.18385,0.76365
0.0359,0.01655,0.18305,0.7645
0.0368,0.01525,0.1839,0.76405
0.03635,0.0157,0.18375,0.7642
0.03605,0.01775,0.18325,0.76295
0.0364,0.018,0.18365,0.76195
0.03565,0.01915,0.18375,0.76145
0.03635,0.0186,0.184,0.76105
0.03625,0.0179,0.1833,0.76255
0.03535,0.01815,0.1834,0.7631
0.0361,0.01765,0.1827,0.76355
0.0362,0.0176,0.18165,0.76455
0.0358,0.0187,0.1807,0.7648
0.0368,0.01825,0.18065,0.7643
0.0372,0.0181,0.1804,0.7643
0.03725,0.0181,0.1801,0.76455
0.03695,0.019,0.17925,0.7648
0.0372,0.01825,0.1803,0.76425
0.03845,0.01825,0.17945,0.76385
0.03855,0.01765,0.17905,0.76475
0.03865,0.01745,0.17925,0.76465
0.0387,0.01695,0.18035,0.764
0.03785,0.0172,0.18075,0.7642
0.0376,0.0176,0.1803,0.7645
0.03735,0.0178,0.17955,0.7653
0.03665,0.01775,0.18025,0.76535
0.03765,0.018,0.1804,0.76395
0.0369,0.01795,0.1803,0.76485
0.03725,0.01805,0.1796,0.7651
0.0374,0.0179,0.179,0.7657
0.03655,0.01825,0.1793,0.7659
0.0374,0.0177,0.1795,0.7654
0.03675,0.0181,0.1807,0.76445
0.0372,0.018,0.18055,0.76425
0.03875,0.01795,0.17955,0.76375
0.03775,0.0186,0.1801,0.76355
0.0381,0.01865,0.1797,0.76355
0.0381,0.0188,0.1779,0.7652
0.0381,0.01825,0.17815,0.7655
0.03855,0.0183,0.17675,0.7664
0.0378,0.0176,0.1776,0.767
0.03705,0.0177,0.1776,0.76765
0.03685,0.0183,0.17645,0.7684
0.03685,0.01805,0.17585,0.76925
0.0373,0.01735,0.1762,0.76915
0.03625,0.0173,0.17725,0.7692
0.0357,0.01795,0.1775,0.76885
0.0357,0.01755,0.1781,0.76865
0.03465,0.01795,0.1786,0.7688
0.03455,0.0175,0.17945,0.7685
0.03445,0.01785,0.1804,0.7673
0.03575,0.0163,0.18135,0.7666
0.03485,0.017,0.18135,0.7668
0.03685,0.0156,0.18215,0.7654
0.03585,0.0156,0.1836,0.76495
0.03555,0.01495,0.18385,0.76565
0.03555,0.015,0.18365,0.7658
0.03535,0.01585,0.18335,0.76545
0.03495,0.0153,0.1833,0.76645
0.03525,0.01545,0.184,0.7653
0.0349,0.01585,0.18305,0.7662
0.03385,0.0155,0.1837,0.76695
0.03415,0.0161,0.1825,0.76725
0.0339,0.0161,0.18265,0.76735
0.03375,0.01645,0.1829,0.7669
0.03445,0.0169,0.1821,0.76655
0.03345,0.01625,0.18345,0.76685
0.03275,0.01685,0.1838,0.7666
0.0332,0.0169,0.1846,0.7653
0.0331,0.0163,0.1846,0.766
0.0344,0.01675,0.18385,0.765
0.03385,0.0174,0.18345,0.7653
0.03335,0.01775,0.1842,0.7647
0.0339,0.01725,0.1846,0.76425
0.0345,0.01695,0.1839,0.76465
0.0336,0.01685,0.18375,0.7658
0.0336,0.0167,0.1833,0.7664
0.03385,0.0174,0.18275,0.766
0.03505,0.017,0.1823,0.76565
0.0352,0.0172,0.183,0.7646
0.0355,0.01765,0.1829,0.76395
0.03555,0.01785,0.1822,0.7644
0.03535,0.01755,0.1819,0.7652
0.0357,0.0171,0.18115,0.76605
0.0355,0.01715,0.1806,0.76675
0.0358,0.0169,0.18055,0.76675
0.03555,0.0175,0.17995,0.767
0.0363,0.0177,0.1794,0.7666
0.0357,0.0174,0.1792,0.7677
0.0361,0.01695,0.1795,0.76745
0.0361,0.018,0.1789,0.767
0.03665,0.01775,0.1787,0.7669
0.0358,0.0186,0.17895,0.76665
0.0362,0.0173,0.17995,0.76655
0.0355,0.01735,0.1805,0.76665
0.03565,0.01855,0.1797,0.7661
0.0363,0.01895,0.1798,0.76495
0.0371,0.01895,0.1795,0.76445
0.0374,0.01785,0.18045,0.7643
0.03765,0.0172,0.18035,0.7648
0.0369,0.01855,0.1797,0.76485
0.03745,0.01845,0.17975,0.76435
0.0373,0.01785,0.1788,0.76605
0.03775,0.0177,0.1788,0.76575
0.0371,0.0196,0.17715,0.76615
0.03835,0.0178,0.1769,0.76695
0.03785,0.01835,0.17625,0.76755
0.03755,0.0183,0.176,0.76815
0.03785,0.01755,0.17685,0.76775
0.03795,0.01705,0.1768,0.7682
0.03705,0.01805,0.1764,0.7685
0.03615,0.0181,0.17625,0.7695
0.0357,0.0173,0.17665,0.77035
0.03645,0.0161,0.17815,0.7693
0.0356,0.017,0.17755,0.76985
0.0349,0.0171,0.17695,0.77105
0.03535,0.01745,0.1761,0.7711
0.03425,0.0177,0.1756,0.77245
0.03485,0.0167,0.17655,0.7719
0.0355,0.0168,0.176,0.7717
0.0363,0.01565,0.17655,0.7715
0.03575,0.0164,0.1768,0.77105
0.03605,0.016,0.1765,0.77145
0.03535,0.0169,0.17585,0.7719
0.036,0.0159,0.17555,0.77255
0.03505,0.01665,0.17595,0.77235
0.03455,0.0172,0.1757,0.77255
0.03425,0.0175,0.17595,0.7723
0.0343,0.01745,0.1762,0.77205
0.0348,0.0176,0.1764,0.7712
0.03545,0.0181,0.1757,0.77075
0.03585,0.0176,0.17495,0.7716
