
--------------------------
Total energy: 17084.20 Joules, including:
	CPU energy: 17084.20 Joules
	GPU energy: 0.00 Joules
--------------------------

--------------------------
Total energy: 18117.04 Joules, including:
	CPU energy: 18117.04 Joules
	GPU energy: 0.00 Joules
--------------------------

--------------------------
Total energy: 18115.36 Joules, including:
	CPU energy: 18115.36 Joules
	GPU energy: 0.00 Joules
--------------------------

--------------------------
Total energy: 18115.41 Joules, including:
	CPU energy: 18115.41 Joules
	GPU energy: 0.00 Joules
--------------------------

--------------------------
Total energy: 18114.27 Joules, including:
	CPU energy: 18114.27 Joules
	GPU energy: 0.00 Joules
--------------------------

--------------------------
Total energy: 17424.45 Joules, including:
	CPU energy: 17424.45 Joules
	GPU energy: 0.00 Joules
--------------------------

--------------------------
Total energy: 13880.38 Joules, including:
	CPU energy: 13880.38 Joules
	GPU energy: 0.00 Joules
--------------------------

--------------------------
Total energy: 17820.53 Joules, including:
	CPU energy: 17820.53 Joules
	GPU energy: 0.00 Joules
--------------------------

--------------------------
Total energy: 13881.70 Joules, including:
	CPU energy: 13881.70 Joules
	GPU energy: 0.00 Joules
--------------------------

--------------------------
Total energy: -244204.94 Joules, including:
	CPU energy: -244204.94 Joules
	GPU energy: 0.00 Joules
--------------------------
