I,E,S,R
0.001000,0.000550,0.998450,0.000000
0.000950,0.001050,0.997750,0.000250
0.001250,0.001700,0.996700,0.000350
0.001600,0.002300,0.995650,0.000450
0.002050,0.003050,0.994200,0.000700
0.002950,0.003950,0.992200,0.000900
0.003650,0.006000,0.989000,0.001350
0.005300,0.007300,0.985650,0.001750
0.007000,0.011200,0.979750,0.002050
0.009300,0.014700,0.973050,0.002950
0.011800,0.018050,0.965650,0.004500
0.015750,0.022650,0.955700,0.005900
0.020600,0.030300,0.941550,0.007550
0.026150,0.039350,0.924150,0.010350
0.033150,0.049550,0.903450,0.013850
0.042800,0.060400,0.878700,0.018100
0.054700,0.076200,0.845750,0.023350
0.067100,0.095050,0.806750,0.031100
0.086450,0.117150,0.757000,0.039400
0.106900,0.137950,0.703750,0.051400
0.131000,0.160350,0.642300,0.066350
0.158200,0.186300,0.571900,0.083600
0.188650,0.204600,0.501800,0.104950
0.221150,0.222000,0.426350,0.130500
0.257500,0.233250,0.351450,0.157800
0.289850,0.233500,0.285950,0.190700
0.316800,0.229150,0.225600,0.228450
0.336450,0.217000,0.175150,0.271400
0.353450,0.194000,0.138050,0.314500
0.363150,0.172900,0.104550,0.359400
0.363800,0.149150,0.080350,0.406700
0.353550,0.130850,0.059850,0.455750
0.342450,0.109000,0.046050,0.502500
0.324950,0.089100,0.038600,0.547350
0.305750,0.072850,0.031450,0.589950
0.284750,0.059900,0.027100,0.628250
0.263150,0.048400,0.023400,0.665050
0.242350,0.039100,0.021000,0.697550
0.220450,0.031900,0.019850,0.727800
0.199550,0.025600,0.019550,0.755300
0.178950,0.021150,0.018950,0.780950
0.161600,0.017600,0.018450,0.802350
0.144400,0.014550,0.018900,0.822150
0.127550,0.012600,0.019600,0.840250
0.112150,0.011500,0.020950,0.855400
0.100150,0.009800,0.022150,0.867900
0.090300,0.008200,0.023300,0.878200
0.079950,0.007550,0.025600,0.886900
0.070650,0.006850,0.027550,0.894950
0.062800,0.006150,0.028750,0.902300
0.055500,0.005650,0.031000,0.907850
0.049550,0.004500,0.033750,0.912200
0.043400,0.004550,0.035600,0.916450
0.039550,0.004150,0.037300,0.919000
0.035950,0.003950,0.039350,0.920750
0.032700,0.003250,0.042450,0.921600
0.029000,0.003400,0.045100,0.922500
0.025850,0.003200,0.047500,0.923450
0.022850,0.003600,0.049800,0.923750
0.021050,0.003050,0.053150,0.922750
0.019300,0.002800,0.055450,0.922450
0.016800,0.002750,0.058000,0.922450
0.015100,0.003050,0.060750,0.921100
0.013650,0.002700,0.063150,0.920500
0.012400,0.002800,0.065050,0.919750
0.011000,0.002900,0.067450,0.918650
0.010000,0.003200,0.069700,0.917100
0.009850,0.002700,0.072150,0.915300
0.009100,0.002450,0.074600,0.913850
0.008350,0.002250,0.077900,0.911500
0.007150,0.002150,0.081300,0.909400
0.006500,0.002200,0.083500,0.907800
0.005850,0.001850,0.086400,0.905900
0.005650,0.001550,0.089750,0.903050
0.004900,0.001350,0.092950,0.900800
0.005000,0.001350,0.096100,0.897550
0.004600,0.001300,0.098400,0.895700
0.004500,0.001350,0.100550,0.893600
0.004250,0.001650,0.102400,0.891700
0.004100,0.001350,0.105150,0.889400
0.004050,0.001250,0.107550,0.887150
0.003850,0.001300,0.109950,0.884900
0.003500,0.001300,0.112800,0.882400
0.003050,0.001300,0.116050,0.879600
0.002600,0.001350,0.118400,0.877650
0.002400,0.001000,0.121050,0.875550
0.002300,0.000900,0.124350,0.872450
0.002100,0.000750,0.127150,0.870000
0.002000,0.000450,0.129850,0.867700
0.001650,0.000750,0.132650,0.864950
0.001700,0.000650,0.135100,0.862550
0.001450,0.001050,0.137600,0.859900
0.001650,0.000700,0.139600,0.858050
0.001350,0.000950,0.142400,0.855300
0.001500,0.000650,0.145500,0.852350
0.001400,0.000750,0.148300,0.849550
0.001200,0.000950,0.150500,0.847350
0.001450,0.000750,0.152650,0.845150
0.001400,0.000550,0.155100,0.842950
0.001300,0.000500,0.157850,0.840350
0.001250,0.000500,0.160000,0.838250
0.001200,0.000700,0.162450,0.835650
0.001050,0.000600,0.165450,0.832900
0.001150,0.000650,0.167700,0.830500
0.001350,0.000600,0.170550,0.827500
0.001450,0.000350,0.172450,0.825750
0.001400,0.000500,0.175150,0.822950
0.001200,0.000500,0.177350,0.820950
0.001200,0.000300,0.179650,0.818850
0.001050,0.000400,0.182100,0.816450
0.001200,0.000200,0.185100,0.813500
0.001100,0.000300,0.187050,0.811550
0.001050,0.000450,0.189700,0.808800
0.001050,0.000300,0.192350,0.806300
0.000850,0.000750,0.194150,0.804250
0.000900,0.000800,0.196400,0.801900
0.000750,0.001000,0.198050,0.800200
0.000950,0.000900,0.199700,0.798450
0.001150,0.000700,0.201650,0.796500
0.001200,0.000750,0.204050,0.794000
0.001150,0.000800,0.206250,0.791800
0.001100,0.000600,0.208850,0.789450
0.001150,0.000550,0.210400,0.787900
0.001250,0.000450,0.212350,0.785950
0.001000,0.000700,0.214800,0.783500
0.001050,0.000500,0.217250,0.781200
0.001050,0.000600,0.219500,0.778850
0.001100,0.000650,0.221300,0.776950
0.000900,0.000700,0.222950,0.775450
0.000950,0.000550,0.225850,0.772650
0.001050,0.000600,0.227950,0.770400
0.001250,0.000450,0.230250,0.768050
0.001250,0.000500,0.232150,0.766100
0.001250,0.000500,0.234200,0.764050
0.001000,0.000900,0.235550,0.762550
0.001350,0.000550,0.237450,0.760650
0.001500,0.000550,0.239600,0.758350
0.001650,0.000550,0.241050,0.756750
0.001450,0.000700,0.243050,0.754800
0.001450,0.000800,0.244700,0.753050
0.001500,0.000750,0.247100,0.750650
0.001550,0.000750,0.248550,0.749150
0.001600,0.000450,0.251100,0.746850
0.001350,0.000800,0.252750,0.745100
0.001150,0.000700,0.254900,0.743250
0.001200,0.000900,0.256950,0.740950
0.001450,0.000850,0.259050,0.738650
0.001400,0.000850,0.261300,0.736450
0.001450,0.000550,0.263250,0.734750
0.001350,0.000600,0.265250,0.732800
0.001300,0.000700,0.267250,0.730750
0.001300,0.000950,0.268600,0.729150
0.001350,0.001000,0.270350,0.727300
0.001350,0.001100,0.272150,0.725400
0.001500,0.001200,0.273850,0.723450
0.001950,0.000900,0.275800,0.721350
0.002100,0.000950,0.277800,0.719150
0.002250,0.001450,0.279350,0.716950
0.002200,0.001500,0.281150,0.715150
0.002100,0.001550,0.283000,0.713350
0.002350,0.001650,0.284150,0.711850
0.002550,0.001850,0.285800,0.709800
0.003100,0.001650,0.287050,0.708200
0.003250,0.001450,0.288100,0.707200
0.003050,0.001600,0.289500,0.705850
0.003050,0.002250,0.291000,0.703700
0.003150,0.002150,0.293150,0.701550
0.003400,0.002450,0.294000,0.700150
0.003500,0.002350,0.295400,0.698750
0.003950,0.002650,0.296550,0.696850
0.003850,0.002650,0.297900,0.695600
0.004050,0.002350,0.299550,0.694050
0.003950,0.002550,0.301200,0.692300
0.004050,0.002700,0.302550,0.690700
0.004300,0.002650,0.303800,0.689250
0.004500,0.002800,0.304750,0.687950
0.004700,0.003250,0.305600,0.686450
0.004700,0.003650,0.306400,0.685250
0.005100,0.004050,0.307050,0.683800
0.005150,0.004750,0.308050,0.682050
0.005250,0.004800,0.308400,0.681550
0.006150,0.004700,0.309300,0.679850
0.006650,0.005150,0.309700,0.678500
0.006900,0.006050,0.308950,0.678100
0.007350,0.006500,0.309950,0.676200
0.008800,0.006500,0.309350,0.675350
0.009250,0.007100,0.309150,0.674500
0.009450,0.008550,0.308350,0.673650
0.010500,0.008450,0.308000,0.673050
0.010850,0.008550,0.307800,0.672800
0.012300,0.008700,0.307000,0.672000
0.013150,0.009250,0.305550,0.672050
0.014950,0.008650,0.304000,0.672400
0.015100,0.010050,0.302100,0.672750
0.015550,0.011300,0.300800,0.672350
0.016100,0.011900,0.299300,0.672700
0.017300,0.013100,0.296900,0.672700
0.017900,0.014700,0.294950,0.672450
0.020300,0.014150,0.293600,0.671950
0.021950,0.013850,0.291400,0.672800
0.021700,0.014900,0.288800,0.674600
0.022300,0.017200,0.284650,0.675850
0.023450,0.018150,0.281300,0.677100
0.024950,0.018400,0.277850,0.678800
0.026450,0.018950,0.273700,0.680900
0.027900,0.019600,0.270150,0.682350
0.029050,0.020700,0.266150,0.684100
0.030600,0.021550,0.262100,0.685750
0.033250,0.022050,0.257200,0.687500
0.034700,0.023600,0.252100,0.689600
0.037450,0.023750,0.247200,0.691600
0.039400,0.023350,0.243250,0.694000
0.040650,0.023900,0.238400,0.697050
0.041650,0.024650,0.233100,0.700600
0.043650,0.024050,0.228500,0.703800
0.044100,0.024850,0.223850,0.707200
0.044600,0.024250,0.219600,0.711550
0.045800,0.023550,0.215500,0.715150
0.044350,0.024600,0.210700,0.720350
0.045350,0.024350,0.206350,0.723950
0.046150,0.025300,0.201600,0.726950
0.045750,0.026600,0.196650,0.731000
0.046400,0.026350,0.192950,0.734300
0.046850,0.026400,0.188650,0.738100
0.046850,0.026850,0.184600,0.741700
0.047950,0.026400,0.181250,0.744400
0.048250,0.025100,0.177950,0.748700
0.048650,0.024800,0.174400,0.752150
0.048850,0.024300,0.170900,0.755950
0.048350,0.024100,0.167750,0.759800
0.048050,0.022850,0.165900,0.763200
0.048900,0.021050,0.164050,0.766000
0.047200,0.023350,0.159750,0.769700
0.046600,0.022450,0.157550,0.773400
0.045400,0.021600,0.155600,0.777400
0.044050,0.021900,0.152950,0.781100
0.043750,0.020750,0.151750,0.783750
0.043650,0.019850,0.150550,0.785950
0.044750,0.019000,0.148850,0.787400
0.044650,0.018000,0.147800,0.789550
0.043150,0.017600,0.146400,0.792850
0.042250,0.018300,0.144850,0.794600
0.041200,0.018400,0.143000,0.797400
0.041250,0.017800,0.142650,0.798300
0.040150,0.017550,0.142000,0.800300
0.039550,0.016500,0.142550,0.801400
0.038750,0.016500,0.141600,0.803150
0.037500,0.016700,0.141450,0.804350
0.037200,0.015550,0.141850,0.805400
0.035650,0.015550,0.142050,0.806750
0.034950,0.014300,0.142950,0.807800
0.034750,0.013300,0.141900,0.810050
0.033450,0.013750,0.142050,0.810750
0.031300,0.013900,0.142150,0.812650
0.030300,0.013450,0.142800,0.813450
0.031250,0.012500,0.143750,0.812500
0.029900,0.012700,0.144500,0.812900
0.028350,0.012400,0.146150,0.813100
0.029150,0.011550,0.147000,0.812300
0.028200,0.011050,0.148150,0.812600
0.027200,0.011250,0.149000,0.812550
0.027450,0.010750,0.151050,0.810750
0.026050,0.010900,0.151700,0.811350
0.024850,0.010850,0.152600,0.811700
0.024400,0.010450,0.153000,0.812150
0.024400,0.009750,0.155150,0.810700
0.022900,0.010950,0.156250,0.809900
0.021750,0.010950,0.157100,0.810200
0.021950,0.010750,0.158500,0.808800
0.020950,0.010950,0.158850,0.809250
0.020800,0.010600,0.160850,0.807750
0.021100,0.009700,0.162550,0.806650
0.021900,0.008700,0.164400,0.805000
0.021550,0.009250,0.166750,0.802450
0.021400,0.009550,0.167850,0.801200
0.021650,0.008750,0.170000,0.799600
0.020700,0.009150,0.172100,0.798050
0.020200,0.009000,0.173900,0.796900
0.020350,0.009600,0.176000,0.794050
0.020000,0.010100,0.177650,0.792250
0.019350,0.009850,0.178700,0.792100
0.020200,0.008750,0.180500,0.790550
0.018550,0.009800,0.182300,0.789350
0.018750,0.009550,0.183850,0.787850
0.019150,0.009750,0.186200,0.784900
0.019200,0.010300,0.187750,0.782750
0.018700,0.010300,0.189600,0.781400
0.018400,0.009650,0.190750,0.781200
0.018400,0.009800,0.191650,0.780150
0.018950,0.009550,0.192900,0.778600
0.018800,0.010150,0.194350,0.776700
0.018450,0.010550,0.195300,0.775700
0.018700,0.010250,0.197350,0.773700
0.019050,0.009950,0.199550,0.771450
0.019200,0.010250,0.201100,0.769450
0.019600,0.010100,0.202450,0.767850
0.018900,0.010200,0.203950,0.766950
0.019450,0.010500,0.204700,0.765350
0.019250,0.010750,0.205500,0.764500
0.018500,0.011150,0.207850,0.762500
0.018450,0.010600,0.208950,0.762000
0.019300,0.010000,0.210400,0.760300
0.019800,0.011000,0.210750,0.758450
0.020850,0.010500,0.212050,0.756600
0.020850,0.011550,0.213000,0.754600
0.021400,0.011950,0.213900,0.752750
0.021700,0.011800,0.214800,0.751700
0.021800,0.012650,0.215800,0.749750
0.021500,0.013500,0.216050,0.748950
0.023400,0.013200,0.216300,0.747100
0.023200,0.014250,0.215950,0.746600
0.024350,0.014750,0.216000,0.744900
0.025100,0.015000,0.215400,0.744500
0.025850,0.015400,0.214600,0.744150
0.026450,0.015200,0.215350,0.743000
0.027000,0.015100,0.215200,0.742700
0.027400,0.015600,0.214750,0.742250
0.027600,0.016000,0.215550,0.740850
0.027450,0.017150,0.215150,0.740250
0.028250,0.016150,0.214700,0.740900
0.028850,0.016550,0.214250,0.740350
0.029950,0.016300,0.213650,0.740100
0.030650,0.017300,0.212350,0.739700
0.030750,0.017800,0.211500,0.739950
0.031800,0.017350,0.211000,0.739850
0.032700,0.017350,0.209600,0.740350
0.032450,0.017950,0.209350,0.740250
0.033000,0.017500,0.208700,0.740800
0.033600,0.017300,0.207250,0.741850
0.034750,0.018800,0.205100,0.741350
0.034600,0.019150,0.203850,0.742400
0.035500,0.019300,0.202600,0.742600
0.035300,0.020500,0.200600,0.743600
0.035550,0.019650,0.200550,0.744250
0.036850,0.018950,0.200400,0.743800
0.037800,0.019450,0.199200,0.743550
0.038400,0.020200,0.197100,0.744300
0.039200,0.019600,0.195650,0.745550
0.039100,0.019800,0.194800,0.746300
0.039100,0.020850,0.191900,0.748150
0.039100,0.021250,0.190050,0.749600
0.040650,0.020750,0.189350,0.749250
0.039900,0.021350,0.188700,0.750050
0.040000,0.021650,0.187950,0.750400
0.041000,0.021350,0.186050,0.751600
0.041950,0.020200,0.184700,0.753150
0.040500,0.020500,0.183600,0.755400
0.041050,0.019800,0.181350,0.757800
0.040450,0.019850,0.180400,0.759300
0.039850,0.021050,0.179600,0.759500
0.039800,0.020300,0.179950,0.759950
0.040350,0.019650,0.180000,0.760000
0.040200,0.019150,0.179550,0.761100
0.041050,0.018750,0.179450,0.760750
0.040850,0.019200,0.178500,0.761450
0.040300,0.018050,0.179100,0.762550
0.040150,0.018000,0.178150,0.763700
0.039500,0.017150,0.178600,0.764750
0.038250,0.017750,0.178050,0.765950
0.037300,0.017600,0.177950,0.767150
0.037200,0.018200,0.177250,0.767350
0.036850,0.018700,0.177450,0.767000
0.036600,0.019500,0.177400,0.766500
0.037400,0.018750,0.176900,0.766950
0.037000,0.019050,0.176850,0.767100
0.037750,0.019650,0.176650,0.765950
0.037000,0.019400,0.176500,0.767100
0.037350,0.018000,0.177400,0.767250
0.036800,0.018900,0.176400,0.767900
0.036550,0.019150,0.175850,0.768450
0.036950,0.018050,0.176350,0.768650
0.036750,0.017700,0.177100,0.768450
0.036850,0.017300,0.177550,0.768300
0.036350,0.017100,0.177850,0.768700
0.036050,0.017250,0.178450,0.768250
0.035300,0.018200,0.177850,0.768650
0.035600,0.018200,0.177150,0.769050
0.035300,0.018900,0.176900,0.768900
0.036050,0.018800,0.177150,0.768000
0.036250,0.019250,0.177200,0.767300
0.038100,0.019100,0.177000,0.765800
0.037900,0.019100,0.176950,0.766050
0.038100,0.018650,0.176150,0.767100
0.039200,0.018100,0.175850,0.766850
0.039200,0.017900,0.175800,0.767100
0.039400,0.016600,0.176800,0.767200
0.037950,0.017300,0.176300,0.768450
0.038200,0.017900,0.175350,0.768550
0.038300,0.018150,0.175400,0.768150
0.037800,0.018250,0.175350,0.768600
0.037100,0.018000,0.174750,0.770150
0.038350,0.017650,0.173650,0.770350
0.037350,0.018350,0.174200,0.770100
0.036550,0.017950,0.174850,0.770650
0.037050,0.017550,0.175500,0.769900
0.037500,0.017600,0.175150,0.769750
0.037650,0.017600,0.174750,0.770000
0.038050,0.018350,0.174400,0.769200
0.037800,0.018300,0.175100,0.768800
0.037500,0.018100,0.175500,0.768900
0.038250,0.017300,0.175550,0.768900
0.037500,0.016350,0.176650,0.769500
0.037500,0.016100,0.177250,0.769150
0.036800,0.016100,0.177250,0.769850
0.036300,0.016900,0.175800,0.771000
0.036750,0.017050,0.175250,0.770950
0.035800,0.016900,0.175300,0.772000
0.035450,0.017100,0.175400,0.772050
0.035400,0.016650,0.175950,0.772000
0.033950,0.017400,0.175350,0.773300
0.033250,0.018100,0.176050,0.772600
0.033300,0.017450,0.176600,0.772650
0.034300,0.017150,0.177350,0.771200
0.033300,0.017400,0.177250,0.772050
0.034950,0.016850,0.177450,0.770750
0.034100,0.017350,0.177500,0.771050
0.033850,0.018000,0.177000,0.771150
0.034550,0.017400,0.177400,0.770650
0.034900,0.017700,0.178050,0.769350
0.034800,0.016650,0.178200,0.770350
0.034750,0.015800,0.179200,0.770250
0.034700,0.015250,0.179900,0.770150
0.033400,0.015850,0.180300,0.770450
0.033900,0.015200,0.181400,0.769500
0.033300,0.015650,0.182200,0.768850
0.032750,0.015650,0.183700,0.767900
0.032500,0.016250,0.182550,0.768700
0.032900,0.015800,0.184000,0.767300
0.032450,0.017250,0.183250,0.767050
0.032600,0.016700,0.184000,0.766700
0.032750,0.017650,0.183950,0.765650
0.032700,0.017900,0.183000,0.766400
0.032950,0.016050,0.184100,0.766900
0.031900,0.017450,0.184100,0.766550
0.031800,0.018350,0.184500,0.765350
0.032600,0.018050,0.184250,0.765100
0.033350,0.017900,0.183800,0.764950
0.034400,0.017300,0.183300,0.765000
0.033800,0.017150,0.182850,0.766200
0.033450,0.016950,0.183250,0.766350
0.033650,0.017200,0.182650,0.766500
0.033650,0.017850,0.183200,0.765300
0.035000,0.016600,0.183050,0.765350
0.034750,0.018250,0.182650,0.764350
0.035100,0.017400,0.182400,0.765100
0.035050,0.017500,0.181950,0.765500
0.034050,0.018200,0.181550,0.766200
0.034850,0.018150,0.181550,0.765450
0.034650,0.017900,0.182050,0.765400
0.035100,0.017500,0.182400,0.765000
0.034900,0.018100,0.182400,0.764600
0.034550,0.019150,0.181300,0.765000
0.035000,0.019600,0.181300,0.764100
0.036150,0.019550,0.179650,0.764650
0.036600,0.020050,0.178500,0.764850
0.037400,0.020050,0.178000,0.764550
0.038050,0.019350,0.177500,0.765100
0.038000,0.018650,0.178050,0.765300
0.037250,0.017900,0.178700,0.766150
0.036800,0.017550,0.178500,0.767150
0.036550,0.017250,0.177850,0.768350
0.035250,0.017850,0.176450,0.770450
0.034550,0.017400,0.176450,0.771600
0.034400,0.017100,0.176650,0.771850
0.033950,0.016550,0.178050,0.771450
0.034200,0.016200,0.178800,0.770800
0.034500,0.016550,0.179250,0.769700
0.034700,0.016750,0.180000,0.768550
0.033950,0.017450,0.179950,0.768650
0.033850,0.016550,0.180450,0.769150
0.034750,0.015900,0.180400,0.768950
0.034000,0.016750,0.181050,0.768200
0.034400,0.017650,0.180550,0.767400
0.034250,0.017550,0.181100,0.767100
0.034400,0.017400,0.181550,0.766650
0.034500,0.017500,0.181500,0.766500
0.034900,0.016800,0.182000,0.766300
0.035600,0.017400,0.181300,0.765700
0.035150,0.018650,0.180350,0.765850
0.035250,0.018150,0.178750,0.767850
0.035400,0.018050,0.178700,0.767850
0.034150,0.018050,0.180200,0.767600
0.034000,0.017600,0.181000,0.767400
0.034600,0.017850,0.180600,0.766950
0.034650,0.017850,0.180050,0.767450
0.035850,0.017550,0.180200,0.766400
0.035950,0.017500,0.179050,0.767500
0.035500,0.018300,0.178300,0.767900
0.035700,0.017950,0.178050,0.768300
0.035350,0.018050,0.178450,0.768150
0.035750,0.017850,0.177750,0.768650
0.036300,0.018100,0.177400,0.768200
0.037250,0.017400,0.177300,0.768050
0.036800,0.017900,0.176350,0.768950
0.037000,0.017800,0.175250,0.769950
0.036250,0.018000,0.175250,0.770500
0.036750,0.017400,0.175650,0.770200
0.035800,0.018400,0.174550,0.771250
0.034900,0.018650,0.173900,0.772550
0.035300,0.019250,0.172650,0.772800
0.035300,0.019800,0.172100,0.772800
0.035550,0.020000,0.171900,0.772550
0.036600,0.019300,0.171450,0.772650
0.037050,0.018550,0.170900,0.773500
0.037000,0.018150,0.171350,0.773500
0.035350,0.018500,0.171850,0.774300
0.035900,0.017550,0.171850,0.774700
0.035950,0.017050,0.171450,0.775550
0.036100,0.017900,0.170250,0.775750
0.036850,0.016600,0.170850,0.775700
0.036250,0.016350,0.170100,0.777300
0.036200,0.016150,0.170850,0.776800
0.034900,0.017000,0.170950,0.777150
0.033950,0.018550,0.170650,0.776850
0.035050,0.017650,0.169950,0.777350
0.035450,0.016700,0.170150,0.777700
0.035150,0.016350,0.170650,0.777850
0.035600,0.016050,0.170700,0.777650
0.035000,0.016700,0.170150,0.778150
0.034200,0.016300,0.171100,0.778400
0.033750,0.016150,0.171300,0.778800
0.033200,0.016300,0.171650,0.778850
0.032950,0.015550,0.172350,0.779150
0.032550,0.015500,0.173150,0.778800
0.032600,0.015050,0.173900,0.778450
0.032400,0.015250,0.174000,0.778350
0.032700,0.015350,0.175200,0.776750
0.032650,0.014600,0.175500,0.777250
0.032250,0.013700,0.176850,0.777200
0.031550,0.013800,0.177250,0.777400
0.031200,0.014200,0.177700,0.776900
0.030600,0.013850,0.178800,0.776750
0.029800,0.014400,0.179750,0.776050
0.029200,0.013900,0.181650,0.775250
0.028850,0.014100,0.182500,0.774550
0.028300,0.014100,0.183250,0.774350
0.027950,0.014350,0.183800,0.773900
0.028450,0.012400,0.185200,0.773950
0.027600,0.013100,0.185750,0.773550
0.026500,0.013700,0.186300,0.773500
0.026500,0.013750,0.187750,0.772000
0.026650,0.014850,0.187850,0.770650
0.027950,0.014450,0.189300,0.768300
0.028100,0.014600,0.190250,0.767050
0.027500,0.014500,0.192050,0.765950
0.028200,0.014350,0.193250,0.764200
0.028250,0.014500,0.194400,0.762850
0.028900,0.014750,0.195650,0.760700
0.029050,0.014600,0.196200,0.760150
0.030050,0.014200,0.196500,0.759250
0.029000,0.014900,0.197900,0.758200
0.029500,0.015000,0.198350,0.757150
0.028950,0.015450,0.199100,0.756500
0.029500,0.015000,0.199200,0.756300
0.029550,0.014750,0.199600,0.756100
0.029400,0.015750,0.200150,0.754700
0.030550,0.014800,0.200300,0.754350
0.029350,0.015950,0.199600,0.755100
0.030000,0.015850,0.199550,0.754600
0.031250,0.015750,0.200000,0.753000
0.029850,0.017550,0.199500,0.753100
0.029600,0.017750,0.198600,0.754050
0.031200,0.017350,0.200100,0.751350
0.032550,0.017800,0.199650,0.750000
0.032700,0.018850,0.198900,0.749550
0.032350,0.019800,0.198850,0.749000
0.034250,0.018700,0.198850,0.748200
0.034300,0.018250,0.198350,0.749100
0.035200,0.018300,0.196950,0.749550
0.035800,0.019150,0.195300,0.749750
0.036400,0.020000,0.193500,0.750100
0.037700,0.019650,0.192800,0.749850
0.039050,0.018800,0.191200,0.750950
0.038550,0.018600,0.191000,0.751850
0.038650,0.018550,0.189850,0.752950
0.038150,0.018500,0.189250,0.754100
0.038400,0.018850,0.187600,0.755150
0.037600,0.019500,0.188000,0.754900
0.037300,0.019900,0.186850,0.755950
0.038850,0.020100,0.185550,0.755500
0.038050,0.021450,0.184050,0.756450
0.038450,0.020800,0.184550,0.756200
0.037600,0.021250,0.184850,0.756300
0.038300,0.020550,0.184300,0.756850
0.037550,0.021950,0.183500,0.757000
0.039400,0.020900,0.182950,0.756750
0.039500,0.021100,0.181800,0.757600
0.039000,0.021350,0.181250,0.758400
0.039900,0.021100,0.179300,0.759700
0.039400,0.020400,0.178850,0.761350
0.039050,0.021400,0.177700,0.761850
0.039350,0.020550,0.176700,0.763400
0.039950,0.020100,0.176600,0.763350
0.039150,0.019800,0.176500,0.764550
0.039750,0.019000,0.176350,0.764900
0.039200,0.018500,0.176300,0.766000
0.040000,0.017850,0.177300,0.764850
0.039450,0.018700,0.176450,0.765400
0.039950,0.017400,0.176200,0.766450
0.039650,0.017950,0.175200,0.767200
0.039000,0.018800,0.173400,0.768800
0.037100,0.019250,0.172900,0.770750
0.037350,0.019400,0.172350,0.770900
0.037550,0.019200,0.172650,0.770600
0.037600,0.018500,0.173450,0.770450
0.037700,0.017350,0.174700,0.770250
0.037250,0.017150,0.174800,0.770800
0.036000,0.018100,0.175050,0.770850
0.036150,0.017600,0.175950,0.770300
0.036500,0.017550,0.176600,0.769350
0.037300,0.017950,0.176550,0.768200
0.037450,0.018100,0.176000,0.768450
0.037250,0.018750,0.177250,0.766750
0.036650,0.019350,0.177400,0.766600
0.036700,0.019450,0.177050,0.766800
0.036800,0.019600,0.177300,0.766300
0.038100,0.019750,0.176700,0.765450
0.038200,0.020450,0.176700,0.764650
0.039200,0.019150,0.176400,0.765250
0.039400,0.019250,0.176150,0.765200
0.039100,0.019250,0.175900,0.765750
0.038300,0.019400,0.176050,0.766250
0.039550,0.018450,0.176050,0.765950
0.040950,0.018000,0.174750,0.766300
0.040550,0.017350,0.175050,0.767050
0.040500,0.017650,0.174150,0.767700
0.039450,0.018650,0.174200,0.767700
0.037900,0.018000,0.175450,0.768650
0.036750,0.019200,0.175450,0.768600
0.037200,0.018050,0.175700,0.769050
0.036750,0.017050,0.176650,0.769550
0.036050,0.017850,0.177200,0.768900
0.035350,0.018050,0.177800,0.768800
0.035600,0.017150,0.179200,0.768050
0.034600,0.018000,0.179250,0.768150
0.035600,0.017800,0.180200,0.766400
0.035700,0.017200,0.182100,0.765000
0.035200,0.018100,0.181950,0.764750
0.035100,0.018050,0.181850,0.765000
0.035250,0.018250,0.181750,0.764750
0.034150,0.018200,0.182350,0.765300
0.034450,0.018400,0.181550,0.765600
0.033550,0.017650,0.181850,0.766950
0.033350,0.017900,0.181150,0.767600
0.034350,0.016900,0.181800,0.766950
0.034650,0.017750,0.181650,0.765950
0.033350,0.017800,0.181500,0.767350
0.033950,0.016950,0.182600,0.766500
0.034650,0.016300,0.183300,0.765750
0.034750,0.015950,0.183750,0.765550
0.033800,0.016700,0.183600,0.765900
0.034300,0.016200,0.183150,0.766350
0.034500,0.016550,0.182950,0.766000
0.034200,0.016000,0.183800,0.766000
0.033500,0.016500,0.184500,0.765500
0.033600,0.015800,0.185650,0.764950
0.032450,0.016900,0.185000,0.765650
0.033150,0.016400,0.186400,0.764050
0.032350,0.017650,0.185400,0.764600
0.033000,0.017350,0.185450,0.764200
0.033400,0.016300,0.185850,0.764450
0.034100,0.017300,0.185800,0.762800
0.034250,0.017250,0.186050,0.762450
0.035000,0.017750,0.185200,0.762050
0.035050,0.018450,0.184950,0.761550
0.035300,0.017950,0.184350,0.762400
0.036150,0.017200,0.183450,0.763200
0.035900,0.017650,0.184000,0.762450
0.035700,0.018450,0.183350,0.762500
0.036700,0.017550,0.183500,0.762250
0.037350,0.017850,0.183350,0.761450
0.036600,0.019550,0.182800,0.761050
0.037250,0.018900,0.183100,0.760750
0.037100,0.019150,0.182400,0.761350
0.037200,0.018750,0.182050,0.762000
0.037500,0.018700,0.181400,0.762400
0.038650,0.017200,0.181850,0.762300
0.038200,0.017650,0.181100,0.763050
0.036950,0.018150,0.180300,0.764600
0.037100,0.017550,0.180700,0.764650
0.037100,0.018700,0.179700,0.764500
0.037750,0.019150,0.179050,0.764050
0.037000,0.018650,0.178750,0.765600
0.037200,0.018250,0.178200,0.766350
0.037250,0.018750,0.177350,0.766650
0.037650,0.017950,0.176950,0.767450
0.037650,0.017700,0.176700,0.767950
0.037700,0.018400,0.176450,0.767450
0.037350,0.017850,0.177250,0.767550
0.036750,0.017950,0.176750,0.768550
0.036250,0.018300,0.177200,0.768250
0.035700,0.018400,0.176700,0.769200
0.035750,0.018250,0.176900,0.769100
0.035800,0.018700,0.175850,0.769650
0.035150,0.018150,0.175800,0.770900
0.034150,0.018150,0.176300,0.771400
0.034150,0.017200,0.176950,0.771700
0.034150,0.015300,0.178250,0.772300
0.033400,0.015300,0.179000,0.772300
0.032950,0.015450,0.179350,0.772250
0.032950,0.014900,0.180050,0.772100
0.033850,0.014550,0.179950,0.771650
0.033700,0.015050,0.180350,0.770900
0.032900,0.016100,0.180450,0.770550
0.033550,0.016700,0.180450,0.769300
0.032600,0.017700,0.180300,0.769400
0.033650,0.017550,0.180650,0.768150
0.034150,0.017200,0.180500,0.768150
0.033800,0.018550,0.179650,0.768000
0.034150,0.017750,0.180250,0.767850
0.034900,0.016750,0.181050,0.767300
0.035950,0.016150,0.181500,0.766400
0.035650,0.016350,0.181950,0.766050
0.035600,0.016900,0.182150,0.765350
0.035250,0.017350,0.181950,0.765450
0.035950,0.016850,0.181600,0.765600
0.036150,0.017050,0.181950,0.764850
0.035150,0.017650,0.181650,0.765550
0.035800,0.017250,0.181350,0.765600
0.034400,0.017800,0.181700,0.766100
0.034600,0.018100,0.181750,0.765550
0.034050,0.018700,0.180950,0.766300
0.034250,0.019000,0.180450,0.766300
0.034700,0.019700,0.180250,0.765350
0.035300,0.019050,0.180400,0.765250
0.035950,0.019800,0.179550,0.764700
0.036550,0.018900,0.179450,0.765100
0.037100,0.018800,0.179000,0.765100
0.037000,0.018700,0.178500,0.765800
0.036600,0.017900,0.179000,0.766500
