I,E,S,R
0.001000,0.001000,0.998000,0.000000
0.001000,0.001850,0.996950,0.000200
0.001200,0.002300,0.996150,0.000350
0.001550,0.002550,0.995300,0.000600
0.001950,0.002900,0.994350,0.000800
0.002700,0.003700,0.992550,0.001050
0.003300,0.005350,0.989900,0.001450
0.003800,0.007150,0.987050,0.002000
0.005300,0.008850,0.983400,0.002450
0.007200,0.011500,0.978250,0.003050
0.009850,0.014800,0.971650,0.003700
0.012400,0.020550,0.962250,0.004800
0.016400,0.025250,0.951650,0.006700
0.021650,0.033150,0.936700,0.008500
0.028850,0.041050,0.919000,0.011100
0.037200,0.053750,0.894850,0.014200
0.048300,0.068200,0.864400,0.019100
0.060400,0.085650,0.827950,0.026000
0.076350,0.104750,0.784350,0.034550
0.097400,0.127150,0.732150,0.043300
0.119350,0.152200,0.672150,0.056300
0.145300,0.176900,0.605850,0.071950
0.175500,0.199850,0.532400,0.092250
0.207400,0.217650,0.458500,0.116450
0.239500,0.232600,0.383700,0.144200
0.270950,0.236100,0.317050,0.175900
0.298000,0.234600,0.253350,0.214050
0.323050,0.225300,0.196750,0.254900
0.345450,0.204700,0.152250,0.297600
0.356750,0.178350,0.118750,0.346150
0.358300,0.157700,0.090850,0.393150
0.354650,0.133350,0.071200,0.440800
0.349200,0.110700,0.055850,0.484250
0.336500,0.091800,0.043500,0.528200
0.317300,0.075700,0.035900,0.571100
0.297450,0.061400,0.030050,0.611100
0.275450,0.049000,0.026400,0.649150
0.254650,0.038400,0.023350,0.683600
0.231150,0.030850,0.021950,0.716050
0.207850,0.025650,0.020500,0.746000
0.186950,0.021300,0.020500,0.771250
0.167350,0.017500,0.020400,0.794750
0.151050,0.013600,0.021350,0.814000
0.134050,0.012650,0.022050,0.831250
0.120350,0.011800,0.021650,0.846200
0.107300,0.010400,0.022950,0.859350
0.096150,0.008650,0.024200,0.871000
0.084000,0.008200,0.025050,0.882750
0.074800,0.007500,0.026200,0.891500
0.066050,0.005900,0.029000,0.899050
0.059300,0.005350,0.030950,0.904400
0.052400,0.004850,0.033050,0.909700
0.046700,0.004850,0.034800,0.913650
0.040600,0.004850,0.036600,0.917950
0.037300,0.003950,0.038350,0.920400
0.032850,0.003850,0.040600,0.922700
0.028900,0.003600,0.043550,0.923950
0.025400,0.004250,0.044750,0.925600
0.023450,0.003800,0.047000,0.925750
0.021450,0.003800,0.049400,0.925350
0.019500,0.003400,0.051900,0.925200
0.017100,0.003550,0.054150,0.925200
0.015550,0.003350,0.057250,0.923850
0.013600,0.003050,0.059850,0.923500
0.012400,0.002550,0.062000,0.923050
0.011700,0.002450,0.064200,0.921650
0.010900,0.002450,0.067250,0.919400
0.010700,0.002050,0.069750,0.917500
0.009450,0.002350,0.071650,0.916550
0.008900,0.002450,0.074200,0.914450
0.008250,0.001800,0.077900,0.912050
0.007050,0.001500,0.080350,0.911100
0.006600,0.001100,0.083400,0.908900
0.005650,0.000950,0.086150,0.907250
0.005100,0.001000,0.088550,0.905350
0.004950,0.000900,0.091400,0.902750
0.004500,0.000750,0.093800,0.900950
0.004050,0.000950,0.095850,0.899150
0.003900,0.000850,0.098950,0.896300
0.003700,0.001000,0.101600,0.893700
0.003750,0.000950,0.104550,0.890750
0.003250,0.000950,0.107900,0.887900
0.003400,0.000800,0.110450,0.885350
0.003000,0.001050,0.113350,0.882600
0.002550,0.001150,0.116550,0.879750
0.002500,0.000900,0.119250,0.877350
0.002200,0.000950,0.121500,0.875350
0.002200,0.000850,0.124250,0.872700
0.002150,0.000750,0.126900,0.870200
0.002050,0.000750,0.128800,0.868400
0.001750,0.000900,0.131200,0.866150
0.001650,0.000800,0.133700,0.863850
0.001600,0.000850,0.136050,0.861500
0.001650,0.000800,0.138200,0.859350
0.001650,0.000900,0.140000,0.857450
0.001650,0.000650,0.141900,0.855800
0.001600,0.000600,0.144500,0.853300
0.001400,0.000550,0.147150,0.850900
0.001400,0.000450,0.149600,0.848550
0.001350,0.000350,0.151700,0.846600
0.001250,0.000500,0.154050,0.844200
0.001350,0.000300,0.156350,0.842000
0.001200,0.000400,0.158600,0.839800
0.001150,0.000450,0.161300,0.837100
0.001450,0.000150,0.163800,0.834600
0.001400,0.000300,0.165900,0.832400
0.001300,0.000250,0.167550,0.830900
0.001300,0.000200,0.170050,0.828450
0.001150,0.000400,0.172050,0.826400
0.001150,0.000500,0.174200,0.824150
0.001350,0.000450,0.176750,0.821450
0.001350,0.000550,0.179500,0.818600
0.001200,0.000600,0.181600,0.816600
0.001350,0.000450,0.184450,0.813750
0.001400,0.000350,0.187250,0.811000
0.001300,0.000300,0.189500,0.808900
0.001350,0.000400,0.191950,0.806300
0.001100,0.000550,0.194050,0.804300
0.001100,0.000550,0.196500,0.801850
0.001000,0.000550,0.198550,0.799900
0.001000,0.000600,0.201150,0.797250
0.001100,0.000450,0.203600,0.794850
0.001200,0.000350,0.205550,0.792900
0.001050,0.000500,0.208150,0.790300
0.001250,0.000450,0.210450,0.787850
0.001300,0.000500,0.212600,0.785600
0.001350,0.000450,0.214650,0.783550
0.001400,0.000400,0.216750,0.781450
0.001450,0.000400,0.219650,0.778500
0.001350,0.000550,0.221900,0.776200
0.001350,0.000550,0.223650,0.774450
0.001150,0.000900,0.225000,0.772950
0.001200,0.000950,0.227850,0.770000
0.001050,0.000900,0.229600,0.768450
0.000950,0.000800,0.231650,0.766600
0.001000,0.000800,0.233750,0.764450
0.001050,0.001000,0.235200,0.762750
0.001350,0.000900,0.236600,0.761150
0.001350,0.001000,0.239000,0.758650
0.001600,0.000850,0.241650,0.755900
0.001550,0.000750,0.243750,0.753950
0.001450,0.000750,0.245850,0.751950
0.001500,0.000800,0.247500,0.750200
0.001450,0.001050,0.249250,0.748250
0.001700,0.000950,0.250550,0.746800
0.001450,0.001150,0.251950,0.745450
0.001650,0.001200,0.254550,0.742600
0.001700,0.001300,0.256200,0.740800
0.001850,0.001550,0.257400,0.739200
0.001800,0.001800,0.258850,0.737550
0.002350,0.001450,0.260850,0.735350
0.002400,0.001800,0.262100,0.733700
0.002500,0.001650,0.264300,0.731550
0.002600,0.001900,0.265300,0.730200
0.002800,0.001950,0.266550,0.728700
0.002850,0.002350,0.268000,0.726800
0.003050,0.002150,0.269250,0.725550
0.003300,0.002150,0.271050,0.723500
0.003350,0.002250,0.272650,0.721750
0.003800,0.002300,0.274350,0.719550
0.003850,0.002400,0.275850,0.717900
0.004050,0.002800,0.276650,0.716500
0.004250,0.002800,0.278550,0.714400
0.004500,0.003100,0.279600,0.712800
0.004700,0.003500,0.280450,0.711350
0.004600,0.003850,0.281650,0.709900
0.005550,0.003350,0.283000,0.708100
0.005700,0.003250,0.284100,0.706950
0.005700,0.003550,0.284900,0.705850
0.006100,0.003700,0.285400,0.704800
0.006700,0.003750,0.286050,0.703500
0.006800,0.004450,0.286200,0.702550
0.007050,0.004850,0.286350,0.701750
0.007150,0.005100,0.286900,0.700850
0.007950,0.005750,0.286700,0.699600
0.008500,0.006450,0.287200,0.697850
0.009250,0.007200,0.287050,0.696500
0.010200,0.007200,0.286750,0.695850
0.010750,0.007950,0.286300,0.695000
0.011600,0.008250,0.286100,0.694050
0.012450,0.007950,0.285300,0.694300
0.013750,0.008550,0.284350,0.693350
0.014850,0.008850,0.283300,0.693000
0.015800,0.009700,0.281400,0.693100
0.016700,0.010150,0.280600,0.692550
0.016600,0.011350,0.279150,0.692900
0.018250,0.011250,0.277650,0.692850
0.019400,0.011850,0.275750,0.693000
0.019950,0.012850,0.272700,0.694500
0.021900,0.012700,0.270650,0.694750
0.022000,0.014650,0.268250,0.695100
0.023150,0.015800,0.265650,0.695400
0.024900,0.016400,0.262300,0.696400
0.025950,0.015900,0.260450,0.697700
0.026900,0.017000,0.257550,0.698550
0.028400,0.017000,0.254900,0.699700
0.029150,0.018850,0.250600,0.701400
0.030150,0.018800,0.247950,0.703100
0.031850,0.019000,0.243850,0.705300
0.033400,0.019150,0.240650,0.706800
0.033750,0.020200,0.236300,0.709750
0.033050,0.021950,0.232400,0.712600
0.034950,0.021750,0.228100,0.715200
0.036050,0.022300,0.223750,0.717900
0.036900,0.022900,0.219550,0.720650
0.037500,0.023900,0.215500,0.723100
0.039850,0.023150,0.211250,0.725750
0.040450,0.022100,0.207550,0.729900
0.041700,0.022550,0.203400,0.732350
0.042450,0.022200,0.200450,0.734900
0.044150,0.022850,0.195750,0.737250
0.044600,0.023050,0.191600,0.740750
0.045050,0.023800,0.187250,0.743900
0.045400,0.022700,0.184700,0.747200
0.045000,0.021850,0.182250,0.750900
0.045000,0.022050,0.178100,0.754850
0.044450,0.021900,0.175500,0.758150
0.044450,0.022150,0.171750,0.761650
0.044050,0.021800,0.169350,0.764800
0.044850,0.021800,0.166600,0.766750
0.044700,0.022450,0.163550,0.769300
0.043800,0.022450,0.160600,0.773150
0.044000,0.021300,0.158950,0.775750
0.042700,0.020550,0.157400,0.779350
0.042250,0.019050,0.156200,0.782500
0.040850,0.019400,0.154650,0.785100
0.040250,0.018750,0.153800,0.787200
0.039550,0.017500,0.153600,0.789350
0.039950,0.015550,0.153450,0.791050
0.039200,0.015650,0.152350,0.792800
0.038450,0.015200,0.151050,0.795300
0.038400,0.015400,0.149550,0.796650
0.036950,0.014900,0.150250,0.797900
0.036650,0.014200,0.149200,0.799950
0.035050,0.014750,0.148800,0.801400
0.033700,0.014850,0.148950,0.802500
0.032350,0.013700,0.149500,0.804450
0.031200,0.013400,0.149850,0.805550
0.030700,0.013850,0.150150,0.805300
0.030600,0.012100,0.151650,0.805650
0.029600,0.012500,0.151500,0.806400
0.028700,0.012050,0.151150,0.808100
0.027650,0.011800,0.152000,0.808550
0.026300,0.012150,0.152200,0.809350
0.025300,0.012050,0.152900,0.809750
0.025100,0.011050,0.153900,0.809950
0.023750,0.011300,0.155600,0.809350
0.023850,0.010550,0.157350,0.808250
0.023950,0.009850,0.159000,0.807200
0.023750,0.010350,0.159800,0.806100
0.023900,0.010150,0.160650,0.805300
0.023650,0.010000,0.161400,0.804950
0.023700,0.010600,0.162150,0.803550
0.023450,0.010050,0.163150,0.803350
0.022800,0.010800,0.164450,0.801950
0.023300,0.009750,0.166500,0.800450
0.022400,0.009550,0.167350,0.800700
0.021950,0.009600,0.168550,0.799900
0.021200,0.009900,0.170000,0.798900
0.021050,0.010100,0.170500,0.798350
0.021400,0.009850,0.171900,0.796850
0.021900,0.009600,0.173150,0.795350
0.021050,0.010350,0.174650,0.793950
0.020650,0.010950,0.175400,0.793000
0.020800,0.010400,0.177350,0.791450
0.020700,0.010650,0.179100,0.789550
0.020800,0.009850,0.181250,0.788100
0.020950,0.009750,0.181500,0.787800
0.020900,0.010300,0.182750,0.786050
0.021850,0.010550,0.183700,0.783900
0.021050,0.010650,0.184800,0.783500
0.021500,0.011300,0.185600,0.781600
0.021950,0.011100,0.185700,0.781250
0.021850,0.010650,0.187450,0.780050
0.022050,0.010200,0.189100,0.778650
0.022000,0.010400,0.189250,0.778350
0.022450,0.009950,0.190500,0.777100
0.021850,0.010600,0.192200,0.775350
0.021650,0.011450,0.193350,0.773550
0.021150,0.011800,0.193650,0.773400
0.022650,0.011200,0.194150,0.772000
0.021900,0.011450,0.194800,0.771850
0.021900,0.011200,0.196950,0.769950
0.023100,0.010400,0.197900,0.768600
0.022900,0.011400,0.198950,0.766750
0.023150,0.011700,0.199450,0.765700
0.022850,0.012200,0.200100,0.764850
0.023350,0.012900,0.199900,0.763850
0.023800,0.012850,0.200950,0.762400
0.024700,0.012500,0.202200,0.760600
0.025150,0.012450,0.202300,0.760100
0.024850,0.013250,0.202650,0.759250
0.025650,0.013850,0.201800,0.758700
0.026800,0.014050,0.200850,0.758300
0.026350,0.015050,0.200200,0.758400
0.026650,0.014900,0.200050,0.758400
0.027400,0.013750,0.200500,0.758350
0.027900,0.014950,0.200200,0.756950
0.028800,0.014800,0.200500,0.755900
0.029900,0.014600,0.200450,0.755050
0.031000,0.014250,0.199900,0.754850
0.030250,0.014650,0.200000,0.755100
0.031150,0.014900,0.199050,0.754900
0.031700,0.015100,0.198950,0.754250
0.031800,0.016100,0.198150,0.753950
0.031450,0.017000,0.197400,0.754150
0.031750,0.015900,0.197350,0.755000
0.030800,0.016650,0.196950,0.755600
0.030650,0.016700,0.196650,0.756000
0.031300,0.016050,0.196400,0.756250
0.031600,0.016750,0.196250,0.755400
0.032750,0.016550,0.196600,0.754100
0.032150,0.016400,0.196900,0.754550
0.033000,0.015450,0.197100,0.754450
0.032150,0.015750,0.196000,0.756100
0.031050,0.016000,0.197100,0.755850
0.031950,0.015950,0.197300,0.754800
0.032050,0.015550,0.197850,0.754550
0.032750,0.015850,0.198150,0.753250
0.032850,0.016250,0.198250,0.752650
0.033250,0.016750,0.197700,0.752300
0.033300,0.017650,0.196050,0.753000
0.034150,0.018100,0.195300,0.752450
0.035350,0.017000,0.195300,0.752350
0.036000,0.018000,0.193900,0.752100
0.036000,0.018550,0.193100,0.752350
0.036500,0.019400,0.191750,0.752350
0.036900,0.019250,0.190950,0.752900
0.035950,0.019550,0.190350,0.754150
0.036400,0.019250,0.188750,0.755600
0.035700,0.019850,0.187250,0.757200
0.036350,0.019200,0.187600,0.756850
0.035700,0.018900,0.186650,0.758750
0.036350,0.018500,0.187150,0.758000
0.036200,0.017850,0.187300,0.758650
0.036450,0.019100,0.185250,0.759200
0.036650,0.019300,0.183950,0.760100
0.036650,0.019100,0.182950,0.761300
0.037350,0.017950,0.181950,0.762750
0.036900,0.018150,0.181400,0.763550
0.037500,0.017800,0.181900,0.762800
0.036900,0.017750,0.181650,0.763700
0.036550,0.018350,0.180300,0.764800
0.035350,0.018450,0.179900,0.766300
0.035750,0.017600,0.180600,0.766050
0.036150,0.017350,0.180650,0.765850
0.035600,0.018550,0.179400,0.766450
0.035600,0.018050,0.179550,0.766800
0.035600,0.018100,0.179400,0.766900
0.035700,0.016850,0.178550,0.768900
0.035900,0.016900,0.178050,0.769150
0.035050,0.016500,0.178950,0.769500
0.035450,0.016150,0.179750,0.768650
0.036850,0.017400,0.178450,0.767300
0.036450,0.018050,0.176900,0.768600
0.036500,0.017050,0.177600,0.768850
0.037600,0.016400,0.177200,0.768800
0.036650,0.017050,0.178150,0.768150
0.036600,0.016850,0.177850,0.768700
0.035500,0.017750,0.177950,0.768800
0.035050,0.017400,0.177800,0.769750
0.034800,0.016750,0.178800,0.769650
0.035100,0.016700,0.179050,0.769150
0.034650,0.016100,0.179400,0.769850
0.034450,0.015850,0.179250,0.770450
0.034350,0.016150,0.178350,0.771150
0.035000,0.015750,0.179150,0.770100
0.035700,0.016000,0.179000,0.769300
0.035150,0.016400,0.178550,0.769900
0.034100,0.017200,0.178550,0.770150
0.035500,0.016900,0.179000,0.768600
0.034750,0.016900,0.178750,0.769600
0.033900,0.016850,0.178000,0.771250
0.033000,0.017050,0.178950,0.771000
0.032700,0.017150,0.179250,0.770900
0.032750,0.015850,0.180850,0.770550
0.033150,0.015350,0.181400,0.770100
0.033650,0.015900,0.181700,0.768750
0.034450,0.015500,0.181500,0.768550
0.033400,0.016350,0.181550,0.768700
0.033500,0.017250,0.181250,0.768000
0.032500,0.016750,0.181650,0.769100
0.032750,0.015600,0.181850,0.769800
0.032400,0.016000,0.181200,0.770400
0.032700,0.017350,0.180700,0.769250
0.032500,0.016850,0.181700,0.768950
0.032500,0.017400,0.181850,0.768250
0.033100,0.017350,0.181350,0.768200
0.033300,0.017450,0.181800,0.767450
0.033650,0.017400,0.181650,0.767300
0.033550,0.016700,0.183300,0.766450
0.033950,0.017200,0.183000,0.765850
0.033350,0.017250,0.183200,0.766200
0.034300,0.017500,0.182250,0.765950
0.033450,0.017400,0.183700,0.765450
0.034100,0.017750,0.182200,0.765950
0.035000,0.017250,0.181650,0.766100
0.035900,0.016600,0.181800,0.765700
0.034700,0.016850,0.181800,0.766650
0.035600,0.016700,0.182300,0.765400
0.036300,0.015650,0.182800,0.765250
0.036100,0.016450,0.181800,0.765650
0.035900,0.016800,0.181400,0.765900
0.034750,0.017750,0.180850,0.766650
0.036050,0.017000,0.180400,0.766550
0.035550,0.017700,0.179400,0.767350
0.035400,0.016750,0.180800,0.767050
0.036050,0.015250,0.181450,0.767250
0.036150,0.016650,0.180550,0.766650
0.034900,0.017950,0.179550,0.767600
0.035800,0.016400,0.180250,0.767550
0.035050,0.017150,0.179700,0.768100
0.035000,0.016800,0.179850,0.768350
0.034300,0.016050,0.180900,0.768750
0.033750,0.016650,0.180700,0.768900
0.033900,0.016750,0.181850,0.767500
0.033500,0.016300,0.182050,0.768150
0.033500,0.017050,0.181700,0.767750
0.033350,0.017000,0.181350,0.768300
0.033350,0.017450,0.181500,0.767700
0.033950,0.016950,0.181400,0.767700
0.033650,0.016450,0.182100,0.767800
0.034000,0.016250,0.181500,0.768250
0.034100,0.015750,0.181600,0.768550
0.033550,0.014950,0.183250,0.768250
0.033750,0.015200,0.183850,0.767200
0.033350,0.015700,0.184100,0.766850
0.033550,0.015700,0.183100,0.767650
0.033550,0.016450,0.183000,0.767000
0.033850,0.016050,0.183350,0.766750
0.032950,0.016500,0.183400,0.767150
0.032950,0.016000,0.184350,0.766700
0.032950,0.015600,0.184200,0.767250
0.033600,0.016050,0.183500,0.766850
0.033700,0.016750,0.183650,0.765900
0.034300,0.016850,0.183450,0.765400
0.035250,0.017450,0.182450,0.764850
0.036100,0.016700,0.181900,0.765300
0.036800,0.016100,0.181750,0.765350
0.035750,0.016700,0.181900,0.765650
0.035650,0.016500,0.181700,0.766150
0.035000,0.017250,0.181800,0.765950
0.035250,0.016500,0.182150,0.766100
0.034800,0.016850,0.180950,0.767400
0.033000,0.017100,0.181050,0.768850
0.033350,0.016200,0.181300,0.769150
0.033100,0.016300,0.180700,0.769900
0.033450,0.016250,0.180300,0.770000
0.033200,0.016950,0.179800,0.770050
0.033200,0.017300,0.180300,0.769200
0.033650,0.016750,0.180500,0.769100
0.034300,0.016500,0.180550,0.768650
0.034200,0.016650,0.181050,0.768100
0.035000,0.017650,0.179400,0.767950
0.035050,0.017750,0.178800,0.768400
0.034750,0.018000,0.178450,0.768800
0.035300,0.016350,0.179350,0.769000
0.034400,0.017300,0.178250,0.770050
0.033450,0.017050,0.177750,0.771750
0.033000,0.017800,0.176950,0.772250
0.033500,0.017200,0.177100,0.772200
0.033600,0.016600,0.177050,0.772750
0.034500,0.016700,0.177150,0.771650
0.033700,0.016300,0.177150,0.772850
0.034750,0.016100,0.177450,0.771700
0.034050,0.016650,0.176850,0.772450
0.034300,0.016950,0.176350,0.772400
0.034750,0.016500,0.176600,0.772150
0.035300,0.015800,0.177150,0.771750
0.035650,0.016950,0.175150,0.772250
0.035800,0.018500,0.174600,0.771100
0.036200,0.018150,0.174800,0.770850
0.035700,0.018450,0.173950,0.771900
0.035500,0.018950,0.174050,0.771500
0.034500,0.019800,0.172600,0.773100
0.035650,0.018700,0.172000,0.773650
0.035950,0.018300,0.171400,0.774350
0.037500,0.018250,0.170500,0.773750
0.037850,0.018350,0.169700,0.774100
0.037600,0.017750,0.170300,0.774350
0.037350,0.017200,0.170400,0.775050
0.036600,0.017100,0.170400,0.775900
0.035450,0.016650,0.170450,0.777450
0.034700,0.017050,0.170300,0.777950
0.035250,0.015600,0.171550,0.777600
0.034800,0.016450,0.170200,0.778550
0.035600,0.016850,0.170400,0.777150
0.034050,0.017200,0.170400,0.778350
0.034000,0.016350,0.171200,0.778450
0.033800,0.015950,0.171750,0.778500
0.033100,0.016550,0.170850,0.779500
0.033500,0.016750,0.170900,0.778850
0.033350,0.015250,0.171500,0.779900
0.034150,0.014150,0.172250,0.779450
0.033850,0.013800,0.172800,0.779550
0.032750,0.013900,0.173800,0.779550
0.031650,0.013000,0.174900,0.780450
0.031400,0.013700,0.174550,0.780350
0.031450,0.013150,0.175800,0.779600
0.029350,0.014400,0.176500,0.779750
0.028850,0.014350,0.178100,0.778700
0.029400,0.013900,0.179250,0.777450
0.029300,0.013350,0.180150,0.777200
0.029400,0.013550,0.181800,0.775250
0.028500,0.013700,0.182300,0.775500
0.027500,0.013800,0.184550,0.774150
0.028500,0.013650,0.185950,0.771900
0.028500,0.013200,0.187300,0.771000
0.028350,0.013500,0.188600,0.769550
0.028750,0.014150,0.188600,0.768500
0.028900,0.013200,0.189250,0.768650
0.029450,0.012550,0.189950,0.768050
0.029250,0.012850,0.191250,0.766650
0.028400,0.014500,0.190950,0.766150
0.028850,0.014100,0.191700,0.765350
0.029050,0.014650,0.192350,0.763950
0.029200,0.015750,0.192050,0.763000
0.028000,0.015500,0.192550,0.763950
0.029150,0.015600,0.191750,0.763500
0.030750,0.015350,0.191050,0.762850
0.031200,0.016250,0.191100,0.761450
0.032000,0.015750,0.190150,0.762100
0.031050,0.016550,0.190450,0.761950
0.031550,0.016150,0.191000,0.761300
0.031900,0.016600,0.190450,0.761050
0.031650,0.016600,0.191100,0.760650
0.032500,0.016300,0.191650,0.759550
0.033050,0.016150,0.191400,0.759400
0.032650,0.015450,0.192250,0.759650
0.031900,0.017050,0.191250,0.759800
0.031550,0.017550,0.191600,0.759300
0.031550,0.017750,0.191200,0.759500
0.033450,0.017200,0.190250,0.759100
0.034550,0.017550,0.189800,0.758100
0.034650,0.017900,0.189100,0.758350
0.034350,0.017350,0.189900,0.758400
0.034900,0.017400,0.188900,0.758800
0.036150,0.017350,0.188250,0.758250
0.034950,0.018650,0.187300,0.759100
0.034500,0.017650,0.189250,0.758600
0.034700,0.017150,0.189400,0.758750
0.035700,0.017850,0.188500,0.757950
0.035350,0.017800,0.189000,0.757850
0.035250,0.018050,0.187800,0.758900
0.035900,0.017550,0.187650,0.758900
0.037000,0.017150,0.187750,0.758100
0.036300,0.017800,0.187950,0.757950
0.036050,0.019250,0.186650,0.758050
0.036750,0.019100,0.185900,0.758250
0.036000,0.019250,0.185400,0.759350
0.037300,0.018550,0.185250,0.758900
0.036550,0.019250,0.184700,0.759500
0.037450,0.019350,0.183500,0.759700
0.038950,0.019050,0.182700,0.759300
0.039750,0.018150,0.182800,0.759300
0.040050,0.018050,0.181550,0.760350
0.039800,0.018750,0.179700,0.761750
0.039700,0.018600,0.179650,0.762050
0.040200,0.017650,0.179900,0.762250
0.040650,0.017200,0.179700,0.762450
0.039700,0.017150,0.179300,0.763850
0.038800,0.017150,0.178800,0.765250
0.038700,0.018050,0.178650,0.764600
0.037600,0.018500,0.178800,0.765100
0.037400,0.018200,0.177900,0.766500
0.037000,0.018400,0.178800,0.765800
0.037100,0.016900,0.179250,0.766750
0.036200,0.017650,0.179050,0.767100
0.036950,0.017550,0.178600,0.766900
0.036150,0.018300,0.178850,0.766700
0.036600,0.018250,0.178750,0.766400
0.037150,0.017300,0.179450,0.766100
0.036400,0.017350,0.180600,0.765650
0.036800,0.016900,0.181100,0.765200
0.036650,0.016200,0.181200,0.765950
0.035600,0.017600,0.180150,0.766650
0.035900,0.017150,0.181150,0.765800
0.035850,0.017300,0.181350,0.765500
0.034850,0.018250,0.181050,0.765850
0.033850,0.018400,0.180850,0.766900
0.033800,0.019350,0.179900,0.766950
0.035600,0.018750,0.180100,0.765550
0.036500,0.018250,0.179850,0.765400
0.036650,0.018250,0.179300,0.765800
0.036550,0.018000,0.178850,0.766600
0.037700,0.017750,0.178700,0.765850
0.038200,0.017200,0.178900,0.765700
0.037950,0.017100,0.179000,0.765950
0.036250,0.017350,0.178700,0.767700
0.035650,0.017150,0.178850,0.768350
0.035100,0.016950,0.179650,0.768300
0.036150,0.017000,0.178850,0.768000
0.035950,0.018400,0.177900,0.767750
0.036150,0.017550,0.178100,0.768200
0.036250,0.017100,0.179350,0.767300
0.036800,0.016850,0.180600,0.765750
0.037000,0.016650,0.181200,0.765150
0.037000,0.017450,0.180650,0.764900
0.036450,0.017950,0.179350,0.766250
0.036150,0.019050,0.178600,0.766200
0.036550,0.017650,0.179600,0.766200
0.036700,0.016250,0.181250,0.765800
0.036550,0.017100,0.179450,0.766900
0.037150,0.017050,0.178200,0.767600
0.037200,0.017600,0.177850,0.767350
0.037950,0.016850,0.177650,0.767550
0.037850,0.017950,0.177500,0.766700
0.037850,0.018250,0.177600,0.766300
0.037200,0.018100,0.177400,0.767300
0.035450,0.018400,0.176850,0.769300
0.035650,0.018950,0.176400,0.769000
0.035950,0.018050,0.176300,0.769700
0.035100,0.018850,0.175900,0.770150
0.035100,0.017800,0.177250,0.769850
0.035350,0.017850,0.177750,0.769050
0.035850,0.017150,0.178150,0.768850
0.036100,0.018350,0.178600,0.766950
0.036650,0.016800,0.179100,0.767450
0.035700,0.017800,0.179650,0.766850
0.035800,0.018500,0.179750,0.765950
0.035050,0.019050,0.179450,0.766450
0.036300,0.018550,0.178850,0.766300
0.035750,0.017900,0.179650,0.766700
0.036850,0.017550,0.179800,0.765800
0.035750,0.017650,0.180250,0.766350
0.035600,0.018800,0.179800,0.765800
0.035400,0.019400,0.179150,0.766050
0.036100,0.019350,0.179000,0.765550
0.035400,0.018250,0.179950,0.766400
0.036650,0.017500,0.179550,0.766300
0.036150,0.018700,0.177950,0.767200
0.036150,0.018050,0.178250,0.767550
0.036850,0.016900,0.178900,0.767350
0.036050,0.017550,0.178600,0.767800
0.035200,0.018250,0.177500,0.769050
0.035050,0.019000,0.176950,0.769000
0.035900,0.018550,0.177300,0.768250
0.036900,0.018400,0.176550,0.768150
0.036850,0.018050,0.176300,0.768800
0.036350,0.017450,0.177050,0.769150
0.037200,0.018200,0.175250,0.769350
0.037400,0.018950,0.173600,0.770050
0.037500,0.018450,0.174050,0.770000
0.038200,0.018100,0.172800,0.770900
0.037800,0.018000,0.172450,0.771750
0.037850,0.018600,0.172050,0.771500
0.038700,0.017100,0.171850,0.772350
0.039050,0.017250,0.171800,0.771900
0.037850,0.017700,0.171700,0.772750
0.037700,0.017300,0.171250,0.773750
0.037100,0.018050,0.170600,0.774250
0.037400,0.017800,0.170900,0.773900
0.037300,0.017500,0.170850,0.774350
0.037250,0.017850,0.170250,0.774650
0.036600,0.017900,0.170300,0.775200
0.036350,0.016750,0.171500,0.775400
0.036600,0.017250,0.170900,0.775250
0.036100,0.016750,0.170950,0.776200
0.037150,0.016600,0.170450,0.775800
0.036150,0.016550,0.171450,0.775850
0.036000,0.016650,0.171950,0.775400
0.035900,0.017400,0.171800,0.774900
0.035200,0.018350,0.171450,0.775000
0.035250,0.017750,0.172500,0.774500
0.035600,0.017650,0.172050,0.774700
0.035100,0.016550,0.172950,0.775400
0.033950,0.017150,0.173550,0.775350
0.034150,0.015700,0.175400,0.774750
0.033800,0.015900,0.175350,0.774950
0.033300,0.014750,0.175650,0.776300
0.031100,0.015500,0.176700,0.776700
0.031500,0.016300,0.176300,0.775900
0.032000,0.015550,0.176950,0.775500
0.032550,0.015600,0.177900,0.773950
0.031950,0.015200,0.178650,0.774200
0.031050,0.014300,0.180400,0.774250
0.031850,0.013300,0.181950,0.772900
0.031300,0.013950,0.182200,0.772550
0.029700,0.014450,0.182950,0.772900
0.030700,0.013700,0.184150,0.771450
0.031050,0.014400,0.184100,0.770450
0.029600,0.015050,0.183800,0.771550
0.030250,0.014400,0.185800,0.769550
0.030900,0.014400,0.186200,0.768500
0.030550,0.014900,0.186200,0.768350
0.029800,0.016000,0.185850,0.768350
0.030150,0.016350,0.185400,0.768100
0.030350,0.015950,0.186150,0.767550
0.031050,0.015200,0.186300,0.767450
0.030450,0.016150,0.186600,0.766800
0.028650,0.017400,0.187000,0.766950
0.030000,0.015700,0.187400,0.766900
0.029400,0.015350,0.188550,0.766700
0.029250,0.015700,0.188350,0.766700
0.028950,0.017500,0.187300,0.766250
0.030450,0.016600,0.188050,0.764900
0.030250,0.016550,0.187850,0.765350
0.030000,0.016100,0.188450,0.765450
0.029950,0.015650,0.189700,0.764700
0.029800,0.015400,0.190750,0.764050
0.029750,0.015350,0.191300,0.763600
0.030050,0.015450,0.191200,0.763300
0.030300,0.015300,0.191600,0.762800
0.030250,0.015300,0.193200,0.761250
0.030350,0.015550,0.194300,0.759800
0.029950,0.015700,0.193900,0.760450
0.030150,0.016300,0.193950,0.759600
0.030250,0.016950,0.193500,0.759300
0.031900,0.016250,0.193150,0.758700
0.032700,0.016350,0.192250,0.758700
0.033600,0.015500,0.193300,0.757600
0.033750,0.014950,0.193000,0.758300
0.032300,0.015250,0.193000,0.759450
0.032250,0.015000,0.192800,0.759950
0.032250,0.016150,0.191500,0.760100
0.032950,0.016700,0.191050,0.759300
0.033000,0.017050,0.191150,0.758800
0.033800,0.016950,0.190750,0.758500
0.034550,0.017200,0.189850,0.758400
0.034100,0.017250,0.191050,0.757600
0.034500,0.017400,0.190150,0.757950
0.034450,0.016700,0.190800,0.758050
0.033300,0.017600,0.189950,0.759150
0.034400,0.016650,0.189700,0.759250
0.034900,0.016550,0.189250,0.759300
0.034750,0.017350,0.188900,0.759000
0.034500,0.017400,0.188400,0.759700
0.035150,0.017550,0.188200,0.759100
0.035500,0.017900,0.187550,0.759050
0.034950,0.018800,0.186900,0.759350
