I,E,S,R
0.001000,0.000600,0.998400,0.000000
0.001200,0.001400,0.997300,0.000100
0.001600,0.001900,0.996300,0.000200
0.001550,0.003050,0.994800,0.000600
0.002150,0.003900,0.993200,0.000750
0.002800,0.004250,0.991750,0.001200
0.003500,0.006950,0.988150,0.001400
0.005400,0.007950,0.985000,0.001650
0.006850,0.010850,0.980350,0.001950
0.008850,0.012550,0.975650,0.002950
0.011150,0.016100,0.968650,0.004100
0.014150,0.022000,0.959000,0.004850
0.018700,0.027200,0.947200,0.006900
0.022900,0.036900,0.931000,0.009200
0.029850,0.046950,0.910600,0.012600
0.039350,0.058550,0.885850,0.016250
0.050450,0.070950,0.856700,0.021900
0.064150,0.087900,0.819550,0.028400
0.078650,0.107350,0.776450,0.037550
0.098750,0.129350,0.723200,0.048700
0.124750,0.152100,0.661150,0.062000
0.150350,0.180350,0.590200,0.079100
0.181650,0.201050,0.518000,0.099300
0.213600,0.220450,0.442500,0.123450
0.248600,0.231100,0.368650,0.151650
0.279750,0.237150,0.299900,0.183200
0.311150,0.231050,0.239350,0.218450
0.339950,0.215900,0.187250,0.256900
0.357800,0.195400,0.145100,0.301700
0.367500,0.174700,0.109750,0.348050
0.368500,0.151450,0.082050,0.398000
0.360400,0.127000,0.065050,0.447550
0.349800,0.105650,0.050650,0.493900
0.330300,0.088350,0.039400,0.541950
0.308900,0.073750,0.032100,0.585250
0.287400,0.059900,0.027750,0.624950
0.266250,0.048600,0.024050,0.661100
0.242400,0.039000,0.022400,0.696200
0.222000,0.030550,0.021800,0.725650
0.201700,0.025200,0.020800,0.752300
0.180100,0.021350,0.019850,0.778700
0.161050,0.017600,0.019800,0.801550
0.146150,0.016150,0.019600,0.818100
0.131450,0.013200,0.020250,0.835100
0.117800,0.010550,0.021450,0.850200
0.104550,0.009300,0.022550,0.863600
0.092800,0.007600,0.024450,0.875150
0.082950,0.006550,0.027050,0.883450
0.074800,0.005750,0.028800,0.890650
0.065800,0.005100,0.031500,0.897600
0.058600,0.004700,0.033550,0.903150
0.052500,0.004600,0.034750,0.908150
0.046300,0.004350,0.036650,0.912700
0.041550,0.003850,0.039000,0.915600
0.037100,0.003650,0.040950,0.918300
0.032700,0.003400,0.043500,0.920400
0.028650,0.003500,0.046350,0.921500
0.025450,0.003550,0.048850,0.922150
0.023250,0.003800,0.051600,0.921350
0.021650,0.003450,0.054150,0.920750
0.019750,0.002950,0.056600,0.920700
0.018300,0.002850,0.059200,0.919650
0.017150,0.002850,0.060500,0.919500
0.015200,0.002900,0.062700,0.919200
0.013500,0.002700,0.065300,0.918500
0.012450,0.002400,0.068050,0.917100
0.011050,0.002600,0.070850,0.915500
0.010450,0.002650,0.072700,0.914200
0.010150,0.002100,0.075700,0.912050
0.009300,0.002150,0.079000,0.909550
0.008750,0.002150,0.082050,0.907050
0.008100,0.002000,0.084650,0.905250
0.007850,0.001900,0.086750,0.903500
0.007700,0.001550,0.089350,0.901400
0.007150,0.001750,0.092200,0.898900
0.006500,0.001800,0.095250,0.896450
0.006100,0.001900,0.097750,0.894250
0.006100,0.001500,0.100500,0.891900
0.005750,0.001500,0.102850,0.889900
0.005250,0.001750,0.104900,0.888100
0.004650,0.001550,0.107400,0.886400
0.004450,0.001250,0.110100,0.884200
0.004100,0.001250,0.112950,0.881700
0.003650,0.001450,0.115400,0.879500
0.003800,0.001250,0.117900,0.877050
0.003450,0.001400,0.120100,0.875050
0.003250,0.001250,0.122850,0.872650
0.003150,0.001200,0.125450,0.870200
0.003050,0.001200,0.128100,0.867650
0.003000,0.001200,0.130950,0.864850
0.002900,0.001100,0.133400,0.862600
0.002900,0.001050,0.135000,0.861050
0.002900,0.000950,0.137750,0.858400
0.003050,0.000800,0.140050,0.856100
0.002750,0.000950,0.143200,0.853100
0.002500,0.000650,0.146050,0.850800
0.002400,0.000750,0.149050,0.847800
0.002350,0.000750,0.151050,0.845850
0.002600,0.000700,0.154000,0.842700
0.002400,0.000650,0.156650,0.840300
0.002150,0.000850,0.158800,0.838200
0.002050,0.000950,0.161250,0.835750
0.002100,0.000800,0.163850,0.833250
0.002100,0.000850,0.166300,0.830750
0.002000,0.000800,0.168750,0.828450
0.001950,0.000650,0.171050,0.826350
0.002000,0.000950,0.173550,0.823500
0.002050,0.001150,0.175750,0.821050
0.002000,0.000950,0.178550,0.818500
0.002100,0.000800,0.181400,0.815700
0.001950,0.000850,0.183750,0.813450
0.001950,0.000800,0.185700,0.811550
0.001900,0.000800,0.187900,0.809400
0.001750,0.000850,0.190300,0.807100
0.001800,0.000850,0.193100,0.804250
0.001750,0.001200,0.195150,0.801900
0.001700,0.001250,0.197750,0.799300
0.001650,0.001350,0.199700,0.797300
0.001900,0.001150,0.201550,0.795400
0.002000,0.000800,0.203300,0.793900
0.001850,0.001000,0.205150,0.792000
0.001800,0.000900,0.207450,0.789850
0.001700,0.000850,0.209750,0.787700
0.001850,0.000950,0.211750,0.785450
0.001650,0.001000,0.213750,0.783600
0.001800,0.001000,0.215550,0.781650
0.001900,0.001100,0.217150,0.779850
0.001750,0.000900,0.219450,0.777900
0.001900,0.000700,0.221550,0.775850
0.001650,0.000800,0.223700,0.773850
0.001550,0.000800,0.225800,0.771850
0.001650,0.000900,0.228100,0.769350
0.001450,0.001100,0.230000,0.767450
0.001900,0.000700,0.231750,0.765650
0.001600,0.001050,0.233250,0.764100
0.001600,0.001100,0.235450,0.761850
0.001700,0.001300,0.237500,0.759500
0.001650,0.001200,0.239650,0.757500
0.001700,0.001550,0.241400,0.755350
0.001900,0.001550,0.243300,0.753250
0.002150,0.001500,0.245300,0.751050
0.002400,0.001400,0.246550,0.749650
0.002350,0.001600,0.248050,0.748000
0.002800,0.001450,0.249900,0.745850
0.002850,0.001650,0.251200,0.744300
0.002650,0.002000,0.252550,0.742800
0.002900,0.002050,0.254050,0.741000
0.003150,0.002050,0.256450,0.738350
0.003250,0.002300,0.256950,0.737500
0.003650,0.002500,0.258000,0.735850
0.003400,0.002750,0.259650,0.734200
0.003600,0.002700,0.261250,0.732450
0.004200,0.002400,0.262900,0.730500
0.004300,0.002200,0.264200,0.729300
0.004900,0.002150,0.265000,0.727950
0.005150,0.002150,0.266250,0.726450
0.005200,0.002750,0.267300,0.724750
0.005200,0.003050,0.268550,0.723200
0.005250,0.003600,0.269000,0.722150
0.005650,0.003500,0.269950,0.720900
0.005700,0.003300,0.271050,0.719950
0.006250,0.003100,0.272200,0.718450
0.006300,0.003550,0.273650,0.716500
0.006550,0.004300,0.273650,0.715500
0.007250,0.004800,0.274150,0.713800
0.007550,0.004550,0.275150,0.712750
0.008000,0.005150,0.275400,0.711450
0.008000,0.005950,0.275700,0.710350
0.008350,0.006300,0.276000,0.709350
0.008550,0.006400,0.276600,0.708450
0.009550,0.005900,0.277950,0.706600
0.009750,0.005750,0.278650,0.705850
0.010000,0.006350,0.278900,0.704750
0.011250,0.005800,0.279150,0.703800
0.011350,0.006850,0.279150,0.702650
0.011200,0.007300,0.279700,0.701800
0.011600,0.007450,0.279750,0.701200
0.012350,0.008050,0.279250,0.700350
0.012600,0.008600,0.278600,0.700200
0.013300,0.008750,0.278750,0.699200
0.013300,0.009400,0.277500,0.699800
0.014350,0.009050,0.278350,0.698250
0.014850,0.010200,0.276700,0.698250
0.015800,0.010400,0.275600,0.698200
0.015900,0.011450,0.274650,0.698000
0.016900,0.012700,0.272250,0.698150
0.018450,0.013500,0.270150,0.697900
0.020400,0.012900,0.269350,0.697350
0.022050,0.012850,0.267400,0.697700
0.023700,0.013000,0.265500,0.697800
0.024200,0.014200,0.262850,0.698750
0.024900,0.014900,0.260500,0.699700
0.026650,0.015450,0.258350,0.699550
0.027400,0.016500,0.254950,0.701150
0.027100,0.017150,0.252800,0.702950
0.029350,0.016450,0.249850,0.704350
0.029700,0.017700,0.246900,0.705700
0.030200,0.018850,0.243300,0.707650
0.031600,0.019500,0.239900,0.709000
0.033900,0.020250,0.236050,0.709800
0.034600,0.021000,0.232400,0.712000
0.036700,0.022050,0.227600,0.713650
0.038100,0.021350,0.224200,0.716350
0.039000,0.021600,0.220200,0.719200
0.039700,0.021600,0.215850,0.722850
0.040550,0.021850,0.212350,0.725250
0.041350,0.023150,0.208350,0.727150
0.041800,0.024550,0.204150,0.729500
0.044000,0.023750,0.200150,0.732100
0.044000,0.024350,0.196800,0.734850
0.044000,0.023350,0.193950,0.738700
0.045450,0.023950,0.189850,0.740750
0.044250,0.025850,0.185750,0.744150
0.046000,0.025400,0.181300,0.747300
0.048850,0.024050,0.177550,0.749550
0.049250,0.023150,0.174550,0.753050
0.049950,0.022900,0.171000,0.756150
0.048500,0.022100,0.167950,0.761450
0.047550,0.022400,0.164600,0.765450
0.046650,0.022550,0.162550,0.768250
0.045500,0.021900,0.159850,0.772750
0.045800,0.020750,0.158050,0.775400
0.046500,0.019950,0.156350,0.777200
0.046350,0.019600,0.153700,0.780350
0.045200,0.019500,0.151750,0.783550
0.044700,0.018850,0.150450,0.786000
0.044200,0.018450,0.148850,0.788500
0.043000,0.016850,0.148000,0.792150
0.041350,0.017050,0.146700,0.794900
0.040850,0.017200,0.145450,0.796500
0.039250,0.016450,0.145550,0.798750
0.038550,0.016700,0.144950,0.799800
0.037750,0.015700,0.144950,0.801600
0.037200,0.015100,0.144250,0.803450
0.036900,0.014600,0.144750,0.803750
0.035900,0.013400,0.145950,0.804750
0.034400,0.014150,0.145550,0.805900
0.034250,0.013300,0.145500,0.806950
0.033550,0.012650,0.146100,0.807700
0.032000,0.012700,0.147050,0.808250
0.032000,0.013000,0.146950,0.808050
0.031350,0.012850,0.146450,0.809350
0.030800,0.013550,0.146450,0.809200
0.029550,0.013400,0.146550,0.810500
0.028600,0.012250,0.147350,0.811800
0.028350,0.011700,0.149050,0.810900
0.028650,0.010800,0.151100,0.809450
0.028100,0.011250,0.152450,0.808200
0.027050,0.011400,0.153700,0.807850
0.026950,0.010650,0.154600,0.807800
0.026950,0.010150,0.156250,0.806650
0.025900,0.010300,0.157150,0.806650
0.024800,0.010450,0.158800,0.805950
0.024200,0.010450,0.160050,0.805300
0.025300,0.009450,0.161550,0.803700
0.024050,0.009850,0.163300,0.802800
0.024050,0.010450,0.163800,0.801700
0.023200,0.011000,0.163600,0.802200
0.023450,0.009750,0.165600,0.801200
0.022250,0.010900,0.166700,0.800150
0.021550,0.011250,0.168700,0.798500
0.021500,0.010550,0.169800,0.798150
0.021350,0.010450,0.170450,0.797750
0.021850,0.009300,0.172250,0.796600
0.021400,0.009150,0.173500,0.795950
0.021100,0.009550,0.175000,0.794350
0.020350,0.009850,0.177400,0.792400
0.020350,0.009900,0.179350,0.790400
0.020650,0.009100,0.181350,0.788900
0.020550,0.009200,0.182850,0.787400
0.020100,0.010000,0.184350,0.785550
0.021150,0.009150,0.186650,0.783050
0.020700,0.009100,0.189700,0.780500
0.020400,0.009800,0.190150,0.779650
0.020600,0.009900,0.192050,0.777450
0.020950,0.011400,0.192300,0.775350
0.021850,0.010950,0.194000,0.773200
0.022100,0.011200,0.194400,0.772300
0.022050,0.011450,0.194850,0.771650
0.022050,0.012500,0.195700,0.769750
0.022450,0.011600,0.197150,0.768800
0.021850,0.012100,0.198300,0.767750
0.022100,0.013000,0.199350,0.765550
0.022800,0.012500,0.200350,0.764350
0.022800,0.012600,0.201500,0.763100
0.023400,0.012350,0.203250,0.761000
0.023400,0.011300,0.205100,0.760200
0.023700,0.011150,0.205800,0.759350
0.024000,0.010450,0.207250,0.758300
0.023550,0.011750,0.207300,0.757400
0.023400,0.012800,0.208500,0.755300
0.023800,0.013250,0.208100,0.754850
0.023900,0.013200,0.208700,0.754200
0.024050,0.013500,0.208850,0.753600
0.024450,0.013250,0.209850,0.752450
0.025100,0.013750,0.210000,0.751150
0.025900,0.014150,0.209550,0.750400
0.026650,0.014200,0.208700,0.750450
0.026750,0.014350,0.208800,0.750100
0.027250,0.014900,0.209100,0.748750
0.027950,0.015350,0.209100,0.747600
0.029250,0.015150,0.209200,0.746400
0.028850,0.015350,0.208750,0.747050
0.029700,0.016000,0.207950,0.746350
0.029950,0.017300,0.206600,0.746150
0.030150,0.016650,0.206800,0.746400
0.030600,0.015900,0.206400,0.747100
0.030600,0.016550,0.204550,0.748300
0.031150,0.016200,0.204050,0.748600
0.031750,0.016550,0.203750,0.747950
0.032150,0.015900,0.202850,0.749100
0.032900,0.016550,0.201750,0.748800
0.032950,0.017300,0.200550,0.749200
0.033800,0.017750,0.200300,0.748150
0.034000,0.018300,0.199700,0.748000
0.033800,0.018200,0.199050,0.748950
0.034600,0.018000,0.198300,0.749100
0.035050,0.017500,0.198150,0.749300
0.035950,0.017050,0.198250,0.748750
0.035600,0.016300,0.198150,0.749950
0.035750,0.017200,0.196200,0.750850
0.035250,0.017450,0.195600,0.751700
0.035200,0.017350,0.195000,0.752450
0.035100,0.017350,0.194200,0.753350
0.034950,0.017800,0.194400,0.752850
0.035250,0.017450,0.194900,0.752400
0.036050,0.016500,0.194900,0.752550
0.036250,0.017300,0.193150,0.753300
0.035900,0.017350,0.192450,0.754300
0.035850,0.017550,0.192200,0.754400
0.036000,0.017500,0.191600,0.754900
0.036000,0.017800,0.191200,0.755000
0.036450,0.017550,0.189550,0.756450
0.036650,0.018050,0.189200,0.756100
0.037250,0.017650,0.187750,0.757350
0.038000,0.017400,0.187600,0.757000
0.037950,0.017700,0.187150,0.757200
0.037050,0.018150,0.186800,0.758000
0.036000,0.019500,0.186100,0.758400
0.036700,0.020000,0.184500,0.758800
0.036450,0.019350,0.184950,0.759250
0.037400,0.018250,0.185900,0.758450
0.038300,0.018700,0.184700,0.758300
0.039550,0.017400,0.183950,0.759100
0.038900,0.018100,0.181850,0.761150
0.039050,0.018000,0.180550,0.762400
0.038050,0.017350,0.180100,0.764500
0.038400,0.017200,0.180000,0.764400
0.038500,0.017850,0.179600,0.764050
0.038550,0.018850,0.178850,0.763750
0.037150,0.021250,0.176900,0.764700
0.037650,0.019900,0.176300,0.766150
0.037700,0.019700,0.175800,0.766800
0.038700,0.018800,0.175900,0.766600
0.038500,0.018750,0.176150,0.766600
0.039250,0.017800,0.176350,0.766600
0.039750,0.018800,0.174950,0.766500
0.038600,0.019150,0.175000,0.767250
0.037900,0.020250,0.174250,0.767600
0.037750,0.019550,0.175200,0.767500
0.037850,0.019900,0.173500,0.768750
0.037800,0.018950,0.173400,0.769850
0.037900,0.018100,0.173800,0.770200
0.037250,0.018800,0.172650,0.771300
0.038200,0.017100,0.173650,0.771050
0.037350,0.018200,0.172850,0.771600
0.036250,0.018350,0.172850,0.772550
0.037400,0.018100,0.171850,0.772650
0.038100,0.018750,0.170950,0.772200
0.037950,0.019450,0.170450,0.772150
0.039050,0.018950,0.170400,0.771600
0.038450,0.019450,0.169900,0.772200
0.039350,0.018300,0.170500,0.771850
0.039950,0.017800,0.171050,0.771200
0.039500,0.018200,0.169750,0.772550
0.039250,0.018300,0.169500,0.772950
0.040050,0.017750,0.169450,0.772750
0.039750,0.016500,0.170050,0.773700
0.038200,0.018050,0.169800,0.773950
0.037950,0.017500,0.170750,0.773800
0.038400,0.017550,0.171900,0.772150
0.038300,0.016350,0.171800,0.773550
0.037000,0.017400,0.170850,0.774750
0.036450,0.017800,0.170450,0.775300
0.036500,0.017850,0.170550,0.775100
0.036850,0.017450,0.171650,0.774050
0.037150,0.017350,0.170800,0.774700
0.037650,0.016500,0.172100,0.773750
0.035200,0.017650,0.171700,0.775450
0.035100,0.017100,0.172500,0.775300
0.034750,0.016950,0.172850,0.775450
0.035000,0.017400,0.173550,0.774050
0.035700,0.017350,0.172800,0.774150
0.035150,0.018550,0.171650,0.774650
0.035750,0.017350,0.171700,0.775200
0.036300,0.016400,0.172600,0.774700
0.035350,0.017050,0.173600,0.774000
0.035250,0.016800,0.173900,0.774050
0.035600,0.016550,0.174050,0.773800
0.036200,0.015900,0.174000,0.773900
0.035950,0.015100,0.174800,0.774150
0.034550,0.015550,0.175700,0.774200
0.034500,0.015050,0.177800,0.772650
0.033900,0.015050,0.179100,0.771950
0.032800,0.015400,0.179700,0.772100
0.033200,0.016000,0.179800,0.771000
0.032750,0.016000,0.179750,0.771500
0.032950,0.015500,0.179700,0.771850
0.032800,0.016150,0.179600,0.771450
0.032300,0.015800,0.180650,0.771250
0.032600,0.015550,0.180200,0.771650
0.032750,0.016450,0.179500,0.771300
0.033200,0.015100,0.180700,0.771000
0.033750,0.014300,0.181650,0.770300
0.033200,0.014100,0.182300,0.770400
0.033350,0.014750,0.181700,0.770200
0.032750,0.015100,0.181800,0.770350
0.032650,0.015100,0.181150,0.771100
0.033050,0.014350,0.182000,0.770600
0.032200,0.014700,0.182750,0.770350
0.032600,0.015300,0.182700,0.769400
0.033500,0.014900,0.182550,0.769050
0.032500,0.015000,0.182850,0.769650
0.031500,0.016100,0.182300,0.770100
0.032450,0.015800,0.182850,0.768900
0.032700,0.015250,0.183150,0.768900
0.032450,0.014700,0.183700,0.769150
0.032600,0.014700,0.183300,0.769400
0.032900,0.014800,0.183400,0.768900
0.032150,0.015700,0.182050,0.770100
0.032550,0.016350,0.181350,0.769750
0.032700,0.016250,0.181800,0.769250
0.032900,0.015600,0.182050,0.769450
0.032250,0.016700,0.181800,0.769250
0.032700,0.016050,0.183100,0.768150
0.033350,0.016300,0.181650,0.768700
0.033800,0.016000,0.181850,0.768350
0.033350,0.016500,0.181300,0.768850
0.032550,0.017650,0.181500,0.768300
0.033250,0.017250,0.182600,0.766900
0.032750,0.017100,0.182500,0.767650
0.032500,0.017150,0.183500,0.766850
0.032850,0.016900,0.183700,0.766550
0.032150,0.017350,0.184250,0.766250
0.032050,0.018450,0.182750,0.766750
0.032200,0.017300,0.183600,0.766900
0.032500,0.018350,0.182300,0.766850
0.034150,0.016950,0.182500,0.766400
0.033750,0.018450,0.181450,0.766350
0.035300,0.018450,0.179700,0.766550
0.036100,0.017500,0.179900,0.766500
0.036200,0.017950,0.178900,0.766950
0.036350,0.017350,0.179350,0.766950
0.035650,0.017650,0.178900,0.767800
0.036750,0.016950,0.179050,0.767250
0.036350,0.017700,0.178650,0.767300
0.036300,0.018050,0.178400,0.767250
0.036200,0.016600,0.178800,0.768400
0.034800,0.017150,0.177600,0.770450
0.035550,0.017000,0.177550,0.769900
0.034950,0.017950,0.176900,0.770200
0.034700,0.017300,0.178350,0.769650
0.035050,0.015950,0.179000,0.770000
0.034150,0.016250,0.179250,0.770350
0.034400,0.015400,0.180100,0.770100
0.033450,0.015350,0.179700,0.771500
0.033000,0.015150,0.181500,0.770350
0.034050,0.014850,0.181900,0.769200
0.034850,0.013950,0.182750,0.768450
0.033900,0.015650,0.182700,0.767750
0.034950,0.015650,0.183100,0.766300
0.033700,0.016500,0.182900,0.766900
0.032550,0.015850,0.183850,0.767750
0.032650,0.015600,0.184850,0.766900
0.032650,0.015850,0.184900,0.766600
0.032950,0.015750,0.184400,0.766900
0.033250,0.015800,0.184650,0.766300
0.032800,0.015100,0.185400,0.766700
0.032000,0.015550,0.184350,0.768100
0.031550,0.015950,0.184700,0.767800
0.032100,0.015450,0.185450,0.767000
0.032950,0.015850,0.185250,0.765950
0.034300,0.015150,0.185800,0.764750
0.034450,0.015950,0.185350,0.764250
0.033600,0.016950,0.184100,0.765350
0.033700,0.017000,0.184250,0.765050
0.034350,0.016000,0.184100,0.765550
0.033950,0.015850,0.186100,0.764100
0.034250,0.015950,0.186050,0.763750
0.034000,0.016550,0.186300,0.763150
0.033500,0.017400,0.185650,0.763450
0.034100,0.016500,0.185600,0.763800
0.033550,0.016750,0.186100,0.763600
0.033200,0.016900,0.186350,0.763550
0.033850,0.015500,0.186400,0.764250
0.033600,0.015300,0.187900,0.763200
0.034600,0.015150,0.187700,0.762550
0.034600,0.015550,0.186400,0.763450
0.034000,0.017000,0.185850,0.763150
0.034300,0.017100,0.185750,0.762850
0.034250,0.016200,0.187300,0.762250
0.033650,0.016850,0.186450,0.763050
0.034300,0.018000,0.185900,0.761800
0.035100,0.018200,0.185400,0.761300
0.035950,0.018150,0.184600,0.761300
0.035550,0.018700,0.183750,0.762000
0.036800,0.018050,0.182900,0.762250
0.036850,0.017650,0.182650,0.762850
0.037200,0.017700,0.183650,0.761450
0.038000,0.016600,0.183550,0.761850
0.036900,0.016600,0.182900,0.763600
0.037450,0.015600,0.182950,0.764000
0.037900,0.014800,0.184050,0.763250
0.036100,0.016250,0.182700,0.764950
0.035750,0.017000,0.182650,0.764600
0.035600,0.017650,0.181900,0.764850
0.036100,0.016150,0.182450,0.765300
0.035850,0.016200,0.182100,0.765850
0.035400,0.017100,0.182000,0.765500
0.037000,0.016100,0.182100,0.764800
0.037150,0.016300,0.181700,0.764850
0.036750,0.016900,0.182050,0.764300
0.036700,0.016900,0.181950,0.764450
0.036200,0.016350,0.182950,0.764500
0.035400,0.017050,0.181750,0.765800
0.035250,0.017450,0.181250,0.766050
0.035450,0.016900,0.182000,0.765650
0.034750,0.016300,0.182700,0.766250
0.034950,0.016650,0.182300,0.766100
0.035550,0.016400,0.182500,0.765550
0.036300,0.016800,0.181850,0.765050
0.035950,0.017550,0.181350,0.765150
0.035800,0.016850,0.181950,0.765400
0.035400,0.017200,0.181600,0.765800
0.035300,0.017750,0.181800,0.765150
0.035300,0.017800,0.181450,0.765450
0.035600,0.018500,0.181200,0.764700
0.036100,0.018050,0.180150,0.765700
0.035300,0.017850,0.180350,0.766500
0.034900,0.018300,0.179750,0.767050
0.035500,0.017650,0.179300,0.767550
0.035550,0.017550,0.178700,0.768200
0.036350,0.016450,0.179050,0.768150
0.036750,0.016650,0.177700,0.768900
0.036250,0.017350,0.176550,0.769850
0.036300,0.017000,0.177300,0.769400
0.035950,0.017500,0.176900,0.769650
0.036550,0.016800,0.176550,0.770100
0.036250,0.017550,0.176200,0.770000
0.036050,0.017600,0.176000,0.770350
0.036150,0.017300,0.175550,0.771000
0.036100,0.017250,0.175800,0.770850
0.035750,0.016900,0.176350,0.771000
0.034650,0.017200,0.177050,0.771100
0.035800,0.015750,0.178500,0.769950
0.036000,0.016550,0.178400,0.769050
0.035250,0.016800,0.178950,0.769000
0.035950,0.016350,0.178750,0.768950
0.035250,0.016100,0.179700,0.768950
0.035300,0.015950,0.180500,0.768250
0.034650,0.016800,0.180700,0.767850
0.035450,0.016850,0.180800,0.766900
0.035550,0.016600,0.180800,0.767050
0.035850,0.016800,0.180600,0.766750
0.036000,0.016000,0.180500,0.767500
0.035550,0.017000,0.180400,0.767050
0.035450,0.016500,0.180800,0.767250
0.035550,0.015800,0.181600,0.767050
0.035000,0.015500,0.182850,0.766650
0.034350,0.016550,0.181750,0.767350
0.034900,0.016150,0.182150,0.766800
0.035450,0.015800,0.182450,0.766300
0.035900,0.016000,0.182950,0.765150
0.034250,0.016100,0.183950,0.765700
0.033350,0.016250,0.184000,0.766400
0.032650,0.017100,0.183300,0.766950
0.032750,0.016100,0.184350,0.766800
0.033150,0.017950,0.183500,0.765400
0.034700,0.017750,0.183500,0.764050
0.034100,0.017900,0.183000,0.765000
0.035000,0.017550,0.182150,0.765300
0.034800,0.017800,0.181950,0.765450
0.034200,0.018050,0.182600,0.765150
0.034950,0.018200,0.182350,0.764500
0.035350,0.018450,0.183300,0.762900
0.036650,0.017650,0.183200,0.762500
0.037850,0.017600,0.182800,0.761750
0.037100,0.017900,0.182700,0.762300
0.037000,0.018750,0.181700,0.762550
0.039050,0.018700,0.180050,0.762200
0.039000,0.018950,0.179500,0.762550
0.039450,0.017200,0.180350,0.763000
0.038200,0.017800,0.180400,0.763600
0.038900,0.017250,0.181000,0.762850
0.039000,0.016750,0.181950,0.762300
0.038400,0.016600,0.181200,0.763800
0.037500,0.017150,0.180650,0.764700
0.037650,0.017450,0.180050,0.764850
0.037900,0.016300,0.180700,0.765100
0.036750,0.016250,0.180950,0.766050
0.036450,0.016550,0.181150,0.765850
0.034800,0.017800,0.180600,0.766800
0.034550,0.017800,0.181700,0.765950
0.034350,0.016200,0.183300,0.766150
0.035100,0.015750,0.183100,0.766050
0.034200,0.016950,0.182450,0.766400
0.034400,0.016900,0.182950,0.765750
0.034300,0.016700,0.183400,0.765600
0.035000,0.016850,0.182750,0.765400
0.035800,0.017400,0.181450,0.765350
0.035500,0.017300,0.181850,0.765350
0.035250,0.017250,0.182000,0.765500
0.035200,0.017500,0.181600,0.765700
0.034750,0.017900,0.182500,0.764850
0.034700,0.018100,0.183250,0.763950
0.035950,0.017650,0.183950,0.762450
0.036900,0.017050,0.183800,0.762250
0.037100,0.016800,0.183900,0.762200
0.035700,0.017350,0.184150,0.762800
0.035950,0.017900,0.182950,0.763200
0.035900,0.017200,0.184450,0.762450
0.036250,0.017050,0.184300,0.762400
0.036050,0.016150,0.184400,0.763400
0.036350,0.017650,0.183900,0.762100
0.036250,0.019150,0.182700,0.761900
0.036700,0.017650,0.182400,0.763250
0.036650,0.017900,0.181200,0.764250
0.037100,0.018050,0.181000,0.763850
0.038050,0.017650,0.181350,0.762950
0.036750,0.017850,0.181750,0.763650
0.036700,0.017300,0.182350,0.763650
0.037100,0.017100,0.182300,0.763500
0.037950,0.016400,0.182700,0.762950
0.037150,0.017000,0.183150,0.762700
0.038250,0.017050,0.183250,0.761450
0.038250,0.016500,0.181800,0.763450
0.037400,0.017400,0.181400,0.763800
0.036100,0.018050,0.181250,0.764600
0.035500,0.018350,0.180150,0.766000
0.036100,0.017150,0.180650,0.766100
0.035650,0.017800,0.180700,0.765850
0.034700,0.018850,0.179800,0.766650
0.034850,0.019100,0.179800,0.766250
0.035950,0.019150,0.179400,0.765500
0.036400,0.018150,0.180650,0.764800
0.036000,0.018350,0.180700,0.764950
0.036700,0.017300,0.181150,0.764850
0.037000,0.016550,0.181450,0.765000
0.036750,0.016550,0.181900,0.764800
0.035700,0.016850,0.182500,0.764950
0.036500,0.016750,0.182200,0.764550
0.036150,0.017850,0.181800,0.764200
0.034350,0.018600,0.182500,0.764550
0.035150,0.018150,0.183500,0.763200
0.034850,0.018850,0.182400,0.763900
0.035450,0.018900,0.183000,0.762650
0.036100,0.018750,0.182400,0.762750
0.037150,0.018900,0.181150,0.762800
0.037150,0.018450,0.181050,0.763350
0.037500,0.018300,0.182300,0.761900
0.036950,0.018150,0.182950,0.761950
0.037150,0.018200,0.182150,0.762500
0.037850,0.017350,0.182200,0.762600
0.037250,0.017000,0.182250,0.763500
0.036850,0.016950,0.182700,0.763500
0.035550,0.017600,0.181950,0.764900
0.034800,0.017200,0.182850,0.765150
0.035050,0.017700,0.181600,0.765650
0.033750,0.019000,0.180900,0.766350
0.034400,0.017050,0.181200,0.767350
0.035000,0.017350,0.181700,0.765950
0.034050,0.018300,0.180700,0.766950
0.034050,0.018850,0.180800,0.766300
0.034900,0.018500,0.179550,0.767050
0.034500,0.017550,0.181550,0.766400
0.034050,0.016700,0.183150,0.766100
0.034000,0.016950,0.183400,0.765650
0.034300,0.017300,0.183900,0.764500
0.034750,0.017150,0.184750,0.763350
0.034200,0.017300,0.184850,0.763650
0.033450,0.017900,0.185800,0.762850
0.034950,0.016200,0.186200,0.762650
0.035750,0.016550,0.186000,0.761700
0.035050,0.016950,0.184900,0.763100
0.034400,0.017050,0.185200,0.763350
0.034600,0.016500,0.186350,0.762550
0.033500,0.017850,0.185450,0.763200
0.034350,0.017200,0.185200,0.763250
0.033650,0.017150,0.185700,0.763500
0.035300,0.016900,0.184200,0.763600
0.035350,0.018150,0.182800,0.763700
0.035700,0.017950,0.182300,0.764050
0.036000,0.017050,0.183050,0.763900
0.036650,0.017400,0.183300,0.762650
0.036600,0.017750,0.183050,0.762600
0.034850,0.018150,0.183300,0.763700
0.036800,0.017000,0.183050,0.763150
0.036900,0.017400,0.182800,0.762900
0.037350,0.017600,0.182050,0.763000
0.038100,0.017000,0.181450,0.763450
0.037850,0.017550,0.181050,0.763550
0.038250,0.017100,0.181550,0.763100
0.037700,0.017650,0.181500,0.763150
0.037850,0.016400,0.182650,0.763100
0.038100,0.016650,0.182850,0.762400
0.036450,0.017450,0.182750,0.763350
0.036100,0.017500,0.182800,0.763600
0.036350,0.017600,0.182350,0.763700
0.037250,0.017100,0.183000,0.762650
0.037150,0.017950,0.182300,0.762600
0.036450,0.017050,0.183000,0.763500
0.036150,0.016750,0.183000,0.764100
0.035650,0.016850,0.182850,0.764650
0.034200,0.018000,0.182150,0.765650
0.034800,0.017350,0.182800,0.765050
0.035300,0.018350,0.181200,0.765150
0.034600,0.018700,0.180850,0.765850
0.035300,0.018300,0.181200,0.765200
0.036150,0.017200,0.181150,0.765500
0.036000,0.016900,0.182250,0.764850
0.036250,0.016900,0.183000,0.763850
0.036350,0.017200,0.182500,0.763950
0.036550,0.017600,0.182350,0.763500
0.035900,0.018100,0.182250,0.763750
0.036800,0.017950,0.181200,0.764050
0.035700,0.018200,0.180700,0.765400
0.036600,0.017300,0.180950,0.765150
0.037300,0.016850,0.181450,0.764400
0.036050,0.016550,0.181700,0.765700
0.036400,0.017150,0.180350,0.766100
