I,E,S,R
0.001,0.00065,0.99835,0
0.0013,0.0016,0.99705,5E-05
0.0018,0.00215,0.9959,0.00015
0.00195,0.00295,0.99465,0.00045
0.0026,0.0042,0.99255,0.00065
0.00335,0.0052,0.9904,0.00105
0.00485,0.0067,0.9871,0.00135
0.0064,0.00915,0.98275,0.0017
0.00825,0.01285,0.97655,0.00235
0.0101,0.0163,0.97,0.0036
0.0135,0.02135,0.96035,0.0048
0.0174,0.02695,0.9493,0.00635
0.02145,0.0358,0.93375,0.009
0.02745,0.0449,0.91585,0.0118
0.03615,0.05505,0.89355,0.01525
0.04665,0.0677,0.8652,0.02045
0.0587,0.08445,0.8294,0.02745
0.0736,0.1023,0.78825,0.03585
0.09455,0.12215,0.73755,0.04575
0.1173,0.1462,0.67775,0.05875
0.1436,0.16945,0.61225,0.0747
0.1752,0.19115,0.5418,0.09185
0.208,0.2101,0.4677,0.1142
0.2357,0.2288,0.39175,0.14375
0.2721,0.2313,0.3224,0.1742
0.299,0.23405,0.25685,0.2101
0.32575,0.22155,0.20335,0.24935
0.3416,0.20705,0.15785,0.2935
0.358,0.1874,0.12085,0.33375
0.3604,0.1649,0.09215,0.38255
0.35695,0.13995,0.071,0.4321
0.34625,0.1175,0.05555,0.4807
0.33155,0.0981,0.04445,0.5259
0.3159,0.08195,0.03535,0.5668
0.2974,0.0668,0.0292,0.6066
0.2768,0.0533,0.0247,0.6452
0.25755,0.042,0.02185,0.6786
0.2348,0.03365,0.02085,0.7107
0.2107,0.02665,0.02,0.74265
0.19035,0.0213,0.0195,0.76885
0.171,0.0167,0.01975,0.79255
0.15245,0.01425,0.02015,0.81315
0.13635,0.0128,0.0211,0.82975
0.12195,0.0104,0.0218,0.84585
0.10805,0.0091,0.0226,0.86025
0.09545,0.00865,0.02455,0.87135
0.0847,0.0071,0.02645,0.88175
0.0744,0.00645,0.02815,0.891
0.06635,0.0057,0.0308,0.89715
0.05855,0.00535,0.03275,0.90335
0.05225,0.00515,0.03425,0.90835
0.04615,0.0045,0.03635,0.913
0.04115,0.0041,0.0393,0.91545
0.03665,0.00455,0.04075,0.91805
0.0326,0.0038,0.0427,0.9209
0.02925,0.0039,0.04495,0.9219
0.0261,0.0041,0.04685,0.92295
0.02325,0.0037,0.0492,0.92385
0.021,0.00365,0.05175,0.9236
0.01875,0.0032,0.05445,0.9236
0.01645,0.00305,0.0574,0.9231
0.01505,0.0029,0.0602,0.92185
0.014,0.0027,0.0623,0.921
0.01285,0.00275,0.06445,0.91995
0.0114,0.00225,0.0676,0.91875
0.01025,0.00195,0.0704,0.9174
0.00945,0.002,0.0734,0.91515
0.00875,0.0022,0.07555,0.9135
0.0079,0.00215,0.07805,0.9119
0.0074,0.0019,0.0819,0.9088
0.0073,0.0014,0.0846,0.9067
0.0063,0.0015,0.0874,0.9048
0.0057,0.0017,0.0905,0.9021
0.00525,0.0018,0.09315,0.8998
0.00475,0.00185,0.0963,0.8971
0.0046,0.0017,0.09975,0.89395
0.0043,0.0017,0.10275,0.89125
0.0041,0.00175,0.10575,0.8884
0.0045,0.00125,0.10905,0.8852
0.00415,0.0011,0.1115,0.88325
0.00415,0.00095,0.1142,0.8807
0.0037,0.00115,0.1163,0.87885
0.0036,0.0012,0.11885,0.87635
0.0038,0.00105,0.1216,0.87355
0.0032,0.0012,0.1239,0.8717
0.0031,0.00125,0.126,0.86965
0.00325,0.00115,0.1285,0.8671
0.00295,0.0013,0.13155,0.8642
0.003,0.0013,0.13345,0.86225
0.0031,0.0011,0.13585,0.85995
0.00275,0.00105,0.1387,0.8575
0.00215,0.0012,0.141,0.85565
0.00215,0.00155,0.14315,0.85315
0.0022,0.0012,0.1459,0.8507
0.0022,0.0011,0.1491,0.8476
0.00225,0.0012,0.1508,0.84575
0.00215,0.0011,0.153,0.84375
0.00205,0.00095,0.1552,0.8418
0.00215,0.0008,0.15695,0.8401
0.00195,0.00095,0.1595,0.8376
0.00185,0.00105,0.1615,0.8356
0.00195,0.0007,0.16365,0.8337
0.0019,0.0009,0.16555,0.83165
0.00195,0.0009,0.16725,0.8299
0.00195,0.0009,0.16915,0.828
0.00185,0.001,0.1715,0.82565
0.0019,0.001,0.1736,0.8235
0.002,0.0011,0.17575,0.82115
0.00185,0.0011,0.17815,0.8189
0.0018,0.0011,0.18005,0.81705
0.0018,0.00095,0.18205,0.8152
0.00205,0.00075,0.1842,0.813
0.00175,0.00095,0.1863,0.811
0.0016,0.00085,0.1887,0.80885
0.00145,0.00075,0.191,0.8068
0.0013,0.00075,0.19315,0.8048
0.00135,0.0008,0.1954,0.80245
0.00115,0.0008,0.19715,0.8009
0.0011,0.00065,0.1993,0.79895
0.00095,0.00075,0.2008,0.7975
0.00095,0.0009,0.2035,0.79465
0.001,0.00075,0.2059,0.79235
0.0011,0.00055,0.2085,0.78985
0.001,0.0006,0.21045,0.78795
0.00115,0.00055,0.2121,0.7862
0.001,0.0006,0.21365,0.78475
0.0011,0.00035,0.21605,0.7825
0.0012,0.00025,0.218,0.78055
0.0012,0.0004,0.2201,0.7783
0.00115,0.0006,0.22245,0.7758
0.0012,0.00055,0.2249,0.77335
0.00145,0.00055,0.2269,0.7711
0.00125,0.0009,0.22865,0.7692
0.0015,0.0007,0.231,0.7668
0.00115,0.00095,0.23275,0.76515
0.00115,0.00085,0.2342,0.7638
0.0012,0.0007,0.2364,0.7617
0.0013,0.00095,0.2379,0.75985
0.0015,0.0009,0.2403,0.7573
0.00145,0.00085,0.2419,0.7558
0.00145,0.0009,0.24395,0.7537
0.00145,0.001,0.2465,0.75105
0.00135,0.0012,0.24855,0.7489
0.00165,0.0011,0.25035,0.7469
0.0019,0.00105,0.2521,0.74495
0.0019,0.00115,0.2542,0.74275
0.0019,0.0011,0.2559,0.7411
0.0018,0.00105,0.2578,0.73935
0.00185,0.001,0.2596,0.73755
0.00175,0.00115,0.2614,0.7357
0.00195,0.00135,0.26315,0.73355
0.00215,0.0012,0.26505,0.7316
0.0021,0.00115,0.26705,0.7297
0.0023,0.00135,0.26815,0.7282
0.0025,0.0011,0.26995,0.72645
0.0024,0.0016,0.2711,0.7249
0.0026,0.00195,0.2725,0.72295
0.00275,0.00205,0.2741,0.7211
0.0031,0.00185,0.276,0.71905
0.0032,0.00205,0.2778,0.71695
0.0034,0.00205,0.2789,0.71565
0.0033,0.0023,0.28035,0.71405
0.00315,0.0022,0.2817,0.71295
0.0034,0.00245,0.2834,0.71075
0.0036,0.00255,0.28385,0.71
0.0036,0.0029,0.28505,0.70845
0.00365,0.00315,0.28605,0.70715
0.00435,0.003,0.28715,0.7055
0.0048,0.0031,0.28795,0.70415
0.0049,0.00265,0.2896,0.70285
0.0049,0.00325,0.29035,0.7015
0.00505,0.0037,0.291,0.70025
0.00515,0.0036,0.292,0.69925
0.00505,0.0037,0.2931,0.69815
0.00535,0.0039,0.2942,0.69655
0.00595,0.0037,0.29585,0.6945
0.00635,0.00375,0.297,0.6929
0.00645,0.00445,0.2969,0.6922
0.006,0.0054,0.29775,0.69085
0.0064,0.0053,0.2982,0.6901
0.0067,0.0056,0.29885,0.68885
0.0071,0.0055,0.2995,0.6879
0.0085,0.00595,0.29925,0.6863
0.0094,0.0057,0.2994,0.6855
0.0101,0.00605,0.29905,0.6848
0.01055,0.0061,0.2995,0.68385
0.0109,0.0073,0.29875,0.68305
0.0113,0.00755,0.29875,0.6824
0.01165,0.0085,0.2976,0.68225
0.0127,0.0079,0.2974,0.682
0.01365,0.00835,0.29635,0.68165
0.0135,0.009,0.2954,0.6821
0.0139,0.0098,0.2942,0.6821
0.01515,0.00995,0.29295,0.68195
0.01575,0.01075,0.29255,0.68095
0.01685,0.0117,0.29045,0.681
0.0187,0.0128,0.28835,0.68015
0.01955,0.01305,0.2865,0.6809
0.02055,0.01315,0.28515,0.68115
0.02135,0.01365,0.2828,0.6822
0.0223,0.01445,0.2804,0.68285
0.02375,0.01525,0.2783,0.6827
0.02475,0.01715,0.27405,0.68405
0.0263,0.0176,0.27045,0.68565
0.02725,0.01775,0.26765,0.68735
0.02745,0.01825,0.26585,0.68845
0.02845,0.01875,0.2632,0.6896
0.03235,0.0172,0.2602,0.69025
0.03245,0.01875,0.2554,0.6934
0.0332,0.0202,0.25185,0.69475
0.035,0.0198,0.2485,0.6967
0.03505,0.02165,0.243,0.7003
0.03635,0.02135,0.24015,0.70215
0.038,0.0217,0.2346,0.7057
0.039,0.02215,0.23015,0.7087
0.03995,0.02345,0.2257,0.7109
0.04175,0.02395,0.22075,0.71355
0.04115,0.02485,0.2166,0.7174
0.0428,0.02495,0.2116,0.72065
0.04315,0.02435,0.20875,0.72375
0.0434,0.02455,0.20525,0.7268
0.0442,0.02485,0.20065,0.7303
0.0448,0.0249,0.19595,0.73435
0.0453,0.02475,0.1922,0.73775
0.04545,0.02485,0.1887,0.741
0.04675,0.02445,0.1847,0.7441
0.0488,0.02355,0.18085,0.7468
0.0467,0.02525,0.1768,0.75125
0.04665,0.0237,0.1744,0.75525
0.0461,0.0237,0.17125,0.75895
0.04715,0.02335,0.1678,0.7617
0.04875,0.02215,0.16485,0.76425
0.04915,0.02125,0.16225,0.76735
0.047,0.0214,0.15985,0.77175
0.04695,0.02115,0.15855,0.77335
0.0467,0.0203,0.1567,0.7763
0.04595,0.0209,0.15415,0.779
0.04595,0.02045,0.15255,0.78105
0.0456,0.01975,0.1509,0.78375
0.0451,0.01945,0.14985,0.7856
0.0452,0.02,0.14695,0.78785
0.0445,0.0192,0.14555,0.79075
0.0432,0.019,0.14485,0.79295
0.0421,0.01865,0.14305,0.7962
0.0427,0.0175,0.14205,0.79775
0.0408,0.01785,0.141,0.80035
0.0382,0.01725,0.14085,0.8037
0.0377,0.0166,0.1404,0.8053
0.0374,0.01695,0.13915,0.8065
0.03685,0.01515,0.13985,0.80815
0.036,0.0144,0.1395,0.8101
0.03515,0.0141,0.13885,0.8119
0.03485,0.01355,0.13885,0.81275
0.03305,0.01465,0.1381,0.8142
0.0333,0.01475,0.13755,0.8144
0.0318,0.01445,0.13845,0.8153
0.0314,0.01305,0.1392,0.81635
0.03,0.0121,0.14105,0.81685
0.02935,0.01175,0.1422,0.8167
0.0281,0.0106,0.14385,0.81745
0.0271,0.0108,0.1456,0.8165
0.02595,0.0107,0.14725,0.8161
0.0259,0.01015,0.1486,0.81535
0.0244,0.01,0.1506,0.815
0.024,0.0097,0.1513,0.815
0.02345,0.0095,0.1529,0.81415
0.02195,0.0103,0.15475,0.813
0.02165,0.0102,0.15695,0.8112
0.02205,0.009,0.1589,0.81005
0.0215,0.0089,0.16005,0.80955
0.021,0.00925,0.16195,0.8078
0.0202,0.00965,0.16395,0.8062
0.01985,0.00995,0.1651,0.8051
0.01965,0.01025,0.1663,0.8038
0.0197,0.0107,0.16735,0.80225
0.01945,0.01035,0.16945,0.80075
0.0196,0.00995,0.1715,0.79895
0.0202,0.00965,0.1736,0.79655
0.02015,0.0092,0.17575,0.7949
0.01985,0.00925,0.1777,0.7932
0.01955,0.0092,0.1802,0.79105
0.01945,0.00955,0.1821,0.7889
0.01985,0.0088,0.1842,0.78715
0.0198,0.0097,0.1851,0.7854
0.0206,0.0091,0.1862,0.7841
0.02055,0.00965,0.18675,0.78305
0.02035,0.01015,0.18745,0.78205
0.0205,0.0101,0.188,0.7814
0.0205,0.00975,0.19,0.77975
0.02055,0.0103,0.19105,0.7781
0.02025,0.01055,0.1921,0.7771
0.0207,0.01,0.194,0.7753
0.01975,0.01025,0.1942,0.7758
0.02025,0.01045,0.19485,0.77445
0.02115,0.00935,0.1973,0.7722
0.02135,0.00915,0.1993,0.7702
0.0209,0.0098,0.19925,0.77005
0.02075,0.011,0.2,0.76825
0.02065,0.0115,0.2011,0.76675
0.0211,0.0112,0.20235,0.76535
0.021,0.0107,0.2037,0.7646
0.02055,0.01105,0.20565,0.76275
0.0196,0.01245,0.20525,0.7627
0.021,0.01205,0.20625,0.7607
0.0205,0.01175,0.207,0.76075
0.01995,0.0123,0.2073,0.76045
0.0202,0.01175,0.20835,0.7597
0.02075,0.01125,0.2097,0.7583
0.02175,0.0108,0.21095,0.7565
0.0219,0.01115,0.2115,0.75545
0.0223,0.01065,0.2118,0.75525
0.0228,0.01175,0.21235,0.7531
0.0233,0.0117,0.21315,0.75185
0.023,0.0129,0.2135,0.7506
0.0234,0.0127,0.21405,0.74985
0.0242,0.0133,0.21435,0.74815
0.0244,0.01325,0.2146,0.74775
0.0254,0.01355,0.2145,0.74655
0.02535,0.01395,0.21455,0.74615
0.02575,0.01425,0.21475,0.74525
0.027,0.0134,0.21495,0.74465
0.02725,0.0138,0.21525,0.7437
0.02725,0.01475,0.2151,0.7429
0.0283,0.0155,0.2138,0.7424
0.02845,0.0152,0.2141,0.74225
0.02835,0.0157,0.2129,0.74305
0.02915,0.0158,0.2125,0.74255
0.0294,0.01585,0.2122,0.74255
0.02945,0.01645,0.21165,0.74245
0.0295,0.0171,0.2103,0.7431
0.0303,0.01755,0.2092,0.74295
0.03175,0.0171,0.20915,0.742
0.03345,0.01655,0.2094,0.7406
0.03285,0.01755,0.20865,0.74095
0.03375,0.017,0.20795,0.7413
0.0344,0.017,0.2061,0.7425
0.034,0.0181,0.2038,0.7441
0.03345,0.0185,0.2034,0.74465
0.0338,0.0185,0.20315,0.74455
0.0337,0.01865,0.20205,0.7456
0.03465,0.01835,0.2013,0.7457
0.03445,0.01875,0.19985,0.74695
0.0346,0.01765,0.19955,0.7482
0.03375,0.01825,0.19935,0.74865
0.0338,0.0193,0.19725,0.74965
0.03455,0.01855,0.19785,0.74905
0.03535,0.01895,0.1971,0.7486
0.0358,0.0187,0.1969,0.7486
0.03725,0.01945,0.1959,0.7474
0.0376,0.0187,0.19515,0.74855
0.0372,0.0184,0.1943,0.7501
0.03735,0.01855,0.1943,0.7498
0.0377,0.0178,0.1933,0.7512
0.03715,0.0179,0.1945,0.75045
0.03695,0.018,0.1941,0.75095
0.03745,0.018,0.1928,0.75175
0.0384,0.0185,0.19005,0.75305
0.03855,0.01855,0.19,0.7529
0.03785,0.01885,0.19,0.7533
0.0366,0.0194,0.18925,0.75475
0.0373,0.01955,0.1883,0.75485
0.0388,0.0197,0.1861,0.7554
0.03905,0.01935,0.18485,0.75675
0.0387,0.02025,0.1831,0.75795
0.0394,0.01965,0.18245,0.7585
0.03975,0.01855,0.18305,0.75865
0.03945,0.01925,0.18195,0.75935
0.04075,0.01885,0.18195,0.75845
0.03985,0.0192,0.18055,0.7604
0.03985,0.0199,0.17975,0.7605
0.03985,0.0206,0.17835,0.7612
0.04145,0.0191,0.17765,0.7618
0.0397,0.0192,0.1779,0.7632
0.03925,0.0184,0.17755,0.7648
0.03935,0.01865,0.178,0.764
0.0396,0.0177,0.1794,0.7633
0.03845,0.0175,0.17965,0.7644
0.03785,0.01725,0.17905,0.76585
0.03745,0.01775,0.1788,0.766
0.03675,0.0178,0.17895,0.7665
0.03735,0.01705,0.1797,0.7659
0.0377,0.0173,0.178,0.767
0.0387,0.0169,0.1777,0.7667
0.0379,0.0186,0.1763,0.7672
0.0377,0.0189,0.1755,0.7679
0.03695,0.01815,0.1766,0.7683
0.03645,0.01865,0.17675,0.76815
0.0364,0.0188,0.17605,0.76875
0.0371,0.0186,0.17625,0.76805
0.03685,0.0189,0.1754,0.76885
0.0367,0.01895,0.1748,0.76955
0.03755,0.01815,0.1748,0.7695
0.0371,0.0183,0.1751,0.7695
0.03705,0.01905,0.1747,0.7692
0.0373,0.0192,0.1741,0.7694
0.03725,0.0191,0.1736,0.77005
0.03835,0.01775,0.1743,0.7696
0.03925,0.01755,0.17335,0.76985
0.03875,0.01695,0.1745,0.7698
0.03855,0.01675,0.1746,0.7701
0.0378,0.0178,0.17455,0.76985
0.0379,0.01805,0.1737,0.77035
0.03835,0.0171,0.17405,0.7705
0.03725,0.01765,0.17335,0.77175
0.0375,0.0183,0.17265,0.77155
0.036,0.01845,0.1725,0.77305
0.0367,0.017,0.17305,0.77325
0.0364,0.0179,0.17255,0.77315
0.0364,0.0163,0.1743,0.773
0.03565,0.01755,0.17395,0.77285
0.0362,0.01785,0.17355,0.7724
0.0359,0.01675,0.1752,0.77215
0.0356,0.01575,0.176,0.77265
0.0345,0.01605,0.1762,0.77325
0.0337,0.01615,0.1773,0.77285
0.0342,0.0163,0.1777,0.7718
0.0332,0.01595,0.17815,0.7727
0.03405,0.01575,0.17775,0.77245
0.0325,0.01605,0.17825,0.7732
0.0315,0.01515,0.1784,0.77495
0.03015,0.01535,0.1791,0.7754
0.0306,0.0156,0.1804,0.7734
0.03055,0.01605,0.18065,0.77275
0.0308,0.01595,0.1815,0.77175
0.0318,0.0153,0.1822,0.7707
0.03135,0.015,0.1826,0.77105
0.0306,0.01475,0.18295,0.7717
0.03145,0.01505,0.1833,0.7702
0.03085,0.01575,0.1838,0.7696
0.03035,0.0148,0.1845,0.77035
0.03135,0.0144,0.18605,0.7682
0.0314,0.0142,0.18675,0.76765
0.0311,0.0142,0.18775,0.76695
0.03055,0.01525,0.18895,0.76525
0.03045,0.0159,0.1892,0.76445
0.03105,0.0147,0.1897,0.76455
0.02965,0.01515,0.1897,0.7655
0.02955,0.0151,0.18995,0.7654
0.02965,0.015,0.19055,0.7648
0.0306,0.01365,0.19095,0.7648
0.03015,0.0146,0.1904,0.76485
0.03075,0.01405,0.1906,0.7646
0.0311,0.01445,0.1903,0.76415
0.0304,0.01585,0.1909,0.76285
0.0307,0.01545,0.191,0.76285
0.03135,0.0151,0.19125,0.7623
0.0317,0.01475,0.1916,0.76195
0.03175,0.01555,0.1919,0.7608
0.0332,0.01445,0.19265,0.7597
0.03175,0.01515,0.19335,0.75975
0.03105,0.0151,0.1938,0.76005
0.0308,0.0158,0.1935,0.7599
0.03195,0.0153,0.1943,0.75845
0.03205,0.015,0.1953,0.75765
0.033,0.01475,0.19535,0.7569
0.0319,0.0155,0.19525,0.75735
0.03105,0.0153,0.1948,0.75885
0.03165,0.0145,0.195,0.75885
0.03155,0.0156,0.1952,0.75765
0.03215,0.0159,0.19495,0.757
0.0313,0.0164,0.19425,0.75805
0.032,0.0159,0.19545,0.75665
0.03235,0.0163,0.19475,0.7566
0.03255,0.0163,0.1943,0.75685
0.03305,0.0161,0.19485,0.756
0.03305,0.01625,0.1944,0.7563
0.0334,0.01655,0.19465,0.7554
0.03295,0.0172,0.19465,0.7552
0.0335,0.01665,0.19485,0.755
0.03215,0.01795,0.19425,0.75565
0.0325,0.0165,0.19545,0.75555
0.03275,0.01685,0.1954,0.755
0.0324,0.0177,0.19455,0.75535
0.0331,0.01695,0.19435,0.7556
0.0335,0.01685,0.1935,0.75615
0.0336,0.0174,0.1929,0.7561
0.0331,0.0179,0.19205,0.75695
0.0331,0.0183,0.19175,0.75685
0.0345,0.0182,0.19085,0.75645
0.0346,0.01835,0.19005,0.757
0.0346,0.018,0.18975,0.75765
0.03475,0.0174,0.18945,0.7584
0.03495,0.01715,0.1909,0.757
0.0339,0.01795,0.19105,0.7571
0.03335,0.01785,0.19105,0.75775
0.0338,0.01755,0.1907,0.75795
0.035,0.01655,0.1909,0.75755
0.03525,0.016,0.1908,0.75795
0.03395,0.0165,0.19095,0.7586
0.0334,0.01645,0.191,0.75915
0.0338,0.01585,0.19135,0.759
0.03435,0.01625,0.1911,0.7583
0.0341,0.01675,0.1893,0.75985
0.03365,0.0168,0.18855,0.761
0.0328,0.017,0.18795,0.76225
0.03305,0.0163,0.18825,0.7624
0.0332,0.0176,0.18725,0.76195
0.03275,0.01785,0.18705,0.76235
0.0331,0.01755,0.1878,0.76155
0.0332,0.01635,0.1883,0.76215
0.0332,0.0157,0.18845,0.76265
0.033,0.0159,0.18875,0.76235
0.03315,0.01475,0.18935,0.76275
0.0335,0.0147,0.1884,0.7634
0.03305,0.0155,0.18725,0.7642
0.03275,0.0164,0.18665,0.7642
0.03385,0.01535,0.18625,0.76455
0.03345,0.01595,0.1858,0.7648
0.03255,0.01615,0.1857,0.7656
0.03285,0.01665,0.1852,0.7653
0.0336,0.01655,0.1849,0.76495
0.03295,0.01605,0.18635,0.76465
0.03185,0.0169,0.18635,0.7649
0.03275,0.01665,0.18675,0.76385
0.03245,0.0168,0.18685,0.7639
0.0323,0.01635,0.18735,0.764
0.03365,0.01515,0.18745,0.76375
0.0333,0.0155,0.18865,0.76255
0.03375,0.01575,0.18725,0.76325
0.03415,0.01555,0.1871,0.7632
0.03295,0.01695,0.1859,0.7642
0.03385,0.0168,0.18525,0.7641
0.03405,0.0162,0.18535,0.7644
0.03435,0.01635,0.18495,0.76435
0.03475,0.0166,0.18455,0.7641
0.03535,0.01595,0.18565,0.76305
0.0342,0.0172,0.1853,0.7633
0.03395,0.0169,0.1849,0.76425
0.033,0.01735,0.18485,0.7648
0.03265,0.0169,0.18455,0.7659
0.03285,0.0169,0.1842,0.76605
0.03325,0.01625,0.1839,0.7666
0.0329,0.01575,0.18515,0.7662
0.03325,0.01495,0.1846,0.7672
0.03235,0.01485,0.18575,0.76705
0.0322,0.01585,0.1847,0.76725
0.03155,0.016,0.18455,0.7679
0.03175,0.0166,0.1841,0.76755
0.0326,0.0174,0.1848,0.7652
0.0334,0.0183,0.1848,0.7635
0.03545,0.0175,0.1848,0.76225
0.0359,0.01665,0.18525,0.7622
0.03435,0.01755,0.1845,0.7636
0.0343,0.0168,0.1843,0.7646
0.0336,0.01745,0.1834,0.76555
0.0349,0.01685,0.183,0.76525
0.0352,0.01715,0.1822,0.76545
0.03485,0.01665,0.18325,0.76525
0.0346,0.0178,0.18245,0.76515
0.035,0.01765,0.1827,0.76465
0.034,0.0173,0.1835,0.7652
0.034,0.0161,0.1844,0.7655
0.0339,0.01565,0.1838,0.76665
0.0337,0.0168,0.1828,0.7667
0.0351,0.0165,0.1823,0.7661
0.0349,0.01775,0.18125,0.7661
0.03575,0.01655,0.18195,0.76575
0.03475,0.0164,0.182,0.76685
0.0332,0.0173,0.1808,0.7687
0.0342,0.01715,0.18105,0.7676
0.0353,0.01595,0.18205,0.7667
0.0358,0.01545,0.1816,0.76715
0.0356,0.01635,0.18115,0.7669
0.0348,0.0168,0.18135,0.76705
0.0348,0.0166,0.181,0.7676
0.0337,0.01675,0.18105,0.7685
0.03325,0.01675,0.1815,0.7685
0.0326,0.01795,0.1813,0.76815
0.0335,0.0179,0.18185,0.76675
0.03325,0.01825,0.1817,0.7668
0.03365,0.01825,0.18155,0.76655
0.0348,0.01745,0.18095,0.7668
0.03515,0.01815,0.18045,0.76625
0.03515,0.0178,0.18065,0.7664
0.036,0.0174,0.18005,0.76655
0.03645,0.01775,0.17965,0.76615
0.0349,0.0171,0.1805,0.7675
0.0348,0.0173,0.1813,0.7666
0.0351,0.01765,0.1807,0.76655
0.03535,0.0171,0.18125,0.7663
0.0355,0.0172,0.1815,0.7658
0.0357,0.01695,0.1829,0.76445
0.03525,0.01625,0.1839,0.7646
0.03425,0.0176,0.1838,0.76435
0.0345,0.01795,0.18305,0.7645
0.03535,0.0181,0.18255,0.764
0.034,0.01865,0.1823,0.76505
0.03485,0.0175,0.18245,0.7652
0.0352,0.0177,0.18265,0.76445
0.03465,0.01795,0.183,0.7644
0.035,0.0189,0.18225,0.76385
0.0356,0.01865,0.1815,0.76425
0.0351,0.0184,0.18185,0.76465
0.03515,0.01775,0.1807,0.7664
0.0345,0.0173,0.181,0.7672
0.03445,0.01725,0.17985,0.76845
0.03445,0.01825,0.1787,0.7686
0.03595,0.0164,0.1794,0.76825
0.0349,0.01795,0.17825,0.7689
0.0342,0.01775,0.18,0.76805
0.0337,0.01805,0.1806,0.76765
0.03275,0.0188,0.1805,0.76795
0.03305,0.0186,0.18065,0.7677
0.03285,0.0189,0.18085,0.7674
0.03415,0.0173,0.1816,0.76695
0.03505,0.01775,0.18035,0.76685
0.0344,0.017,0.18035,0.76825
0.03525,0.0168,0.1801,0.76785
0.03615,0.01635,0.1807,0.7668
0.0365,0.0168,0.1809,0.7658
0.03625,0.0176,0.17965,0.7665
0.0359,0.0179,0.18025,0.76595
0.0365,0.01785,0.1811,0.76455
0.0365,0.01795,0.18115,0.7644
0.0368,0.01795,0.18025,0.765
0.0368,0.018,0.17955,0.76565
0.0372,0.01775,0.18005,0.765
0.03625,0.01785,0.181,0.7649
0.0366,0.0178,0.1804,0.7652
0.03615,0.01885,0.1797,0.7653
0.03675,0.01855,0.18045,0.76425
0.03705,0.019,0.17975,0.7642
0.0376,0.01845,0.1803,0.76365
0.0376,0.01785,0.18095,0.7636
0.0374,0.0182,0.1813,0.7631
0.03715,0.01735,0.1823,0.7632
0.03725,0.0163,0.1825,0.76395
0.03575,0.01745,0.18255,0.76425
0.03555,0.0181,0.1825,0.76385
0.03715,0.01695,0.1832,0.7627
0.03665,0.0178,0.18205,0.7635
0.03765,0.0165,0.18235,0.7635
0.03645,0.01715,0.1818,0.7646
0.036,0.0171,0.1817,0.7652
0.03705,0.0167,0.18135,0.7649
0.03685,0.0178,0.1811,0.76425
0.0374,0.01825,0.18085,0.7635
0.03745,0.018,0.18055,0.764
0.0372,0.0182,0.17935,0.76525
0.0361,0.0186,0.1804,0.7649
0.0363,0.0175,0.17995,0.76625
0.03645,0.0189,0.1784,0.76625
0.03565,0.0193,0.1779,0.76715
0.0361,0.01865,0.17795,0.7673
0.0362,0.0191,0.17825,0.76645
0.0372,0.01905,0.17865,0.7651
0.0383,0.0184,0.1781,0.7652
0.0367,0.0184,0.17745,0.76745
0.03615,0.01975,0.1763,0.7678
0.03655,0.01915,0.1759,0.7684
0.0372,0.01905,0.1758,0.76795
0.0372,0.0183,0.1764,0.7681
0.03795,0.0165,0.1771,0.76845
0.0382,0.01695,0.1771,0.76775
0.03835,0.01755,0.1752,0.7689
0.0378,0.01735,0.17525,0.7696
0.0372,0.01745,0.17575,0.7696
0.03635,0.01705,0.176,0.7706
0.03625,0.01725,0.1757,0.7708
0.03565,0.01665,0.17635,0.77135
0.03645,0.01665,0.17625,0.77065
0.03555,0.0161,0.17705,0.7713
0.03475,0.01605,0.17755,0.77165
0.03455,0.0168,0.17775,0.7709
0.0345,0.01685,0.17765,0.771
0.0344,0.0176,0.17675,0.77125
0.0337,0.0175,0.17685,0.77195
0.0336,0.0163,0.1793,0.7708
0.0327,0.01585,0.18005,0.7714
0.03255,0.01555,0.1803,0.7716
0.03255,0.01545,0.18205,0.76995
0.03195,0.0167,0.18345,0.7679
0.0326,0.01585,0.1841,0.76745
0.03115,0.0163,0.18495,0.7676
0.0311,0.0168,0.1848,0.7673
0.03125,0.01635,0.185,0.7674
0.0311,0.01565,0.18565,0.7676
0.0314,0.0151,0.18725,0.76625
0.03085,0.01505,0.18795,0.76615
0.0305,0.0153,0.18845,0.76575
0.0307,0.0157,0.1877,0.7659
0.03,0.01575,0.18865,0.7656
0.03105,0.0159,0.1881,0.76495
0.0304,0.0161,0.18895,0.76455
0.031,0.0151,0.19025,0.76365
0.03025,0.01535,0.19025,0.76415
0.0306,0.0158,0.1906,0.763
0.0309,0.01615,0.19055,0.7624
0.03075,0.0163,0.19095,0.762
0.0317,0.01515,0.1925,0.76065
0.0315,0.0162,0.1921,0.7602
0.03235,0.0165,0.1928,0.75835
0.03335,0.0164,0.1914,0.75885
0.0329,0.0181,0.1908,0.7582
0.03445,0.0177,0.19075,0.7571
0.0348,0.0179,0.1892,0.7581
0.03535,0.0183,0.1894,0.75695
0.03665,0.01865,0.1893,0.7554
0.03705,0.0185,0.1889,0.75555
0.03735,0.01905,0.18745,0.75615
0.037,0.0199,0.18655,0.75655
0.03745,0.01915,0.1864,0.757
0.0374,0.01875,0.1864,0.75745
0.0379,0.01905,0.18565,0.7574
0.03895,0.0177,0.18585,0.7575
0.0383,0.0169,0.187,0.7578
0.0365,0.0175,0.1868,0.7592
0.03585,0.01765,0.18715,0.75935
0.03575,0.0179,0.1876,0.75875
0.0363,0.0179,0.18665,0.75915
0.0359,0.0195,0.1858,0.7588
0.0369,0.01795,0.18595,0.7592
0.0365,0.0199,0.1842,0.7594
0.03705,0.01885,0.18355,0.76055
0.038,0.01875,0.18355,0.7597
0.0381,0.0176,0.18305,0.76125
0.03775,0.01755,0.1834,0.7613
0.0372,0.01905,0.18155,0.7622
0.0381,0.01845,0.1816,0.76185
0.03935,0.01805,0.181,0.7616
0.03835,0.01885,0.1801,0.7627
0.03795,0.0189,0.18,0.76315
0.03915,0.01865,0.18025,0.76195
0.04005,0.0191,0.17915,0.7617
0.04025,0.0186,0.17795,0.7632
0.03935,0.0206,0.1768,0.76325
0.03855,0.0204,0.1764,0.76465
0.04005,0.01915,0.17585,0.76495
0.0395,0.0208,0.17495,0.76475
0.04035,0.02055,0.1744,0.7647
