I,E,S,R
0.001000,0.000850,0.998150,0.000000
0.001200,0.001500,0.997200,0.000100
0.001150,0.002050,0.996400,0.000400
0.001700,0.003100,0.994750,0.000450
0.002300,0.003950,0.993000,0.000750
0.003250,0.005350,0.990450,0.000950
0.003900,0.006800,0.987950,0.001350
0.005650,0.007800,0.984750,0.001800
0.007150,0.010250,0.980400,0.002200
0.008900,0.013800,0.974150,0.003150
0.012250,0.016800,0.966500,0.004450
0.014950,0.023500,0.955800,0.005750
0.019450,0.029100,0.943500,0.007950
0.024550,0.037150,0.927500,0.010800
0.032550,0.046600,0.906950,0.013900
0.043950,0.057800,0.880750,0.017500
0.054850,0.074150,0.848250,0.022750
0.070900,0.094900,0.805000,0.029200
0.087150,0.118100,0.754950,0.039800
0.109000,0.140100,0.700050,0.050850
0.134900,0.165050,0.635550,0.064500
0.163250,0.186600,0.566950,0.083200
0.192150,0.208500,0.493050,0.106300
0.227300,0.223500,0.418000,0.131200
0.258150,0.236200,0.345050,0.160600
0.288150,0.235650,0.280200,0.196000
0.318050,0.226350,0.220750,0.234850
0.341850,0.209300,0.173050,0.275800
0.359800,0.187550,0.133750,0.318900
0.363700,0.170050,0.100150,0.366100
0.364450,0.146000,0.077300,0.412250
0.358750,0.123300,0.059250,0.458700
0.343300,0.102550,0.047650,0.506500
0.327350,0.082900,0.037450,0.552300
0.307250,0.067500,0.030450,0.594800
0.284600,0.053100,0.025950,0.636350
0.260450,0.042150,0.023450,0.673950
0.238250,0.032950,0.021250,0.707550
0.218400,0.026500,0.020250,0.734850
0.198000,0.020650,0.019550,0.761800
0.176400,0.017500,0.019350,0.786750
0.158400,0.014650,0.019750,0.807200
0.140250,0.013650,0.019400,0.826700
0.124750,0.011450,0.020250,0.843550
0.111950,0.009600,0.021150,0.857300
0.100200,0.007350,0.022800,0.869650
0.088000,0.006850,0.023450,0.881700
0.080050,0.006650,0.025350,0.887950
0.069450,0.006350,0.027200,0.897000
0.061550,0.005700,0.028450,0.904300
0.054600,0.004500,0.030750,0.910150
0.047150,0.004200,0.033100,0.915550
0.041450,0.004550,0.035350,0.918650
0.037600,0.004150,0.036750,0.921500
0.032500,0.004200,0.039300,0.924000
0.029300,0.003850,0.042550,0.924300
0.026200,0.003750,0.044650,0.925400
0.023400,0.003300,0.047400,0.925900
0.020550,0.003850,0.049400,0.926200
0.018700,0.003550,0.052550,0.925200
0.017050,0.003050,0.054900,0.925000
0.014750,0.003250,0.056700,0.925300
0.013700,0.002800,0.059400,0.924100
0.012850,0.002800,0.061850,0.922500
0.011700,0.002450,0.063900,0.921950
0.010650,0.002650,0.066100,0.920600
0.009950,0.002150,0.069300,0.918600
0.008900,0.002100,0.071400,0.917600
0.008500,0.001800,0.074150,0.915550
0.007500,0.001850,0.077250,0.913400
0.007000,0.001550,0.080450,0.911000
0.006700,0.001450,0.083050,0.908800
0.006150,0.001600,0.085550,0.906700
0.005550,0.001400,0.088000,0.905050
0.005150,0.001550,0.090300,0.903000
0.005150,0.001550,0.093000,0.900300
0.004500,0.001800,0.095800,0.897900
0.004750,0.001300,0.098750,0.895200
0.004200,0.001150,0.101150,0.893500
0.003600,0.001100,0.103900,0.891400
0.003450,0.000900,0.106600,0.889050
0.003050,0.000850,0.109750,0.886350
0.003150,0.000750,0.112650,0.883450
0.002950,0.000600,0.114900,0.881550
0.002450,0.000600,0.116950,0.880000
0.002150,0.000750,0.119550,0.877550
0.002200,0.000750,0.121700,0.875350
0.002150,0.000650,0.124900,0.872300
0.001950,0.000800,0.127750,0.869500
0.001950,0.000700,0.130850,0.866500
0.001750,0.000800,0.134200,0.863250
0.001700,0.000850,0.137600,0.859850
0.001600,0.000800,0.140850,0.856750
0.001450,0.000650,0.143650,0.854250
0.001350,0.000650,0.146900,0.851100
0.001400,0.000500,0.149950,0.848150
0.001250,0.000500,0.152150,0.846100
0.001100,0.000650,0.154600,0.843650
0.001000,0.000800,0.157900,0.840300
0.000900,0.000750,0.159900,0.838450
0.001000,0.000550,0.162450,0.836000
0.001000,0.000400,0.164550,0.834050
0.000950,0.000450,0.167050,0.831550
0.001100,0.000350,0.169250,0.829300
0.000850,0.000350,0.171650,0.827150
0.000700,0.000300,0.174600,0.824400
0.000850,0.000250,0.177850,0.821050
0.000850,0.000200,0.179900,0.819050
0.000750,0.000350,0.182250,0.816650
0.000850,0.000300,0.184500,0.814350
0.000800,0.000250,0.187050,0.811900
0.000750,0.000200,0.189650,0.809400
0.000750,0.000150,0.192300,0.806800
0.000650,0.000200,0.194650,0.804500
0.000650,0.000150,0.196700,0.802500
0.000600,0.000250,0.198750,0.800400
0.000550,0.000250,0.200550,0.798650
0.000600,0.000300,0.202650,0.796450
0.000550,0.000350,0.204550,0.794550
0.000550,0.000400,0.207100,0.791950
0.000600,0.000400,0.209800,0.789200
0.000600,0.000500,0.212050,0.786850
0.000800,0.000200,0.214250,0.784750
0.000650,0.000250,0.215750,0.783350
0.000450,0.000300,0.218050,0.781200
0.000550,0.000350,0.220050,0.779050
0.000600,0.000350,0.222000,0.777050
0.000650,0.000350,0.224650,0.774350
0.000700,0.000200,0.226650,0.772450
0.000700,0.000550,0.228900,0.769850
0.000750,0.000450,0.230900,0.767900
0.000700,0.000450,0.232850,0.766000
0.000700,0.000600,0.234500,0.764200
0.000600,0.000750,0.236400,0.762250
0.000500,0.000900,0.238100,0.760500
0.000650,0.000800,0.240200,0.758350
0.000850,0.000650,0.242500,0.756000
0.000850,0.000750,0.244300,0.754100
0.000950,0.000650,0.245850,0.752550
0.001050,0.000500,0.247650,0.750800
0.001100,0.000650,0.249050,0.749200
0.001100,0.000600,0.250900,0.747400
0.001000,0.000550,0.253350,0.745100
0.001200,0.000550,0.255150,0.743100
0.001000,0.000700,0.257100,0.741200
0.000950,0.000900,0.258400,0.739750
0.001000,0.000950,0.260650,0.737400
0.001000,0.001050,0.262500,0.735450
0.001050,0.000950,0.264600,0.733400
0.001400,0.000800,0.266850,0.730950
0.001500,0.000900,0.268250,0.729350
0.001500,0.000850,0.270600,0.727050
0.001800,0.000850,0.272200,0.725150
0.001650,0.001050,0.273300,0.724000
0.001900,0.001000,0.275300,0.721800
0.001900,0.001250,0.276800,0.720050
0.001900,0.001100,0.278300,0.718700
0.001950,0.001350,0.279600,0.717100
0.002000,0.001850,0.280350,0.715800
0.002150,0.001450,0.282200,0.714200
0.002200,0.001750,0.283700,0.712350
0.002750,0.001400,0.285500,0.710350
0.002900,0.001600,0.286650,0.708850
0.002750,0.001950,0.287950,0.707350
0.003150,0.001500,0.289650,0.705700
0.003000,0.001700,0.290500,0.704800
0.003300,0.001950,0.291650,0.703100
0.003650,0.002000,0.293100,0.701250
0.003750,0.002250,0.294250,0.699750
0.003850,0.002450,0.295400,0.698300
0.004050,0.002450,0.296800,0.696700
0.004150,0.002450,0.297700,0.695700
0.004600,0.002900,0.298650,0.693850
0.004750,0.003000,0.299950,0.692300
0.004850,0.003100,0.300750,0.691300
0.004450,0.003700,0.300850,0.691000
0.005300,0.003850,0.301450,0.689400
0.005550,0.004250,0.301650,0.688550
0.005950,0.004350,0.302400,0.687300
0.005750,0.004550,0.303400,0.686300
0.006700,0.004600,0.303150,0.685550
0.007600,0.005250,0.303050,0.684100
0.008450,0.005000,0.303400,0.683150
0.008100,0.005750,0.303300,0.682850
0.008200,0.006500,0.302750,0.682550
0.008750,0.006250,0.303300,0.681700
0.009550,0.006300,0.303100,0.681050
0.010650,0.006200,0.303350,0.679800
0.011650,0.006450,0.303300,0.678600
0.011600,0.008050,0.302050,0.678300
0.011900,0.008500,0.301950,0.677650
0.012800,0.009450,0.301300,0.676450
0.014050,0.009400,0.299950,0.676600
0.015050,0.010600,0.298300,0.676050
0.016050,0.011000,0.296600,0.676350
0.017250,0.011800,0.294100,0.676850
0.018650,0.011900,0.292950,0.676500
0.019200,0.012450,0.291300,0.677050
0.020200,0.013300,0.289250,0.677250
0.021050,0.014050,0.287250,0.677650
0.022000,0.014300,0.284650,0.679050
0.023350,0.014350,0.282200,0.680100
0.024600,0.016050,0.279150,0.680200
0.026550,0.017300,0.275500,0.680650
0.028050,0.017400,0.272500,0.682050
0.030500,0.018000,0.268100,0.683400
0.031250,0.019150,0.264250,0.685350
0.032200,0.020900,0.259350,0.687550
0.033200,0.021900,0.255000,0.689900
0.035450,0.023300,0.249350,0.691900
0.037450,0.023550,0.245400,0.693600
0.038800,0.023750,0.241600,0.695850
0.040300,0.023350,0.236700,0.699650
0.040300,0.024550,0.231150,0.704000
0.042400,0.025050,0.225350,0.707200
0.043200,0.025650,0.221300,0.709850
0.043400,0.025300,0.216900,0.714400
0.044100,0.025450,0.212700,0.717750
0.045900,0.024700,0.208250,0.721150
0.047100,0.025850,0.202550,0.724500
0.048450,0.026500,0.197250,0.727800
0.048700,0.026350,0.193550,0.731400
0.048400,0.025350,0.189850,0.736400
0.050800,0.025850,0.184600,0.738750
0.050850,0.025900,0.179750,0.743500
0.051200,0.025300,0.176450,0.747050
0.052450,0.023600,0.173400,0.750550
0.051850,0.024400,0.168400,0.755350
0.052150,0.024050,0.165100,0.758700
0.052550,0.023550,0.162150,0.761750
0.052700,0.023400,0.158150,0.765750
0.052300,0.022750,0.154250,0.770700
0.050350,0.023150,0.152250,0.774250
0.050000,0.022800,0.149600,0.777600
0.048500,0.021750,0.148450,0.781300
0.048650,0.019700,0.147450,0.784200
0.048050,0.018450,0.145200,0.788300
0.046350,0.018350,0.143250,0.792050
0.045200,0.017550,0.142450,0.794800
0.044000,0.017200,0.141000,0.797800
0.043600,0.015750,0.140950,0.799700
0.041750,0.016100,0.139600,0.802550
0.042300,0.014850,0.139800,0.803050
0.040450,0.014150,0.140850,0.804550
0.038600,0.014400,0.140300,0.806700
0.038250,0.013850,0.139900,0.808000
0.037100,0.014000,0.140500,0.808400
0.035750,0.013100,0.140550,0.810600
0.034450,0.012950,0.140450,0.812150
0.032650,0.013000,0.140150,0.814200
0.030150,0.012600,0.141050,0.816200
0.029400,0.012400,0.141550,0.816650
0.028650,0.011550,0.142550,0.817250
0.026300,0.011300,0.144250,0.818150
0.025150,0.011800,0.145050,0.818000
0.024750,0.011250,0.146200,0.817800
0.024400,0.011250,0.147800,0.816550
0.024150,0.010250,0.149250,0.816350
0.023600,0.010300,0.149600,0.816500
0.023150,0.009650,0.151450,0.815750
0.022700,0.009100,0.153450,0.814750
0.022200,0.009050,0.155050,0.813700
0.022200,0.009700,0.155900,0.812200
0.021200,0.009550,0.158000,0.811250
0.021800,0.009700,0.158900,0.809600
0.021400,0.010050,0.160350,0.808200
0.020900,0.009250,0.161700,0.808150
0.020950,0.009750,0.163400,0.805900
0.020500,0.009050,0.165250,0.805200
0.020150,0.009400,0.167100,0.803350
0.020000,0.009500,0.169200,0.801300
0.019100,0.009750,0.170600,0.800550
0.018800,0.009500,0.171750,0.799950
0.018600,0.009100,0.173950,0.798350
0.018900,0.008250,0.176250,0.796600
0.018550,0.008250,0.177800,0.795400
0.018500,0.008000,0.179850,0.793650
0.018500,0.007600,0.182650,0.791250
0.017650,0.008000,0.184650,0.789700
0.017250,0.008200,0.186500,0.788050
0.017450,0.007950,0.188400,0.786200
0.017600,0.008500,0.189300,0.784600
0.017550,0.008650,0.191100,0.782700
0.017700,0.008450,0.193250,0.780600
0.017850,0.009050,0.193900,0.779200
0.016950,0.009100,0.195500,0.778450
0.017300,0.008900,0.197250,0.776550
0.016550,0.009650,0.198000,0.775800
0.017400,0.008750,0.200000,0.773850
0.017550,0.009150,0.202000,0.771300
0.018000,0.009700,0.202500,0.769800
0.018500,0.010250,0.203550,0.767700
0.019300,0.009650,0.204900,0.766150
0.019150,0.010400,0.205250,0.765200
0.018350,0.010300,0.206850,0.764500
0.018400,0.010500,0.207700,0.763400
0.018500,0.010550,0.208950,0.762000
0.019000,0.010100,0.210750,0.760150
0.019750,0.010500,0.212250,0.757500
0.019850,0.010400,0.214250,0.755500
0.018850,0.011600,0.214800,0.754750
0.019200,0.011450,0.214950,0.754400
0.019300,0.011200,0.216250,0.753250
0.019550,0.011100,0.217850,0.751500
0.019950,0.011000,0.218500,0.750550
0.020450,0.010850,0.219200,0.749500
0.020750,0.011200,0.219400,0.748650
0.021500,0.010650,0.221450,0.746400
0.022200,0.010450,0.222100,0.745250
0.021750,0.011500,0.222650,0.744100
0.022650,0.011600,0.223300,0.742450
0.023550,0.012550,0.222000,0.741900
0.023800,0.012900,0.222450,0.740850
0.024250,0.012800,0.222850,0.740100
0.024650,0.013950,0.222300,0.739100
0.025950,0.013200,0.221900,0.738950
0.025900,0.013550,0.221300,0.739250
0.026050,0.013550,0.221600,0.738800
0.026650,0.014250,0.221350,0.737750
0.026150,0.014850,0.221550,0.737450
0.026050,0.015450,0.221100,0.737400
0.026700,0.016600,0.219900,0.736800
0.028100,0.016150,0.219100,0.736650
0.029800,0.016550,0.218350,0.735300
0.031050,0.016100,0.218000,0.734850
0.031750,0.016500,0.216200,0.735550
0.031500,0.018250,0.214100,0.736150
0.032800,0.017800,0.212700,0.736700
0.034000,0.017100,0.212300,0.736600
0.034600,0.016900,0.211000,0.737500
0.034850,0.018150,0.209300,0.737700
0.035450,0.017100,0.209300,0.738150
0.036000,0.015650,0.209200,0.739150
0.035950,0.016850,0.207550,0.739650
0.036250,0.017600,0.205700,0.740450
0.035650,0.018350,0.204250,0.741750
0.035000,0.018000,0.203350,0.743650
0.036300,0.017900,0.203050,0.742750
0.036550,0.018000,0.202300,0.743150
0.036500,0.019250,0.201000,0.743250
0.036250,0.019550,0.199650,0.744550
0.035050,0.019950,0.198150,0.746850
0.036250,0.020150,0.196750,0.746850
0.037000,0.020050,0.196600,0.746350
0.037850,0.019750,0.195650,0.746750
0.038450,0.019800,0.194850,0.746900
0.038600,0.017850,0.195650,0.747900
0.036850,0.019800,0.194100,0.749250
0.037450,0.020200,0.192900,0.749450
0.037500,0.020550,0.191250,0.750700
0.039700,0.021150,0.189400,0.749750
0.040650,0.020950,0.187750,0.750650
0.040950,0.021400,0.186600,0.751050
0.042350,0.020200,0.186200,0.751250
0.042150,0.021050,0.183900,0.752900
0.043200,0.021650,0.180950,0.754200
0.042150,0.021300,0.180300,0.756250
0.042300,0.020900,0.179250,0.757550
0.041700,0.020450,0.179300,0.758550
0.043350,0.019750,0.177900,0.759000
0.042600,0.019700,0.176450,0.761250
0.041300,0.019650,0.176550,0.762500
0.041950,0.019300,0.176650,0.762100
0.041800,0.017900,0.177100,0.763200
0.040650,0.019050,0.174900,0.765400
0.040150,0.018500,0.174750,0.766600
0.040450,0.018550,0.173750,0.767250
0.039900,0.018000,0.173650,0.768450
0.039650,0.017750,0.173300,0.769300
0.039650,0.018000,0.171900,0.770450
0.039250,0.017750,0.171950,0.771050
0.038900,0.017450,0.172300,0.771350
0.037750,0.017950,0.173050,0.771250
0.038150,0.017250,0.172550,0.772050
0.036600,0.017950,0.172450,0.773000
0.035850,0.017450,0.172850,0.773850
0.035400,0.017050,0.173050,0.774500
0.034900,0.017500,0.172900,0.774700
0.034600,0.018200,0.172400,0.774800
0.034700,0.018200,0.171650,0.775450
0.034950,0.018200,0.170750,0.776100
0.036750,0.016950,0.171100,0.775200
0.036750,0.016600,0.171800,0.774850
0.036050,0.017350,0.171600,0.775000
0.036500,0.016700,0.172600,0.774200
0.036700,0.016850,0.171400,0.775050
0.036000,0.017500,0.171600,0.774900
0.035900,0.017250,0.172050,0.774800
0.036500,0.016150,0.172750,0.774600
0.035050,0.017050,0.174150,0.773750
0.034600,0.016150,0.174550,0.774700
0.035700,0.014900,0.175600,0.773800
0.036100,0.014600,0.176800,0.772500
0.036700,0.014450,0.177450,0.771400
0.036500,0.015500,0.177250,0.770750
0.035700,0.016150,0.175750,0.772400
0.034450,0.016400,0.176200,0.772950
0.035200,0.016600,0.175200,0.773000
0.034750,0.016550,0.175350,0.773350
0.032850,0.016800,0.176200,0.774150
0.033400,0.016650,0.176500,0.773450
0.032900,0.015150,0.177600,0.774350
0.031600,0.016500,0.178500,0.773400
0.032150,0.016000,0.178750,0.773100
0.032000,0.015800,0.179850,0.772350
0.032400,0.015200,0.181050,0.771350
0.032150,0.014600,0.180900,0.772350
0.032400,0.014100,0.181950,0.771550
0.032200,0.013550,0.184200,0.770050
0.031900,0.015050,0.183900,0.769150
0.031950,0.016100,0.183550,0.768400
0.030750,0.016000,0.183700,0.769550
0.031300,0.015600,0.184350,0.768750
0.031350,0.015100,0.186450,0.767100
0.031650,0.015800,0.186500,0.766050
0.031750,0.015650,0.187800,0.764800
0.032350,0.016050,0.188550,0.763050
0.031950,0.016500,0.188550,0.763000
0.032900,0.015400,0.189150,0.762550
0.032650,0.016800,0.188100,0.762450
0.033600,0.015700,0.188000,0.762700
0.033550,0.015100,0.188900,0.762450
0.033700,0.015100,0.189500,0.761700
0.033300,0.015700,0.190000,0.761000
0.032400,0.015950,0.190050,0.761600
0.031650,0.016300,0.189700,0.762350
0.031800,0.016300,0.189600,0.762300
0.032150,0.014700,0.190800,0.762350
0.031200,0.014750,0.191600,0.762450
0.030400,0.015050,0.192300,0.762250
0.030500,0.014250,0.193100,0.762150
0.030950,0.014700,0.192600,0.761750
0.030800,0.015100,0.192900,0.761200
0.030750,0.015350,0.192600,0.761300
0.031150,0.014850,0.194150,0.759850
0.030100,0.014400,0.195000,0.760500
0.029550,0.015500,0.195150,0.759800
0.029550,0.015600,0.195600,0.759250
0.029600,0.016000,0.195150,0.759250
0.030100,0.015900,0.195450,0.758550
0.031100,0.015000,0.195300,0.758600
0.030450,0.016250,0.195250,0.758050
0.031550,0.017150,0.194750,0.756550
0.032350,0.016150,0.195100,0.756400
0.032200,0.017050,0.194850,0.755900
0.031800,0.017100,0.195150,0.755950
0.033000,0.016300,0.195350,0.755350
0.034500,0.015200,0.195950,0.754350
0.034150,0.015800,0.195150,0.754900
0.034000,0.014850,0.195450,0.755700
0.034700,0.014700,0.194250,0.756350
0.033850,0.016000,0.193950,0.756200
0.034900,0.016800,0.192250,0.756050
0.035000,0.017550,0.190550,0.756900
0.034450,0.017100,0.189800,0.758650
0.034700,0.017450,0.188650,0.759200
0.034750,0.017650,0.187000,0.760600
0.034650,0.017850,0.187200,0.760300
0.035350,0.018400,0.185150,0.761100
0.035900,0.017750,0.185200,0.761150
0.035500,0.018750,0.184250,0.761500
0.035750,0.019400,0.183150,0.761700
0.035650,0.019050,0.182650,0.762650
0.035650,0.018500,0.181950,0.763900
0.037050,0.018250,0.180600,0.764100
0.037500,0.017650,0.179850,0.765000
0.037450,0.018000,0.178950,0.765600
0.037150,0.016950,0.178400,0.767500
0.037050,0.017800,0.176600,0.768550
0.038300,0.017400,0.175150,0.769150
0.037650,0.018450,0.174900,0.769000
0.037700,0.017450,0.174500,0.770350
0.036350,0.017800,0.174150,0.771700
0.037000,0.016200,0.174400,0.772400
0.037150,0.016500,0.174450,0.771900
0.035950,0.017750,0.174850,0.771450
0.035800,0.018600,0.173550,0.772050
0.036850,0.018550,0.172550,0.772050
0.036450,0.018550,0.171500,0.773500
0.037050,0.018250,0.170850,0.773850
0.038000,0.017550,0.170250,0.774200
0.037750,0.016650,0.171050,0.774550
0.037200,0.016250,0.171500,0.775050
0.037550,0.016000,0.171300,0.775150
0.037050,0.014900,0.171550,0.776500
0.036100,0.014900,0.172100,0.776900
0.035600,0.014900,0.172600,0.776900
0.034600,0.015550,0.173050,0.776800
0.034500,0.016050,0.172850,0.776600
0.034500,0.016400,0.172000,0.777100
0.034050,0.016750,0.171950,0.777250
0.034350,0.016450,0.173250,0.775950
0.034150,0.016950,0.172950,0.775950
0.034000,0.016750,0.172550,0.776700
0.034150,0.017150,0.172650,0.776050
0.033200,0.017400,0.171950,0.777450
0.033550,0.016400,0.172800,0.777250
0.033550,0.015600,0.173350,0.777500
0.033500,0.016250,0.172500,0.777750
0.033700,0.016450,0.172100,0.777750
0.032600,0.016800,0.172250,0.778350
0.032300,0.015900,0.173500,0.778300
0.032900,0.015400,0.175050,0.776650
0.032400,0.015850,0.174500,0.777250
0.032500,0.015100,0.174350,0.778050
0.031500,0.015100,0.176050,0.777350
0.030700,0.014850,0.177350,0.777100
0.031250,0.014150,0.178600,0.776000
0.030650,0.014750,0.177700,0.776900
0.029450,0.014850,0.178150,0.777550
0.030050,0.014200,0.178550,0.777200
0.029900,0.013750,0.178500,0.777850
0.030100,0.013600,0.179150,0.777150
0.029500,0.014250,0.179800,0.776450
0.029700,0.014350,0.180600,0.775350
0.029750,0.014350,0.181050,0.774850
0.030100,0.014750,0.181500,0.773650
0.030050,0.015600,0.181850,0.772500
0.029250,0.016050,0.182200,0.772500
0.030800,0.015200,0.183100,0.770900
0.029950,0.015600,0.182850,0.771600
0.030500,0.014550,0.184300,0.770650
0.030350,0.014850,0.184750,0.770050
0.029400,0.015700,0.185400,0.769500
0.029350,0.016050,0.185650,0.768950
0.029350,0.016500,0.185350,0.768800
0.030200,0.016150,0.185800,0.767850
0.030650,0.015750,0.187500,0.766100
0.031450,0.015050,0.188050,0.765450
0.031250,0.014150,0.188950,0.765650
0.030950,0.015100,0.188850,0.765100
0.031100,0.016050,0.188700,0.764150
0.031650,0.015150,0.189650,0.763550
0.030450,0.014750,0.190500,0.764300
0.030850,0.014100,0.191500,0.763550
0.030900,0.014500,0.192200,0.762400
0.031100,0.014100,0.192800,0.762000
0.031450,0.014050,0.193600,0.760900
0.030550,0.013650,0.193800,0.762000
0.030600,0.014000,0.194650,0.760750
0.030650,0.014200,0.196650,0.758500
0.030550,0.015400,0.195400,0.758650
0.029900,0.015700,0.195600,0.758800
0.031150,0.015450,0.195500,0.757900
0.030650,0.015600,0.196500,0.757250
0.030900,0.015850,0.196450,0.756800
0.032150,0.015100,0.196750,0.756000
0.032400,0.015250,0.196150,0.756200
0.033200,0.015400,0.196700,0.754700
0.033400,0.015200,0.197200,0.754200
0.033250,0.017200,0.195450,0.754100
0.033800,0.017150,0.194500,0.754550
0.034400,0.017050,0.193300,0.755250
0.033650,0.017250,0.192550,0.756550
0.033300,0.017100,0.193350,0.756250
0.033750,0.017350,0.192700,0.756200
0.033450,0.017700,0.192200,0.756650
0.034400,0.018100,0.191350,0.756150
0.034500,0.017750,0.191850,0.755900
0.034050,0.019350,0.190600,0.756000
0.034900,0.019700,0.188800,0.756600
0.034850,0.020250,0.188850,0.756050
0.034550,0.019400,0.189200,0.756850
0.035100,0.017650,0.190200,0.757050
0.034800,0.018150,0.189650,0.757400
0.035450,0.018000,0.188950,0.757600
0.035600,0.018050,0.187950,0.758400
0.035500,0.018800,0.187100,0.758600
0.035900,0.017550,0.186450,0.760100
0.035650,0.018550,0.185700,0.760100
0.037050,0.018100,0.184700,0.760150
0.036450,0.018350,0.184200,0.761000
0.037700,0.017850,0.183650,0.760800
0.038400,0.018250,0.181800,0.761550
0.038000,0.018200,0.180900,0.762900
0.037800,0.018200,0.181050,0.762950
0.037000,0.018600,0.180800,0.763600
0.038300,0.017650,0.180850,0.763200
0.036850,0.018000,0.180400,0.764750
0.037250,0.018900,0.179550,0.764300
0.036400,0.018100,0.180100,0.765400
0.036500,0.018000,0.180350,0.765150
0.036050,0.018450,0.179200,0.766300
0.036100,0.018250,0.178100,0.767550
0.034450,0.018500,0.179450,0.767600
0.035850,0.017750,0.179500,0.766900
0.034750,0.017800,0.179600,0.767850
0.034700,0.017400,0.180200,0.767700
0.034500,0.017200,0.180950,0.767350
0.035150,0.016450,0.181550,0.766850
0.035300,0.016700,0.181400,0.766600
0.034400,0.017350,0.182000,0.766250
0.034550,0.017250,0.182250,0.765950
0.035000,0.017150,0.183450,0.764400
0.035400,0.017400,0.184400,0.762800
0.035100,0.017250,0.184600,0.763050
0.034900,0.017200,0.183950,0.763950
0.036000,0.017050,0.183950,0.763000
0.037100,0.015800,0.185000,0.762100
0.036400,0.016450,0.185300,0.761850
0.037400,0.015950,0.184200,0.762450
0.037200,0.016050,0.184200,0.762550
0.036350,0.016200,0.184400,0.763050
0.034200,0.016850,0.184550,0.764400
0.034100,0.015800,0.185600,0.764500
0.034650,0.016000,0.185450,0.763900
0.034500,0.015650,0.186000,0.763850
0.034750,0.015750,0.186300,0.763200
0.035100,0.015000,0.187150,0.762750
0.034800,0.016050,0.185950,0.763200
0.035100,0.016550,0.186300,0.762050
0.034550,0.018150,0.185400,0.761900
0.034750,0.017900,0.184900,0.762450
0.034350,0.017900,0.185650,0.762100
0.035750,0.017500,0.185800,0.760950
0.035450,0.018400,0.185900,0.760250
0.035950,0.017200,0.186150,0.760700
0.035750,0.017100,0.187250,0.759900
0.034900,0.017150,0.187100,0.760850
0.035650,0.016850,0.187050,0.760450
0.035300,0.016050,0.188100,0.760550
0.035550,0.016150,0.188850,0.759450
0.035550,0.017150,0.189150,0.758150
0.035400,0.017550,0.189000,0.758050
0.035800,0.017550,0.188600,0.758050
0.036000,0.018400,0.187650,0.757950
0.037650,0.016850,0.188000,0.757500
0.037700,0.017450,0.187050,0.757800
0.038300,0.017450,0.186450,0.757800
0.037800,0.018450,0.185100,0.758650
0.038600,0.018900,0.183900,0.758600
0.037450,0.019650,0.183450,0.759450
0.037150,0.019950,0.182800,0.760100
0.037350,0.021000,0.182300,0.759350
0.039600,0.018650,0.182100,0.759650
0.039300,0.018550,0.181700,0.760450
0.040000,0.017650,0.181400,0.760950
0.039450,0.018000,0.180550,0.762000
0.039600,0.018300,0.179500,0.762600
0.040000,0.017750,0.178850,0.763400
0.039550,0.017600,0.178950,0.763900
0.039150,0.017700,0.179050,0.764100
0.037300,0.019000,0.177350,0.766350
0.037750,0.018850,0.176550,0.766850
0.037500,0.018750,0.176700,0.767050
0.037250,0.018250,0.177400,0.767100
0.037900,0.017650,0.176800,0.767650
0.037900,0.017000,0.177450,0.767650
0.038450,0.017150,0.177950,0.766450
0.038050,0.016900,0.177300,0.767750
0.037650,0.016100,0.177950,0.768300
0.037150,0.018350,0.177000,0.767500
0.037200,0.017550,0.177800,0.767450
0.036800,0.018200,0.177250,0.767750
0.036100,0.019250,0.176950,0.767700
0.037000,0.018350,0.177650,0.767000
0.037050,0.018400,0.178800,0.765750
0.036300,0.018150,0.179650,0.765900
0.037300,0.016850,0.180400,0.765450
0.037650,0.016400,0.180550,0.765400
0.036850,0.017600,0.179900,0.765650
0.035900,0.018150,0.179700,0.766250
0.037200,0.017000,0.179200,0.766600
0.036900,0.017100,0.179350,0.766650
0.037500,0.017050,0.178800,0.766650
0.036400,0.018100,0.178700,0.766800
0.035900,0.017250,0.179950,0.766900
0.035100,0.017550,0.180650,0.766700
0.035400,0.016750,0.181500,0.766350
0.035500,0.017600,0.180550,0.766350
0.034550,0.018200,0.180550,0.766700
0.035250,0.017050,0.181350,0.766350
0.035150,0.016700,0.180850,0.767300
0.034500,0.017050,0.180700,0.767750
0.033950,0.017250,0.180950,0.767850
0.034750,0.016450,0.180850,0.767950
0.034350,0.016550,0.180850,0.768250
0.033150,0.017250,0.180050,0.769550
0.033950,0.016750,0.180000,0.769300
0.033600,0.017450,0.180050,0.768900
0.033900,0.017000,0.179750,0.769350
0.033750,0.018600,0.178550,0.769100
0.034200,0.018150,0.179000,0.768650
0.034250,0.016850,0.180050,0.768850
0.035000,0.017000,0.179850,0.768150
0.034950,0.016400,0.181100,0.767550
0.034250,0.016950,0.181200,0.767600
0.034600,0.016350,0.181200,0.767850
0.034050,0.017500,0.180400,0.768050
0.033450,0.016800,0.181100,0.768650
0.034500,0.016250,0.180850,0.768400
0.033800,0.016550,0.181250,0.768400
0.033450,0.016200,0.181550,0.768800
0.033350,0.016200,0.181350,0.769100
0.032800,0.015750,0.181400,0.770050
0.033950,0.015800,0.181100,0.769150
0.033600,0.016400,0.180450,0.769550
0.034750,0.014900,0.181000,0.769350
0.034800,0.015350,0.181650,0.768200
0.034700,0.015600,0.181150,0.768550
0.033950,0.015650,0.181800,0.768600
0.034000,0.015150,0.182400,0.768450
0.033100,0.015000,0.182950,0.768950
0.033050,0.015200,0.183250,0.768500
0.032750,0.016550,0.182600,0.768100
0.032850,0.016050,0.184100,0.767000
0.032750,0.016250,0.184350,0.766650
0.032600,0.015850,0.185400,0.766150
0.032700,0.015400,0.186750,0.765150
0.032600,0.016100,0.186900,0.764400
0.032950,0.016450,0.186600,0.764000
0.033800,0.017000,0.185550,0.763650
0.034450,0.016000,0.186100,0.763450
0.034450,0.016550,0.186100,0.762900
0.035150,0.016500,0.185100,0.763250
0.033900,0.016600,0.185350,0.764150
0.035200,0.016200,0.186250,0.762350
0.033750,0.017000,0.185350,0.763900
0.034400,0.016700,0.185750,0.763150
0.033750,0.016950,0.185350,0.763950
0.034500,0.017100,0.185550,0.762850
0.035250,0.015350,0.185600,0.763800
0.035500,0.015450,0.185200,0.763850
0.034400,0.015950,0.185350,0.764300
0.034100,0.016150,0.184800,0.764950
0.034450,0.016250,0.184750,0.764550
0.033400,0.016900,0.184700,0.765000
0.034900,0.016650,0.184600,0.763850
0.033800,0.017500,0.183450,0.765250
0.033850,0.017000,0.182850,0.766300
