
--------------------------
Total energy: 416.93 Joules, including:
	CPU energy: 416.93 Joules
	GPU energy: 0.00 Joules
--------------------------

--------------------------
Total energy: 414.97 Joules, including:
	CPU energy: 414.97 Joules
	GPU energy: 0.00 Joules
--------------------------

--------------------------
Total energy: 411.92 Joules, including:
	CPU energy: 411.92 Joules
	GPU energy: 0.00 Joules
--------------------------

--------------------------
Total energy: 411.95 Joules, including:
	CPU energy: 411.95 Joules
	GPU energy: 0.00 Joules
--------------------------

--------------------------
Total energy: 414.42 Joules, including:
	CPU energy: 414.42 Joules
	GPU energy: 0.00 Joules
--------------------------

--------------------------
Total energy: 417.22 Joules, including:
	CPU energy: 417.22 Joules
	GPU energy: 0.00 Joules
--------------------------

--------------------------
Total energy: 417.18 Joules, including:
	CPU energy: 417.18 Joules
	GPU energy: 0.00 Joules
--------------------------

--------------------------
Total energy: 414.95 Joules, including:
	CPU energy: 414.95 Joules
	GPU energy: 0.00 Joules
--------------------------

--------------------------
Total energy: 412.02 Joules, including:
	CPU energy: 412.02 Joules
	GPU energy: 0.00 Joules
--------------------------

--------------------------
Total energy: 412.00 Joules, including:
	CPU energy: 412.00 Joules
	GPU energy: 0.00 Joules
--------------------------
