I,E,S,R
0.001000,0.000850,0.998150,0.000000
0.001100,0.001500,0.997200,0.000200
0.001500,0.002150,0.996100,0.000250
0.002050,0.003300,0.994250,0.000400
0.002800,0.004500,0.992050,0.000650
0.004000,0.006150,0.988900,0.000950
0.005050,0.007650,0.985800,0.001500
0.006500,0.010450,0.981000,0.002050
0.008850,0.013300,0.975100,0.002750
0.011600,0.017800,0.966650,0.003950
0.015500,0.022250,0.956600,0.005650
0.019400,0.030550,0.942550,0.007500
0.025350,0.039400,0.925100,0.010150
0.034100,0.049850,0.902350,0.013700
0.044000,0.061200,0.876950,0.017850
0.057450,0.074950,0.844500,0.023100
0.071350,0.094500,0.803350,0.030800
0.087600,0.119550,0.752250,0.040600
0.110600,0.144450,0.693450,0.051500
0.136050,0.168300,0.628350,0.067300
0.165950,0.189400,0.559050,0.085600
0.197050,0.208350,0.486200,0.108400
0.226350,0.228300,0.410750,0.134600
0.260000,0.237800,0.337950,0.164250
0.291850,0.239900,0.270150,0.198100
0.321350,0.229800,0.214050,0.234800
0.341900,0.214100,0.166700,0.277300
0.356600,0.193750,0.127350,0.322300
0.360850,0.171200,0.097050,0.370900
0.362550,0.148250,0.075000,0.414200
0.355100,0.125600,0.057600,0.461700
0.342750,0.104850,0.044300,0.508100
0.326100,0.084200,0.036900,0.552800
0.304500,0.069850,0.029750,0.595900
0.284700,0.056400,0.024500,0.634400
0.264300,0.045850,0.020950,0.668900
0.242000,0.037000,0.019800,0.701200
0.221650,0.028750,0.017700,0.731900
0.200750,0.022950,0.017350,0.758950
0.180550,0.018350,0.018900,0.782200
0.163250,0.014750,0.019700,0.802300
0.144250,0.012750,0.019350,0.823650
0.128950,0.011350,0.019350,0.840350
0.115700,0.009900,0.020300,0.854100
0.102950,0.008700,0.021600,0.866750
0.090550,0.008350,0.023000,0.878100
0.079600,0.006650,0.024600,0.889150
0.070550,0.006100,0.026300,0.897050
0.063750,0.004400,0.028800,0.903050
0.055350,0.004300,0.030350,0.910000
0.047750,0.004550,0.032900,0.914800
0.042100,0.004700,0.034350,0.918850
0.037050,0.004250,0.037000,0.921700
0.033150,0.003500,0.039500,0.923850
0.028750,0.003250,0.042750,0.925250
0.025050,0.002950,0.045650,0.926350
0.022550,0.003200,0.048100,0.926150
0.021000,0.002650,0.051900,0.924450
0.018450,0.002650,0.054200,0.924700
0.017250,0.002200,0.057050,0.923500
0.015050,0.002650,0.059600,0.922700
0.013650,0.002450,0.061850,0.922050
0.012300,0.002400,0.064600,0.920700
0.010650,0.002400,0.066950,0.920000
0.010100,0.002300,0.069800,0.917800
0.009650,0.001900,0.072500,0.915950
0.009100,0.001900,0.075850,0.913150
0.007700,0.001950,0.078400,0.911950
0.006950,0.002050,0.081000,0.910000
0.006200,0.001950,0.083850,0.908000
0.005750,0.001650,0.086800,0.905800
0.005450,0.001200,0.089550,0.903800
0.004650,0.001350,0.091450,0.902550
0.004550,0.001200,0.093900,0.900350
0.004000,0.001150,0.096450,0.898400
0.003850,0.000850,0.098200,0.897100
0.002900,0.000800,0.100800,0.895500
0.002750,0.000700,0.104000,0.892550
0.002500,0.000850,0.106400,0.890250
0.002400,0.000750,0.109950,0.886900
0.001850,0.000700,0.112550,0.884900
0.001650,0.000700,0.115600,0.882050
0.001450,0.000550,0.118550,0.879450
0.001400,0.000450,0.121300,0.876850
0.001300,0.000550,0.123500,0.874650
0.001100,0.000750,0.125400,0.872750
0.001150,0.000650,0.128400,0.869800
0.001200,0.000600,0.131150,0.867050
0.001200,0.000600,0.133650,0.864550
0.001200,0.000400,0.135300,0.863100
0.001050,0.000450,0.138350,0.860150
0.001050,0.000550,0.141250,0.857150
0.001200,0.000300,0.143800,0.854700
0.001100,0.000350,0.146600,0.851950
0.001100,0.000450,0.148900,0.849550
0.000950,0.000300,0.151400,0.847350
0.001000,0.000350,0.153950,0.844700
0.000800,0.000300,0.156350,0.842550
0.000800,0.000200,0.159650,0.839350
0.000700,0.000300,0.161600,0.837400
0.000800,0.000200,0.164350,0.834650
0.000850,0.000150,0.166550,0.832450
0.000700,0.000200,0.168800,0.830300
0.000700,0.000200,0.171400,0.827700
0.000750,0.000350,0.173350,0.825550
0.000750,0.000400,0.175650,0.823200
0.000700,0.000300,0.177600,0.821400
0.000750,0.000300,0.179700,0.819250
0.000750,0.000350,0.181650,0.817250
0.000900,0.000100,0.184000,0.815000
0.000950,0.000100,0.186150,0.812800
0.000650,0.000350,0.188550,0.810450
0.000650,0.000350,0.190600,0.808400
0.000600,0.000400,0.192950,0.806050
0.000700,0.000250,0.194900,0.804150
0.000700,0.000200,0.197450,0.801650
0.000650,0.000350,0.199750,0.799250
0.000600,0.000300,0.202000,0.797100
0.000600,0.000400,0.204800,0.794200
0.000650,0.000400,0.207050,0.791900
0.000700,0.000600,0.208950,0.789750
0.000700,0.000600,0.210850,0.787850
0.000750,0.000650,0.212550,0.786050
0.000950,0.000450,0.214700,0.783900
0.001100,0.000350,0.216950,0.781600
0.001100,0.000400,0.218750,0.779750
0.001100,0.000350,0.220950,0.777600
0.000950,0.000350,0.222700,0.776000
0.000900,0.000350,0.224050,0.774700
0.000900,0.000450,0.226100,0.772550
0.001000,0.000450,0.228650,0.769900
0.001050,0.000350,0.230850,0.767750
0.001050,0.000300,0.233050,0.765600
0.001250,0.000200,0.236100,0.762450
0.001100,0.000250,0.238400,0.760250
0.000800,0.000300,0.241050,0.757850
0.000600,0.000300,0.243400,0.755700
0.000550,0.000400,0.245450,0.753600
0.000650,0.000400,0.247700,0.751250
0.000750,0.000350,0.249700,0.749200
0.000800,0.000350,0.251700,0.747150
0.000900,0.000350,0.253750,0.745000
0.001000,0.000400,0.255450,0.743150
0.001050,0.000400,0.257150,0.741400
0.001100,0.000600,0.258600,0.739700
0.001200,0.000600,0.260850,0.737350
0.000850,0.000750,0.262800,0.735600
0.001050,0.000650,0.264950,0.733350
0.001050,0.000950,0.266750,0.731250
0.001000,0.001000,0.268600,0.729400
0.001250,0.000950,0.269800,0.728000
0.001200,0.001150,0.272000,0.725650
0.001600,0.001000,0.273950,0.723450
0.001650,0.001000,0.275450,0.721900
0.001900,0.000900,0.277050,0.720150
0.001700,0.001100,0.278700,0.718500
0.002050,0.000750,0.280650,0.716550
0.002100,0.001050,0.282300,0.714550
0.002000,0.001300,0.283900,0.712800
0.001900,0.001350,0.285300,0.711450
0.001900,0.001400,0.287100,0.709600
0.002300,0.001350,0.289200,0.707150
0.002400,0.001400,0.291000,0.705200
0.002400,0.001550,0.292500,0.703550
0.002350,0.001500,0.294450,0.701700
0.002550,0.001400,0.296350,0.699700
0.002650,0.001800,0.297200,0.698350
0.002450,0.001950,0.298650,0.696950
0.002800,0.002050,0.299400,0.695750
0.003000,0.002250,0.300550,0.694200
0.003200,0.002550,0.301650,0.692600
0.003600,0.002850,0.302800,0.690750
0.003900,0.002800,0.303900,0.689400
0.004100,0.003350,0.304800,0.687750
0.004400,0.003800,0.305700,0.686100
0.004300,0.004100,0.306100,0.685500
0.004500,0.004100,0.307600,0.683800
0.005400,0.003900,0.307900,0.682800
0.005450,0.004200,0.308400,0.681950
0.006050,0.004200,0.309100,0.680650
0.006000,0.004700,0.309950,0.679350
0.006850,0.004050,0.311300,0.677800
0.006950,0.004900,0.310900,0.677250
0.007300,0.005600,0.310450,0.676650
0.007700,0.005950,0.310650,0.675700
0.008650,0.006000,0.310650,0.674700
0.009750,0.006350,0.310650,0.673250
0.010800,0.006500,0.310900,0.671800
0.010800,0.007900,0.309900,0.671400
0.011650,0.008950,0.308950,0.670450
0.012000,0.009450,0.308650,0.669900
0.013000,0.010200,0.307700,0.669100
0.013750,0.010950,0.306850,0.668450
0.014500,0.011350,0.306050,0.668100
0.015350,0.012000,0.303950,0.668700
0.016750,0.011400,0.303450,0.668400
0.017200,0.013250,0.301450,0.668100
0.018200,0.014650,0.298850,0.668300
0.019950,0.014000,0.296750,0.669300
0.021600,0.013850,0.295000,0.669550
0.022100,0.015750,0.291800,0.670350
0.023550,0.016100,0.287950,0.672400
0.024200,0.017500,0.284300,0.674000
0.025800,0.018000,0.280800,0.675400
0.027850,0.018500,0.276900,0.676750
0.028100,0.019750,0.273000,0.679150
0.029700,0.021300,0.268200,0.680800
0.030550,0.021400,0.264650,0.683400
0.032950,0.021650,0.260450,0.684950
0.036300,0.020400,0.256050,0.687250
0.036450,0.021750,0.251450,0.690350
0.036850,0.023300,0.246350,0.693500
0.038550,0.023550,0.241300,0.696600
0.040050,0.023650,0.236300,0.700000
0.041500,0.024500,0.231200,0.702800
0.042150,0.025850,0.226000,0.706000
0.045400,0.025200,0.220850,0.708550
0.046900,0.024450,0.216700,0.711950
0.045750,0.026000,0.211800,0.716450
0.047400,0.025100,0.207150,0.720350
0.048150,0.025450,0.202550,0.723850
0.048400,0.026150,0.198350,0.727100
0.047950,0.027450,0.193300,0.731300
0.049600,0.027650,0.187450,0.735300
0.051100,0.027100,0.183150,0.738650
0.052350,0.024850,0.180350,0.742450
0.051950,0.024450,0.177100,0.746500
0.052450,0.024100,0.173050,0.750400
0.051300,0.023550,0.169950,0.755200
0.050450,0.024550,0.165650,0.759350
0.049700,0.024250,0.162700,0.763350
0.050200,0.022400,0.160250,0.767150
0.048600,0.021900,0.157900,0.771600
0.046650,0.022350,0.155650,0.775350
0.047100,0.021500,0.153050,0.778350
0.046550,0.021100,0.152000,0.780350
0.047100,0.020200,0.149500,0.783200
0.047250,0.019050,0.148400,0.785300
0.046600,0.018850,0.146100,0.788450
0.045650,0.017900,0.145350,0.791100
0.044500,0.017400,0.145100,0.793000
0.042500,0.017000,0.144800,0.795700
0.042250,0.017500,0.142750,0.797500
0.041450,0.016850,0.141550,0.800150
0.042050,0.016100,0.139700,0.802150
0.040800,0.015350,0.139850,0.804000
0.039650,0.015650,0.138550,0.806150
0.038350,0.014700,0.137900,0.809050
0.036900,0.015350,0.137600,0.810150
0.035800,0.014000,0.139050,0.811150
0.034950,0.013450,0.138750,0.812850
0.033700,0.013850,0.138750,0.813700
0.033350,0.014000,0.138500,0.814150
0.032700,0.013050,0.139300,0.814950
0.031700,0.012550,0.140900,0.814850
0.031650,0.011850,0.142700,0.813800
0.030050,0.011750,0.143350,0.814850
0.029100,0.011400,0.144350,0.815150
0.028050,0.011700,0.145100,0.815150
0.027750,0.011800,0.146150,0.814300
0.027100,0.011800,0.147600,0.813500
0.027300,0.010450,0.149100,0.813150
0.026100,0.010150,0.150900,0.812850
0.024700,0.010200,0.152450,0.812650
0.024400,0.009550,0.153800,0.812250
0.023850,0.009650,0.154250,0.812250
0.023150,0.009800,0.155600,0.811450
0.021950,0.009650,0.158150,0.810250
0.021650,0.009400,0.159550,0.809400
0.021450,0.009500,0.160700,0.808350
0.021250,0.009500,0.161750,0.807500
0.020850,0.009300,0.163450,0.806400
0.020500,0.008700,0.165250,0.805550
0.020350,0.008850,0.166850,0.803950
0.020200,0.008900,0.169150,0.801750
0.020050,0.008550,0.171100,0.800300
0.019600,0.008050,0.173800,0.798550
0.018800,0.008150,0.175550,0.797500
0.019100,0.008050,0.176600,0.796250
0.018200,0.008250,0.177600,0.795950
0.018650,0.008850,0.178350,0.794150
0.018500,0.008600,0.180550,0.792350
0.018500,0.008850,0.183450,0.789200
0.018250,0.009200,0.184800,0.787750
0.018250,0.008800,0.187050,0.785900
0.017500,0.009050,0.188900,0.784550
0.017400,0.008850,0.190000,0.783750
0.018700,0.008500,0.191100,0.781700
0.018550,0.009000,0.193650,0.778800
0.018800,0.008850,0.195650,0.776700
0.018250,0.009750,0.197400,0.774600
0.017300,0.010500,0.197850,0.774350
0.017800,0.010650,0.199600,0.771950
0.019300,0.009200,0.201600,0.769900
0.019900,0.009400,0.202650,0.768050
0.020100,0.009100,0.203750,0.767050
0.020150,0.009950,0.204050,0.765850
0.019950,0.010000,0.205850,0.764200
0.019800,0.009450,0.207700,0.763050
0.019350,0.009950,0.209000,0.761700
0.019500,0.009500,0.210700,0.760300
0.020050,0.008850,0.213450,0.757650
0.018800,0.010400,0.215050,0.755750
0.019050,0.010000,0.217100,0.753850
0.018950,0.010350,0.217800,0.752900
0.019350,0.010650,0.218250,0.751750
0.019650,0.010500,0.219750,0.750100
0.019350,0.010750,0.221900,0.748000
0.019450,0.010750,0.222400,0.747400
0.020500,0.010450,0.223850,0.745200
0.021050,0.010350,0.223950,0.744650
0.021000,0.011000,0.224850,0.743150
0.021100,0.011400,0.225850,0.741650
0.021450,0.011950,0.225700,0.740900
0.021550,0.013900,0.224000,0.740550
0.022800,0.013350,0.225800,0.738050
0.023550,0.013700,0.226200,0.736550
0.023450,0.012850,0.227800,0.735900
0.023850,0.013200,0.228850,0.734100
0.024100,0.013950,0.228600,0.733350
0.024750,0.014200,0.228000,0.733050
0.025900,0.014450,0.227300,0.732350
0.026350,0.014950,0.227000,0.731700
0.027050,0.015750,0.226000,0.731200
0.026900,0.016850,0.225250,0.731000
0.028350,0.016650,0.224150,0.730850
0.028800,0.016500,0.223600,0.731100
0.030750,0.016100,0.223850,0.729300
0.030600,0.017800,0.223000,0.728600
0.031650,0.018500,0.221250,0.728600
0.032050,0.019500,0.219150,0.729300
0.032800,0.018850,0.218200,0.730150
0.034200,0.018800,0.217700,0.729300
0.035700,0.018550,0.216800,0.728950
0.035100,0.018850,0.215450,0.730600
0.034600,0.020900,0.213150,0.731350
0.036150,0.021050,0.210900,0.731900
0.037050,0.021050,0.209200,0.732700
0.039500,0.021250,0.206550,0.732700
0.040150,0.021000,0.204300,0.734550
0.041700,0.021050,0.202150,0.735100
0.042750,0.020600,0.201200,0.735450
0.042200,0.021850,0.198700,0.737250
0.043350,0.021250,0.197200,0.738200
0.043550,0.020650,0.196000,0.739800
0.043850,0.021600,0.193600,0.740950
0.043750,0.021700,0.191900,0.742650
0.044650,0.021300,0.189550,0.744500
0.044200,0.022250,0.187400,0.746150
0.043500,0.022100,0.186000,0.748400
0.043800,0.022150,0.184150,0.749900
0.044550,0.022950,0.182350,0.750150
0.044900,0.022950,0.180800,0.751350
0.046200,0.022600,0.179000,0.752200
0.047000,0.023000,0.176450,0.753550
0.046800,0.023400,0.174950,0.754850
0.048400,0.022200,0.174250,0.755150
0.048450,0.021450,0.173700,0.756400
0.048200,0.021300,0.171550,0.758950
0.046950,0.022200,0.169600,0.761250
0.047400,0.021700,0.168550,0.762350
0.046650,0.021050,0.167000,0.765300
0.046450,0.021350,0.165550,0.766650
0.047000,0.021750,0.163950,0.767300
0.046750,0.020500,0.164500,0.768250
0.044900,0.021100,0.164500,0.769500
0.044400,0.020800,0.163800,0.771000
0.044600,0.020400,0.162700,0.772300
0.044300,0.020350,0.161650,0.773700
0.043800,0.020000,0.162450,0.773750
0.043450,0.019600,0.162750,0.774200
0.043150,0.019150,0.162950,0.774750
0.041850,0.020150,0.161900,0.776100
0.041200,0.019250,0.161150,0.778400
0.040900,0.017750,0.161500,0.779850
0.040150,0.018400,0.161700,0.779750
0.039000,0.019000,0.160650,0.781350
0.038850,0.018450,0.161600,0.781100
0.038700,0.017300,0.162300,0.781700
0.037250,0.018400,0.161350,0.783000
0.038200,0.018150,0.161050,0.782600
0.038800,0.017100,0.161700,0.782400
0.037800,0.016950,0.163000,0.782250
0.037600,0.016800,0.161950,0.783650
0.037050,0.016900,0.162000,0.784050
0.036450,0.017300,0.162050,0.784200
0.036050,0.016850,0.164900,0.782200
0.036250,0.015950,0.166650,0.781150
0.036000,0.016550,0.166850,0.780600
0.035600,0.016300,0.167600,0.780500
0.036600,0.015800,0.168600,0.779000
0.035800,0.015700,0.169250,0.779250
0.034800,0.016000,0.170600,0.778600
0.033500,0.016850,0.170750,0.778900
0.034250,0.016200,0.171300,0.778250
0.033100,0.016300,0.171100,0.779500
0.033700,0.016150,0.170750,0.779400
0.033800,0.016350,0.170800,0.779050
0.034400,0.015800,0.171400,0.778400
0.034050,0.015200,0.172500,0.778250
0.033950,0.015350,0.173650,0.777050
0.033550,0.015550,0.173650,0.777250
0.032700,0.015900,0.174500,0.776900
0.032850,0.015400,0.175550,0.776200
0.032100,0.015500,0.174950,0.777450
0.032000,0.015300,0.175350,0.777350
0.030650,0.015000,0.176900,0.777450
0.029900,0.015900,0.177950,0.776250
0.030450,0.015200,0.179150,0.775200
0.030900,0.015350,0.179050,0.774700
0.031000,0.015250,0.178950,0.774800
0.031050,0.014200,0.180250,0.774500
0.031600,0.013600,0.180850,0.773950
0.031800,0.013250,0.182450,0.772500
0.031400,0.012250,0.183500,0.772850
0.029950,0.013450,0.183400,0.773200
0.029950,0.014550,0.184000,0.771500
0.030050,0.015100,0.184400,0.770450
0.031300,0.014150,0.185850,0.768700
0.031350,0.015600,0.184900,0.768150
0.030550,0.015000,0.186100,0.768350
0.030600,0.015350,0.186850,0.767200
0.030050,0.016100,0.187050,0.766800
0.029850,0.016500,0.187450,0.766200
0.029450,0.017100,0.187000,0.766450
0.030000,0.015850,0.187850,0.766300
0.030200,0.015500,0.189350,0.764950
0.031950,0.015600,0.189000,0.763450
0.032700,0.015150,0.189800,0.762350
0.033800,0.015300,0.189750,0.761150
0.033750,0.015550,0.189850,0.760850
0.032300,0.016550,0.190350,0.760800
0.032450,0.016000,0.191250,0.760300
0.032550,0.015250,0.192200,0.760000
0.032200,0.016250,0.191650,0.759900
0.032350,0.016600,0.192050,0.759000
0.033100,0.017000,0.191950,0.757950
0.033200,0.017150,0.192400,0.757250
0.034450,0.016250,0.191600,0.757700
0.034250,0.016250,0.191450,0.758050
0.033400,0.016850,0.191600,0.758150
0.033200,0.016850,0.191650,0.758300
0.033050,0.016650,0.191900,0.758400
0.033600,0.016800,0.191750,0.757850
0.033300,0.016650,0.192150,0.757900
0.033000,0.017650,0.191450,0.757900
0.031850,0.017300,0.191650,0.759200
0.032800,0.016550,0.191600,0.759050
0.033800,0.015800,0.191800,0.758600
0.033800,0.015350,0.192800,0.758050
0.034200,0.016250,0.191100,0.758450
0.033350,0.016850,0.191600,0.758200
0.032900,0.016600,0.192700,0.757800
0.032550,0.016500,0.193550,0.757400
0.032550,0.016650,0.193100,0.757700
0.033650,0.016550,0.193200,0.756600
0.034350,0.017700,0.191800,0.756150
0.033650,0.018800,0.192600,0.754950
0.035150,0.017850,0.192200,0.754800
0.037050,0.016850,0.192650,0.753450
0.036250,0.018400,0.190200,0.755150
0.036200,0.018150,0.190500,0.755150
0.036850,0.018100,0.189000,0.756050
0.037750,0.017400,0.188300,0.756550
0.038250,0.016400,0.188250,0.757100
0.038050,0.018450,0.186500,0.757000
0.037800,0.018450,0.185300,0.758450
0.037200,0.019750,0.184500,0.758550
0.037200,0.019850,0.183800,0.759150
0.037100,0.019600,0.183000,0.760300
0.037150,0.018950,0.182900,0.761000
0.036450,0.018250,0.182900,0.762400
0.036350,0.018350,0.182200,0.763100
0.035800,0.017400,0.183450,0.763350
0.036500,0.017800,0.182600,0.763100
0.037300,0.016800,0.183000,0.762900
0.036500,0.017950,0.181600,0.763950
0.035850,0.018900,0.180550,0.764700
0.036800,0.017950,0.180800,0.764450
0.036900,0.018500,0.180500,0.764100
0.037450,0.017400,0.179550,0.765600
0.037900,0.017300,0.178750,0.766050
0.037350,0.017050,0.178250,0.767350
0.036700,0.017000,0.178650,0.767650
0.035150,0.017800,0.178000,0.769050
0.036100,0.016850,0.178350,0.768700
0.035050,0.017100,0.177800,0.770050
0.035100,0.017900,0.177500,0.769500
0.035350,0.017300,0.177000,0.770350
0.036200,0.016200,0.178000,0.769600
0.036500,0.016200,0.178100,0.769200
0.036300,0.015800,0.177450,0.770450
0.036050,0.016700,0.177300,0.769950
0.036100,0.016250,0.177050,0.770600
0.036100,0.016450,0.176850,0.770600
0.036650,0.016950,0.176000,0.770400
0.036700,0.017400,0.175950,0.769950
0.036400,0.016950,0.177300,0.769350
0.036950,0.016350,0.177200,0.769500
0.037950,0.015100,0.178250,0.768700
0.037850,0.015700,0.177700,0.768750
0.037100,0.015600,0.177700,0.769600
0.035450,0.016900,0.177100,0.770550
0.034100,0.017500,0.176400,0.772000
0.034500,0.017050,0.177550,0.770900
0.035250,0.015700,0.178300,0.770750
0.034800,0.016900,0.177150,0.771150
0.033550,0.016750,0.177650,0.772050
0.032550,0.016300,0.177900,0.773250
0.033300,0.016800,0.176850,0.773050
0.033300,0.016700,0.176900,0.773100
0.034000,0.015800,0.177500,0.772700
0.034200,0.015900,0.178200,0.771700
0.033550,0.017200,0.177850,0.771400
0.033800,0.016000,0.178450,0.771750
0.033400,0.015250,0.180000,0.771350
0.033450,0.016400,0.179400,0.770750
0.033250,0.016300,0.178850,0.771600
0.032850,0.015750,0.179900,0.771500
0.033250,0.015600,0.179800,0.771350
0.033250,0.016350,0.180250,0.770150
0.032850,0.016050,0.180750,0.770350
0.033200,0.016900,0.180800,0.769100
0.033200,0.016900,0.181250,0.768650
0.034500,0.015550,0.180600,0.769350
0.034250,0.016000,0.180950,0.768800
0.034050,0.015250,0.181300,0.769400
0.032900,0.016450,0.179700,0.770950
0.033500,0.016400,0.179600,0.770500
0.033350,0.016900,0.178900,0.770850
0.033250,0.017100,0.179200,0.770450
0.033050,0.015800,0.180550,0.770600
0.033050,0.016550,0.179750,0.770650
0.031750,0.016400,0.180600,0.771250
0.031600,0.016150,0.182000,0.770250
0.032750,0.015550,0.181300,0.770400
0.032700,0.015750,0.180100,0.771450
0.032150,0.015950,0.179950,0.771950
0.033150,0.015900,0.179950,0.771000
0.031400,0.016650,0.179450,0.772500
0.030650,0.016700,0.180300,0.772350
0.031750,0.015950,0.180500,0.771800
0.030950,0.016300,0.180900,0.771850
0.031300,0.014500,0.181800,0.772400
0.030750,0.015550,0.181750,0.771950
0.032050,0.014700,0.181850,0.771400
0.031150,0.015500,0.181250,0.772100
0.030550,0.015200,0.182000,0.772250
0.030250,0.014950,0.183350,0.771450
0.029150,0.014750,0.184800,0.771300
0.028400,0.015400,0.185150,0.771050
0.028950,0.016300,0.185750,0.769000
0.029100,0.016850,0.184500,0.769550
0.029800,0.016100,0.184450,0.769650
0.030050,0.016300,0.184400,0.769250
0.030800,0.016050,0.184550,0.768600
0.030050,0.016450,0.185250,0.768250
0.030300,0.017100,0.184900,0.767700
0.030350,0.015950,0.185100,0.768600
0.031300,0.015450,0.185850,0.767400
0.030350,0.015100,0.186750,0.767800
0.030100,0.014750,0.186450,0.768700
0.030750,0.014600,0.186400,0.768250
0.030700,0.015450,0.187250,0.766600
0.031400,0.016900,0.185950,0.765750
0.031550,0.016800,0.186400,0.765250
0.031850,0.016550,0.185650,0.765950
0.032200,0.016600,0.185800,0.765400
0.032650,0.015900,0.186900,0.764550
0.034050,0.015650,0.186600,0.763700
0.034250,0.014550,0.187900,0.763300
0.033650,0.014450,0.188500,0.763400
0.032950,0.015850,0.188150,0.763050
0.032700,0.015650,0.189350,0.762300
0.032750,0.015350,0.190250,0.761650
0.031550,0.016500,0.190300,0.761650
0.032500,0.016200,0.190600,0.760700
0.032600,0.016450,0.190700,0.760250
0.032550,0.016650,0.190300,0.760500
0.032550,0.016250,0.191200,0.760000
0.032000,0.017050,0.191150,0.759800
0.032700,0.016550,0.191450,0.759300
0.032850,0.015450,0.192700,0.759000
0.033200,0.014950,0.194000,0.757850
0.033350,0.016300,0.193850,0.756500
0.032800,0.017350,0.192850,0.757000
0.033600,0.016900,0.193900,0.755600
0.033100,0.017600,0.193550,0.755750
0.033600,0.017850,0.193150,0.755400
0.033700,0.018600,0.192250,0.755450
0.034300,0.017400,0.192350,0.755950
0.034800,0.017300,0.193000,0.754900
0.035200,0.017150,0.192100,0.755550
0.035450,0.018850,0.190700,0.755000
0.034800,0.019050,0.191550,0.754600
0.035300,0.019450,0.190700,0.754550
0.036850,0.019250,0.189500,0.754400
0.037500,0.018850,0.189300,0.754350
0.036700,0.020150,0.188000,0.755150
0.037450,0.019750,0.188200,0.754600
0.038600,0.019250,0.188150,0.754000
0.037450,0.019050,0.188100,0.755400
0.037650,0.020650,0.186900,0.754800
0.038450,0.019500,0.186850,0.755200
0.038250,0.020250,0.186200,0.755300
0.038650,0.020850,0.185150,0.755350
0.038500,0.021400,0.184050,0.756050
0.039000,0.021700,0.183600,0.755700
0.039600,0.021050,0.183900,0.755450
0.041350,0.020750,0.182850,0.755050
0.041850,0.020350,0.182100,0.755700
0.041750,0.019600,0.181750,0.756900
0.041250,0.020250,0.181200,0.757300
0.041300,0.021350,0.179500,0.757850
0.041650,0.021350,0.178800,0.758200
0.041850,0.021850,0.177450,0.758850
0.042450,0.020600,0.176650,0.760300
0.042500,0.020400,0.176050,0.761050
0.041750,0.020850,0.174900,0.762500
0.041450,0.019950,0.174850,0.763750
0.041350,0.020450,0.173650,0.764550
0.040350,0.022200,0.172050,0.765400
0.040150,0.022000,0.171100,0.766750
0.040650,0.021200,0.171750,0.766400
0.040450,0.020650,0.172150,0.766750
0.041150,0.019000,0.173800,0.766050
0.041200,0.018950,0.173100,0.766750
0.041100,0.018200,0.172950,0.767750
0.040500,0.018350,0.172950,0.768200
0.039250,0.017700,0.174900,0.768150
0.039600,0.017000,0.176500,0.766900
0.039700,0.017000,0.175700,0.767600
0.039200,0.017800,0.174750,0.768250
0.039300,0.018150,0.174650,0.767900
0.038950,0.017200,0.175000,0.768850
0.039150,0.017450,0.174450,0.768950
0.039050,0.017750,0.174850,0.768350
0.038600,0.018100,0.175400,0.767900
0.038700,0.017650,0.176500,0.767150
0.038000,0.017800,0.177600,0.766600
0.038600,0.017200,0.177650,0.766550
0.038300,0.016950,0.176600,0.768150
0.036950,0.017250,0.178050,0.767750
0.036050,0.016600,0.178850,0.768500
0.036600,0.017150,0.179050,0.767200
0.037550,0.016600,0.178950,0.766900
0.036200,0.018350,0.177050,0.768400
0.035800,0.018950,0.177700,0.767550
0.036000,0.018950,0.177650,0.767400
0.037000,0.017900,0.178450,0.766650
0.037750,0.018000,0.178250,0.766000
0.039100,0.017450,0.177450,0.766000
0.038550,0.017050,0.178200,0.766200
0.037400,0.017150,0.178200,0.767250
0.037350,0.016750,0.178900,0.767000
0.036550,0.017400,0.179200,0.766850
0.035400,0.018600,0.178600,0.767400
0.036800,0.017100,0.179800,0.766300
0.037400,0.016600,0.180450,0.765550
0.038000,0.015350,0.180250,0.766400
0.037550,0.017950,0.178300,0.766200
0.037450,0.018250,0.178600,0.765700
0.037400,0.019150,0.178200,0.765250
0.037550,0.019750,0.177900,0.764800
0.037300,0.019700,0.177350,0.765650
0.037750,0.019200,0.176950,0.766100
0.037900,0.018950,0.176300,0.766850
0.038850,0.017950,0.176400,0.766800
0.038600,0.018900,0.175350,0.767150
0.038250,0.018800,0.175000,0.767950
0.036150,0.019600,0.173900,0.770350
0.037100,0.018250,0.173950,0.770700
0.037950,0.016750,0.174750,0.770550
0.038250,0.016450,0.174850,0.770450
0.037900,0.017550,0.175000,0.769550
0.038900,0.017800,0.174800,0.768500
0.037950,0.017200,0.174300,0.770550
0.037650,0.016450,0.175600,0.770300
0.036750,0.017200,0.175350,0.770700
0.037300,0.017600,0.174950,0.770150
0.038400,0.017100,0.174600,0.769900
0.037750,0.017200,0.174150,0.770900
0.037650,0.016900,0.174250,0.771200
0.037150,0.016650,0.176150,0.770050
0.035950,0.017300,0.175550,0.771200
0.035900,0.017450,0.175300,0.771350
0.035100,0.017600,0.176000,0.771300
0.036050,0.016650,0.176800,0.770500
0.035300,0.016550,0.177300,0.770850
0.034550,0.016950,0.178250,0.770250
0.034250,0.016500,0.179950,0.769300
0.033300,0.016850,0.181100,0.768750
0.032900,0.016850,0.182100,0.768150
0.032350,0.017000,0.182150,0.768500
0.033450,0.016250,0.183000,0.767300
0.032900,0.016800,0.183250,0.767050
0.033350,0.016900,0.183700,0.766050
0.033350,0.017200,0.183550,0.765900
0.032550,0.018150,0.182900,0.766400
0.033600,0.017850,0.183450,0.765100
0.033700,0.017600,0.183200,0.765500
0.033650,0.018150,0.182600,0.765600
0.033100,0.018200,0.182650,0.766050
0.034150,0.017850,0.181700,0.766300
0.035550,0.017250,0.181500,0.765700
0.035350,0.017150,0.182150,0.765350
0.036600,0.016050,0.182200,0.765150
0.035400,0.017900,0.181300,0.765400
0.034900,0.018400,0.180850,0.765850
0.033650,0.019050,0.180550,0.766750
0.035150,0.017150,0.181900,0.765800
0.035600,0.017350,0.181450,0.765600
0.034750,0.017650,0.181000,0.766600
0.035850,0.016950,0.181750,0.765450
0.035750,0.017300,0.181600,0.765350
0.035050,0.018700,0.181250,0.765000
0.036050,0.018000,0.181450,0.764500
0.036050,0.018000,0.182150,0.763800
0.036300,0.017150,0.182750,0.763800
0.036800,0.015950,0.183900,0.763350
0.037450,0.016700,0.183600,0.762250
0.037800,0.016550,0.183400,0.762250
0.036900,0.017100,0.182850,0.763150
0.037100,0.016700,0.182850,0.763350
0.037100,0.016400,0.183350,0.763150
0.036450,0.017450,0.182850,0.763250
0.037300,0.018250,0.181650,0.762800
0.038050,0.018300,0.181450,0.762200
0.037800,0.017750,0.180900,0.763550
0.039200,0.016900,0.181350,0.762550
