I,E,S,R
0.001000,0.000600,0.998400,0.000000
0.001050,0.001400,0.997450,0.000100
0.001250,0.001950,0.996650,0.000150
0.001500,0.002600,0.995600,0.000300
0.002250,0.003250,0.993900,0.000600
0.002750,0.004050,0.992200,0.001000
0.003500,0.005500,0.989450,0.001550
0.004300,0.006950,0.986550,0.002200
0.005150,0.009350,0.982600,0.002900
0.007750,0.012100,0.976700,0.003450
0.010800,0.015300,0.969450,0.004450
0.013100,0.021650,0.959600,0.005650
0.017750,0.028500,0.946700,0.007050
0.022600,0.038450,0.929750,0.009200
0.031000,0.046500,0.910350,0.012150
0.040200,0.059050,0.883900,0.016850
0.051450,0.074650,0.851400,0.022500
0.065500,0.093050,0.811750,0.029700
0.081400,0.112050,0.767700,0.038850
0.103700,0.133700,0.714200,0.048400
0.126100,0.156300,0.653850,0.063750
0.154400,0.177400,0.587750,0.080450
0.185450,0.199200,0.513800,0.101550
0.217300,0.213550,0.442150,0.127000
0.248450,0.226400,0.370800,0.154350
0.279100,0.231600,0.301650,0.187650
0.307800,0.226900,0.241700,0.223600
0.334000,0.213300,0.189750,0.262950
0.347750,0.198250,0.144950,0.309050
0.357450,0.173950,0.111700,0.356900
0.357500,0.153050,0.086050,0.403400
0.351250,0.131900,0.065950,0.450900
0.341200,0.108650,0.051950,0.498200
0.326700,0.088900,0.042000,0.542400
0.308250,0.072550,0.033700,0.585500
0.286750,0.059000,0.029500,0.624750
0.261650,0.048000,0.026750,0.663600
0.237950,0.039200,0.024700,0.698150
0.218850,0.032100,0.023100,0.725950
0.199300,0.026000,0.021250,0.753450
0.179350,0.022000,0.019750,0.778900
0.159600,0.018700,0.019800,0.801900
0.144000,0.015900,0.020250,0.819850
0.130200,0.013200,0.021200,0.835400
0.118150,0.010150,0.022300,0.849400
0.103500,0.010050,0.023000,0.863450
0.091250,0.009550,0.023850,0.875350
0.082050,0.008250,0.025750,0.883950
0.071950,0.007250,0.027650,0.893150
0.064750,0.005750,0.029700,0.899800
0.057650,0.005350,0.031650,0.905350
0.050400,0.005450,0.033500,0.910650
0.046150,0.004250,0.036250,0.913350
0.040800,0.004050,0.038950,0.916200
0.036400,0.003900,0.040350,0.919350
0.032950,0.003700,0.041750,0.921600
0.029950,0.003900,0.043700,0.922450
0.026350,0.004000,0.045750,0.923900
0.023850,0.003500,0.047700,0.924950
0.020750,0.003300,0.050300,0.925650
0.018800,0.002950,0.052750,0.925500
0.016900,0.003000,0.055850,0.924250
0.015050,0.002900,0.058750,0.923300
0.013750,0.002800,0.061200,0.922250
0.013050,0.002300,0.063950,0.920700
0.011350,0.002000,0.066600,0.920050
0.010200,0.001750,0.069550,0.918500
0.009600,0.001700,0.071950,0.916750
0.008700,0.002300,0.075000,0.914000
0.008050,0.001700,0.077900,0.912350
0.007300,0.001500,0.080300,0.910900
0.007150,0.001650,0.082950,0.908250
0.006350,0.001550,0.085300,0.906800
0.005800,0.001650,0.087650,0.904900
0.005700,0.001600,0.090100,0.902600
0.005300,0.001450,0.092650,0.900600
0.004850,0.001500,0.095950,0.897700
0.004600,0.001400,0.099500,0.894500
0.004100,0.001150,0.102550,0.892200
0.004000,0.001400,0.104550,0.890050
0.003800,0.001650,0.106800,0.887750
0.003950,0.001450,0.109500,0.885100
0.003700,0.001450,0.112750,0.882100
0.003700,0.001150,0.114450,0.880700
0.003700,0.001150,0.116800,0.878350
0.003450,0.001100,0.118900,0.876550
0.003100,0.001450,0.121350,0.874100
0.002650,0.001400,0.123350,0.872600
0.002600,0.001200,0.125600,0.870600
0.002300,0.001300,0.128550,0.867850
0.002400,0.001150,0.130850,0.865600
0.002400,0.000900,0.133900,0.862800
0.002400,0.000700,0.136100,0.860800
0.002500,0.000750,0.137900,0.858850
0.002400,0.000900,0.140300,0.856400
0.002000,0.000950,0.142650,0.854400
0.001950,0.000950,0.145300,0.851800
0.001850,0.000900,0.147350,0.849900
0.001950,0.000700,0.150200,0.847150
0.001950,0.000550,0.152650,0.844850
0.002050,0.000550,0.155300,0.842100
0.001950,0.000750,0.156900,0.840400
0.001950,0.000700,0.159300,0.838050
0.001800,0.000650,0.161700,0.835850
0.001600,0.001000,0.163850,0.833550
0.001650,0.001150,0.166150,0.831050
0.001600,0.001050,0.168650,0.828700
0.001650,0.000950,0.171250,0.826150
0.001550,0.000950,0.173450,0.824050
0.001600,0.000900,0.176250,0.821250
0.001850,0.000650,0.179200,0.818300
0.001900,0.000600,0.181250,0.816250
0.001750,0.000700,0.183250,0.814300
0.001800,0.001050,0.184650,0.812500
0.001700,0.000900,0.187000,0.810400
0.001750,0.000850,0.189050,0.808350
0.001800,0.001050,0.191500,0.805650
0.001700,0.001050,0.194200,0.803050
0.001700,0.000850,0.196450,0.801000
0.001550,0.000950,0.198400,0.799100
0.001550,0.001150,0.200550,0.796750
0.001650,0.000900,0.203100,0.794350
0.001600,0.001150,0.204550,0.792700
0.001850,0.001500,0.206650,0.790000
0.001950,0.001200,0.208850,0.788000
0.001850,0.001000,0.211500,0.785650
0.001600,0.001100,0.213950,0.783350
0.001700,0.000950,0.216550,0.780800
0.001550,0.001100,0.218550,0.778800
0.001700,0.001200,0.220800,0.776300
0.001700,0.001350,0.222550,0.774400
0.001950,0.000950,0.224800,0.772300
0.001750,0.001050,0.226950,0.770250
0.001850,0.001150,0.229150,0.767850
0.001700,0.001300,0.230350,0.766650
0.002100,0.001050,0.232050,0.764800
0.002000,0.001150,0.234400,0.762450
0.002250,0.001150,0.236350,0.760250
0.002250,0.000850,0.238100,0.758800
0.002400,0.001150,0.240250,0.756200
0.002450,0.001500,0.241300,0.754750
0.002450,0.001650,0.243150,0.752750
0.002300,0.001900,0.244950,0.750850
0.002600,0.001850,0.246500,0.749050
0.002950,0.001800,0.247650,0.747600
0.002950,0.002350,0.248150,0.746550
0.003250,0.002000,0.249700,0.745050
0.003550,0.001950,0.251200,0.743300
0.003800,0.001900,0.252350,0.741950
0.003700,0.002200,0.253800,0.740300
0.003550,0.002250,0.255650,0.738550
0.003750,0.002350,0.256950,0.736950
0.003950,0.002400,0.258700,0.734950
0.004500,0.002600,0.259250,0.733650
0.004400,0.002450,0.260600,0.732550
0.004550,0.003400,0.261350,0.730700
0.005000,0.003100,0.262400,0.729500
0.005450,0.003050,0.263950,0.727550
0.005450,0.002950,0.265050,0.726550
0.005100,0.003150,0.266950,0.724800
0.005050,0.003800,0.267750,0.723400
0.004950,0.003950,0.269150,0.721950
0.005400,0.003650,0.270700,0.720250
0.005400,0.003900,0.272100,0.718600
0.005750,0.004550,0.273250,0.716450
0.006100,0.004500,0.273850,0.715550
0.006500,0.004650,0.274750,0.714100
0.007650,0.004300,0.275200,0.712850
0.008600,0.005300,0.274400,0.711700
0.008350,0.005750,0.274500,0.711400
0.008650,0.006100,0.274400,0.710850
0.009350,0.006350,0.274250,0.710050
0.009900,0.006600,0.274400,0.709100
0.010450,0.006750,0.274900,0.707900
0.011150,0.007300,0.274550,0.707000
0.012150,0.007550,0.274250,0.706050
0.012500,0.007950,0.274800,0.704750
0.013050,0.007850,0.274900,0.704200
0.013800,0.007700,0.274450,0.704050
0.014350,0.008700,0.273050,0.703900
0.014500,0.009350,0.272650,0.703500
0.014450,0.010450,0.270550,0.704550
0.015800,0.009800,0.270050,0.704350
0.016100,0.010800,0.269650,0.703450
0.015950,0.011800,0.268500,0.703750
0.017050,0.011450,0.267650,0.703850
0.017900,0.012300,0.265900,0.703900
0.018350,0.012750,0.264450,0.704450
0.019650,0.012350,0.264050,0.703950
0.020700,0.012250,0.263000,0.704050
0.021350,0.012600,0.261350,0.704700
0.022200,0.013300,0.259300,0.705200
0.023650,0.013000,0.257500,0.705850
0.024400,0.015100,0.253800,0.706700
0.025600,0.015450,0.251650,0.707300
0.027150,0.015750,0.249250,0.707850
0.027600,0.015950,0.247200,0.709250
0.029450,0.016550,0.244750,0.709250
0.030950,0.017100,0.241500,0.710450
0.031700,0.018700,0.237200,0.712400
0.032700,0.018800,0.233750,0.714750
0.033950,0.019800,0.230400,0.715850
0.034800,0.020200,0.227500,0.717500
0.034250,0.020100,0.224700,0.720950
0.035200,0.020450,0.221300,0.723050
0.036500,0.020150,0.218900,0.724450
0.037900,0.020350,0.215000,0.726750
0.038950,0.020250,0.211800,0.729000
0.038600,0.021300,0.207850,0.732250
0.038850,0.021700,0.204550,0.734900
0.038850,0.020950,0.202450,0.737750
0.040400,0.020900,0.198500,0.740200
0.040550,0.021800,0.193850,0.743800
0.039800,0.022200,0.190850,0.747150
0.041400,0.022050,0.188500,0.748050
0.041900,0.022200,0.185350,0.750550
0.042450,0.022500,0.182350,0.752700
0.042150,0.022400,0.178750,0.756700
0.044100,0.020050,0.177050,0.758800
0.043000,0.020750,0.175200,0.761050
0.042250,0.021900,0.171450,0.764400
0.042850,0.021400,0.168900,0.766850
0.043000,0.020900,0.167400,0.768700
0.042050,0.020550,0.165350,0.772050
0.041300,0.020500,0.163800,0.774400
0.042300,0.019150,0.161900,0.776650
0.041750,0.018750,0.160900,0.778600
0.041000,0.018650,0.160450,0.779900
0.040300,0.018200,0.159450,0.782050
0.040250,0.017950,0.158150,0.783650
0.039800,0.018050,0.155900,0.786250
0.039550,0.017650,0.155100,0.787700
0.039300,0.016450,0.154800,0.789450
0.038300,0.016050,0.153950,0.791700
0.037850,0.016300,0.152650,0.793200
0.038150,0.016300,0.151500,0.794050
0.036550,0.015500,0.151050,0.796900
0.036100,0.016700,0.148900,0.798300
0.036650,0.015650,0.148100,0.799600
0.035800,0.014600,0.148050,0.801550
0.034900,0.015000,0.147750,0.802350
0.034800,0.014450,0.148300,0.802450
0.033300,0.014500,0.148250,0.803950
0.033150,0.013750,0.148500,0.804600
0.033300,0.013300,0.149050,0.804350
0.032750,0.013150,0.150050,0.804050
0.030550,0.013550,0.151000,0.804900
0.030800,0.012850,0.151400,0.804950
0.029800,0.013150,0.151850,0.805200
0.029050,0.013000,0.152050,0.805900
0.028900,0.012300,0.153150,0.805650
0.027750,0.012600,0.153850,0.805800
0.027350,0.012750,0.155050,0.804850
0.027300,0.013250,0.155650,0.803800
0.026850,0.013750,0.156300,0.803100
0.027200,0.012800,0.157800,0.802200
0.026000,0.013000,0.159450,0.801550
0.024950,0.012200,0.160700,0.802150
0.026250,0.011250,0.160950,0.801550
0.025700,0.011050,0.162650,0.800600
0.026200,0.010000,0.163650,0.800150
0.025400,0.010900,0.165250,0.798450
0.024650,0.011600,0.165700,0.798050
0.024050,0.011550,0.166450,0.797950
0.023600,0.011100,0.167500,0.797800
0.024150,0.010400,0.168550,0.796900
0.023750,0.010700,0.170950,0.794600
0.023200,0.011050,0.172250,0.793500
0.023600,0.011900,0.172550,0.791950
0.023950,0.011450,0.174050,0.790550
0.024250,0.011000,0.174900,0.789850
0.022750,0.011400,0.176650,0.789200
0.022700,0.011300,0.177350,0.788650
0.023050,0.011600,0.177350,0.788000
0.023850,0.011150,0.178200,0.786800
0.024150,0.010750,0.179850,0.785250
0.025050,0.011150,0.179800,0.784000
0.025000,0.011550,0.180950,0.782500
0.025350,0.011700,0.182650,0.780300
0.025550,0.011850,0.183050,0.779550
0.025450,0.012350,0.182950,0.779250
0.025000,0.012150,0.184050,0.778800
0.024900,0.012450,0.185300,0.777350
0.024450,0.013250,0.185900,0.776400
0.024000,0.013000,0.186800,0.776200
0.023450,0.012650,0.187450,0.776450
0.024400,0.011700,0.188350,0.775550
0.024650,0.011500,0.189600,0.774250
0.024350,0.012200,0.190100,0.773350
0.023750,0.013200,0.189850,0.773200
0.023700,0.013300,0.190650,0.772350
0.023050,0.013650,0.191600,0.771700
0.022750,0.013400,0.192800,0.771050
0.023250,0.013700,0.194150,0.768900
0.022950,0.013450,0.194950,0.768650
0.023700,0.013300,0.195000,0.768000
0.024450,0.012700,0.195000,0.767850
0.024150,0.013550,0.196000,0.766300
0.024250,0.014450,0.196700,0.764600
0.025000,0.014350,0.197650,0.763000
0.025800,0.014100,0.197100,0.763000
0.025300,0.014750,0.197900,0.762050
0.025150,0.014800,0.198250,0.761800
0.025800,0.014150,0.198350,0.761700
0.025750,0.013600,0.199350,0.761300
0.025700,0.014150,0.199950,0.760200
0.026450,0.014050,0.199850,0.759650
0.026950,0.014700,0.198900,0.759450
0.027500,0.015050,0.198150,0.759300
0.027250,0.015900,0.198000,0.758850
0.028600,0.015100,0.197450,0.758850
0.029100,0.014850,0.198000,0.758050
0.029050,0.015650,0.197250,0.758050
0.030000,0.015150,0.197300,0.757550
0.029850,0.015850,0.197200,0.757100
0.029900,0.016250,0.197400,0.756450
0.029950,0.015750,0.198400,0.755900
0.029650,0.014850,0.199700,0.755800
0.030850,0.015150,0.198300,0.755700
0.030500,0.016950,0.196700,0.755850
0.031300,0.016400,0.197300,0.755000
0.031650,0.016400,0.196700,0.755250
0.032300,0.016700,0.196650,0.754350
0.032700,0.017950,0.196200,0.753150
0.034300,0.016850,0.196350,0.752500
0.034900,0.017300,0.194200,0.753600
0.034800,0.017750,0.194200,0.753250
0.035200,0.017250,0.194000,0.753550
0.034400,0.017900,0.193850,0.753850
0.034950,0.018750,0.192250,0.754050
0.035100,0.018200,0.191200,0.755500
0.034750,0.017950,0.192300,0.755000
0.034550,0.017100,0.192950,0.755400
0.034900,0.017200,0.192100,0.755800
0.035600,0.017000,0.191100,0.756300
0.035600,0.017350,0.189050,0.758000
0.034550,0.016750,0.189000,0.759700
0.034450,0.016600,0.188500,0.760450
0.034800,0.017650,0.187150,0.760400
0.035200,0.017150,0.185850,0.761800
0.035700,0.016600,0.185400,0.762300
0.035250,0.018450,0.184700,0.761600
0.035450,0.019550,0.183750,0.761250
0.035650,0.020500,0.181600,0.762250
0.036500,0.019250,0.181700,0.762550
0.036200,0.019350,0.180300,0.764150
0.037000,0.020350,0.178150,0.764500
0.037300,0.019100,0.178450,0.765150
0.036650,0.018900,0.179000,0.765450
0.036000,0.018450,0.178250,0.767300
0.036200,0.018250,0.178200,0.767350
0.036600,0.017350,0.177850,0.768200
0.036050,0.018350,0.177900,0.767700
0.036600,0.018050,0.178650,0.766700
0.036750,0.018450,0.178100,0.766700
0.036700,0.017950,0.178150,0.767200
0.036550,0.017800,0.177350,0.768300
0.036300,0.017000,0.177300,0.769400
0.035500,0.017950,0.177400,0.769150
0.035150,0.018300,0.177300,0.769250
0.035050,0.018200,0.176850,0.769900
0.034650,0.018300,0.177050,0.770000
0.035550,0.016900,0.178150,0.769400
0.035200,0.016450,0.178850,0.769500
0.035650,0.015550,0.179700,0.769100
0.035050,0.016300,0.177900,0.770750
0.035400,0.015950,0.177100,0.771550
0.035150,0.016150,0.177250,0.771450
0.035100,0.016300,0.177150,0.771450
0.034850,0.017050,0.176350,0.771750
0.035400,0.016700,0.175550,0.772350
0.035700,0.016250,0.175800,0.772250
0.034900,0.016950,0.175200,0.772950
0.035900,0.016350,0.175550,0.772200
0.034900,0.016650,0.176300,0.772150
0.034200,0.016350,0.177750,0.771700
0.033050,0.017050,0.178050,0.771850
0.033400,0.017400,0.178600,0.770600
0.033450,0.015800,0.180100,0.770650
0.032800,0.016050,0.180500,0.770650
0.033000,0.015400,0.181500,0.770100
0.031950,0.016550,0.181500,0.770000
0.032950,0.016500,0.181750,0.768800
0.033750,0.015650,0.183150,0.767450
0.032400,0.016450,0.183400,0.767750
0.033350,0.016150,0.183600,0.766900
0.033400,0.015850,0.183750,0.767000
0.033100,0.016100,0.184400,0.766400
0.032400,0.015450,0.184700,0.767450
0.033100,0.015500,0.183900,0.767500
0.032600,0.016250,0.183900,0.767250
0.033300,0.016550,0.183600,0.766550
0.032850,0.016900,0.183600,0.766650
0.032600,0.016650,0.183300,0.767450
0.031700,0.017000,0.183300,0.768000
0.031750,0.016350,0.184000,0.767900
0.032200,0.016400,0.183450,0.767950
0.034100,0.014700,0.183600,0.767600
0.033400,0.014900,0.183600,0.768100
0.032950,0.015050,0.183350,0.768650
0.032700,0.015550,0.183650,0.768100
0.031200,0.016500,0.183400,0.768900
0.031400,0.016300,0.183700,0.768600
0.031350,0.015000,0.184800,0.768850
0.031600,0.014100,0.185450,0.768850
0.031000,0.014300,0.186100,0.768600
0.030600,0.014050,0.187250,0.768100
0.030650,0.014150,0.187100,0.768100
0.031050,0.014300,0.187550,0.767100
0.031700,0.014450,0.188600,0.765250
0.031450,0.015150,0.189150,0.764250
0.032200,0.014900,0.189200,0.763700
0.031900,0.015550,0.188350,0.764200
0.032400,0.016200,0.187300,0.764100
0.032350,0.015150,0.188350,0.764150
0.032250,0.015450,0.187700,0.764600
0.031600,0.015550,0.189000,0.763850
0.032000,0.015100,0.188950,0.763950
0.033550,0.015100,0.188900,0.762450
0.032500,0.015150,0.190150,0.762200
0.032800,0.015200,0.190500,0.761500
0.031600,0.014850,0.191200,0.762350
0.031400,0.014650,0.192150,0.761800
0.031300,0.015800,0.192000,0.760900
0.030500,0.016300,0.191700,0.761500
0.031550,0.016700,0.192400,0.759350
0.031750,0.016900,0.192200,0.759150
0.032050,0.016700,0.192050,0.759200
0.032400,0.017800,0.192000,0.757800
0.033450,0.017900,0.191300,0.757350
0.033750,0.018350,0.190500,0.757400
0.034100,0.018400,0.190250,0.757250
0.034450,0.019150,0.190150,0.756250
0.036050,0.017100,0.189900,0.756950
0.035500,0.018350,0.188100,0.758050
0.035300,0.019400,0.186900,0.758400
0.035250,0.019500,0.186100,0.759150
0.035400,0.018350,0.185850,0.760400
0.036200,0.018200,0.185450,0.760150
0.036550,0.017200,0.186050,0.760200
0.036250,0.017850,0.185150,0.760750
0.036000,0.018200,0.183500,0.762300
0.036350,0.017050,0.183100,0.763500
0.036800,0.017150,0.182550,0.763500
0.036250,0.018850,0.181450,0.763450
0.037500,0.017900,0.181350,0.763250
0.037650,0.018400,0.180700,0.763250
0.038100,0.018300,0.180050,0.763550
0.037900,0.018150,0.179250,0.764700
0.037250,0.019050,0.178050,0.765650
0.038050,0.019050,0.177450,0.765450
0.037350,0.019250,0.177200,0.766200
0.036600,0.019800,0.178200,0.765400
0.037950,0.019050,0.177750,0.765250
0.038850,0.018050,0.177000,0.766100
0.039450,0.018350,0.175800,0.766400
0.039150,0.017550,0.176350,0.766950
0.037700,0.018350,0.175500,0.768450
0.037950,0.017450,0.175650,0.768950
0.037250,0.017400,0.174750,0.770600
0.037900,0.017000,0.174950,0.770150
0.037300,0.017950,0.173750,0.771000
0.035650,0.018900,0.173150,0.772300
0.035950,0.018200,0.173500,0.772350
0.036000,0.018200,0.172600,0.773200
0.035950,0.018000,0.173350,0.772700
0.037050,0.017300,0.173100,0.772550
0.036900,0.017850,0.172350,0.772900
0.037350,0.017800,0.172500,0.772350
0.037300,0.018300,0.171850,0.772550
0.036950,0.018550,0.172650,0.771850
0.037700,0.018350,0.172800,0.771150
0.037600,0.018300,0.172650,0.771450
0.037750,0.017900,0.171800,0.772550
0.037600,0.018300,0.170950,0.773150
0.038300,0.018100,0.169550,0.774050
0.038300,0.018850,0.168300,0.774550
0.038600,0.018050,0.167800,0.775550
0.038800,0.018050,0.168250,0.774900
0.038350,0.018800,0.166800,0.776050
0.038900,0.018800,0.165200,0.777100
0.039100,0.018550,0.164300,0.778050
0.039750,0.018300,0.163550,0.778400
0.039500,0.018000,0.163450,0.779050
0.040100,0.018100,0.162800,0.779000
0.039650,0.018950,0.162700,0.778700
0.039050,0.018400,0.162050,0.780500
0.038100,0.016700,0.163200,0.782000
0.036850,0.016600,0.163600,0.782950
0.036500,0.015900,0.164500,0.783100
0.035400,0.016750,0.165100,0.782750
0.034350,0.016550,0.165600,0.783500
0.033850,0.016150,0.166150,0.783850
0.032900,0.016250,0.166550,0.784300
0.033200,0.015350,0.168050,0.783400
0.033450,0.015500,0.169050,0.782000
0.033900,0.015450,0.170150,0.780500
0.032850,0.016250,0.171000,0.779900
0.033000,0.015600,0.171600,0.779800
0.032400,0.014850,0.173400,0.779350
0.032800,0.014050,0.174400,0.778750
0.032350,0.015150,0.173150,0.779350
0.032500,0.015650,0.173300,0.778550
0.032050,0.015700,0.173850,0.778400
0.031950,0.015350,0.173450,0.779250
0.031250,0.015750,0.173600,0.779400
0.031150,0.015550,0.174100,0.779200
0.030950,0.015250,0.175000,0.778800
0.031250,0.014800,0.174950,0.779000
0.031300,0.015550,0.174900,0.778250
0.032050,0.014400,0.175450,0.778100
0.030950,0.015000,0.175650,0.778400
0.030550,0.014500,0.176600,0.778350
0.030050,0.014050,0.178150,0.777750
0.030100,0.013300,0.179950,0.776650
0.029550,0.013200,0.181750,0.775500
0.028500,0.013750,0.182200,0.775550
0.027900,0.014150,0.182700,0.775250
0.027750,0.014300,0.183550,0.774400
0.027750,0.014850,0.183700,0.773700
0.028200,0.014150,0.184250,0.773400
0.027600,0.013750,0.186200,0.772450
0.026550,0.015450,0.185550,0.772450
0.027200,0.015250,0.185150,0.772400
0.028000,0.014400,0.187400,0.770200
0.028050,0.015400,0.187750,0.768800
0.028400,0.016250,0.187850,0.767500
0.029200,0.015100,0.187850,0.767850
0.029850,0.014350,0.189150,0.766650
0.029850,0.015450,0.189700,0.765000
0.030700,0.014900,0.189350,0.765050
0.029900,0.015300,0.189900,0.764900
0.030700,0.015150,0.190600,0.763550
0.031050,0.015750,0.191100,0.762100
0.031050,0.015850,0.191350,0.761750
0.030050,0.016400,0.191250,0.762300
0.030950,0.016250,0.191900,0.760900
0.031400,0.015400,0.192100,0.761100
0.031500,0.016450,0.191350,0.760700
0.031750,0.017600,0.189800,0.760850
0.032350,0.018200,0.189850,0.759600
0.033350,0.017300,0.190700,0.758650
0.033500,0.017750,0.190500,0.758250
0.033550,0.017700,0.190500,0.758250
0.034200,0.017250,0.190550,0.758000
0.034400,0.017250,0.189700,0.758650
0.033200,0.018600,0.189600,0.758600
0.033850,0.018100,0.190000,0.758050
0.035950,0.017600,0.188450,0.758000
0.035000,0.018650,0.189000,0.757350
0.035150,0.017650,0.188900,0.758300
0.036300,0.016600,0.189150,0.757950
0.036350,0.016650,0.189050,0.757950
0.035800,0.018100,0.187100,0.759000
0.035850,0.017650,0.187200,0.759300
0.036400,0.017400,0.188050,0.758150
0.035200,0.018300,0.187500,0.759000
0.035350,0.017500,0.188700,0.758450
0.034750,0.018450,0.188650,0.758150
0.035500,0.018250,0.188150,0.758100
0.034850,0.018850,0.187100,0.759200
0.035800,0.018600,0.186950,0.758650
0.037350,0.018300,0.186450,0.757900
0.037100,0.019000,0.186200,0.757700
0.036750,0.018600,0.186600,0.758050
0.036000,0.018300,0.187650,0.758050
0.037400,0.017900,0.188400,0.756300
0.037050,0.017700,0.188900,0.756350
0.037000,0.017750,0.188250,0.757000
0.038250,0.018250,0.187800,0.755700
0.037600,0.018650,0.188100,0.755650
0.037650,0.019050,0.187350,0.755950
0.038150,0.017850,0.186450,0.757550
0.037050,0.018850,0.186250,0.757850
0.036300,0.019450,0.185550,0.758700
0.037500,0.018600,0.185200,0.758700
0.037650,0.018450,0.185100,0.758800
0.038200,0.018800,0.184850,0.758150
0.036650,0.018800,0.185700,0.758850
0.037300,0.018050,0.185200,0.759450
0.035850,0.018850,0.184350,0.760950
0.037600,0.017400,0.184600,0.760400
0.038350,0.018200,0.183700,0.759750
0.038400,0.017100,0.184450,0.760050
0.038850,0.016700,0.183900,0.760550
0.038800,0.017000,0.184550,0.759650
0.038750,0.018000,0.183200,0.760050
0.038000,0.019700,0.182450,0.759850
0.038400,0.018900,0.181900,0.760800
0.037950,0.019550,0.180850,0.761650
0.038650,0.018700,0.181100,0.761550
0.037650,0.019050,0.180000,0.763300
0.037950,0.018550,0.180350,0.763150
0.039150,0.018050,0.180000,0.762800
0.038750,0.017600,0.180150,0.763500
0.037400,0.018200,0.180050,0.764350
0.036550,0.017400,0.181650,0.764400
0.035950,0.017800,0.181300,0.764950
0.036250,0.018250,0.180350,0.765150
0.035650,0.018300,0.180800,0.765250
0.036650,0.018700,0.179700,0.764950
0.036300,0.018550,0.179650,0.765500
0.035950,0.019200,0.178600,0.766250
0.036550,0.018500,0.179150,0.765800
0.037000,0.018750,0.179150,0.765100
0.036750,0.019050,0.178550,0.765650
0.036900,0.019450,0.177950,0.765700
0.037250,0.018300,0.178100,0.766350
0.037850,0.017650,0.177250,0.767250
0.037250,0.017150,0.178050,0.767550
0.036150,0.017600,0.177250,0.769000
0.036500,0.017700,0.177650,0.768150
0.036200,0.017550,0.178200,0.768050
0.035400,0.016450,0.178700,0.769450
0.035700,0.017050,0.178100,0.769150
0.036050,0.015850,0.179350,0.768750
0.035300,0.016700,0.178850,0.769150
0.035350,0.015850,0.179700,0.769100
0.035650,0.014900,0.180950,0.768500
0.034400,0.015200,0.180950,0.769450
0.032300,0.017000,0.179850,0.770850
0.032300,0.016750,0.180950,0.770000
0.033000,0.016000,0.182050,0.768950
0.033000,0.015750,0.183100,0.768150
0.032750,0.016250,0.183400,0.767600
0.033500,0.016100,0.184150,0.766250
0.031450,0.016850,0.184300,0.767400
0.032700,0.015650,0.185700,0.765950
0.033050,0.015100,0.186200,0.765650
0.032950,0.015750,0.187250,0.764050
0.032550,0.016400,0.188900,0.762150
0.032700,0.017600,0.189100,0.760600
0.032850,0.016900,0.189300,0.760950
0.032950,0.017100,0.189650,0.760300
0.031700,0.016850,0.190000,0.761450
0.032750,0.016400,0.190300,0.760550
0.032900,0.016550,0.190150,0.760400
0.033300,0.017050,0.189300,0.760350
0.034600,0.017350,0.189000,0.759050
0.035650,0.017150,0.188350,0.758850
0.035500,0.017750,0.187800,0.758950
0.035500,0.017600,0.187800,0.759100
0.035200,0.017900,0.187950,0.758950
0.035300,0.019050,0.187350,0.758300
0.036700,0.017800,0.187300,0.758200
0.036950,0.018950,0.186700,0.757400
0.037150,0.018950,0.186000,0.757900
0.036100,0.019150,0.184950,0.759800
0.036200,0.019500,0.183600,0.760700
0.036900,0.019950,0.181800,0.761350
0.037600,0.019500,0.180900,0.762000
0.037900,0.018550,0.181650,0.761900
0.038550,0.018650,0.180950,0.761850
0.037850,0.019200,0.180700,0.762250
0.038550,0.018300,0.181150,0.762000
0.037550,0.017850,0.181400,0.763200
0.038150,0.017250,0.181900,0.762700
0.036500,0.017600,0.181650,0.764250
0.035600,0.017300,0.181350,0.765750
0.035650,0.017050,0.181650,0.765650
0.035800,0.016150,0.182450,0.765600
0.035450,0.016450,0.182950,0.765150
0.034350,0.016650,0.182050,0.766950
0.034850,0.017350,0.181450,0.766350
0.035200,0.017550,0.180650,0.766600
0.035800,0.017300,0.180150,0.766750
0.035750,0.017400,0.179950,0.766900
0.035600,0.017500,0.180100,0.766800
0.035700,0.018300,0.179700,0.766300
0.036000,0.017600,0.180650,0.765750
0.036250,0.016600,0.181650,0.765500
0.035350,0.017850,0.180450,0.766350
0.036400,0.017700,0.180050,0.765850
0.036750,0.018500,0.178900,0.765850
0.035850,0.017750,0.178950,0.767450
0.035400,0.017950,0.178900,0.767750
0.036200,0.017200,0.177900,0.768700
0.036500,0.017450,0.178600,0.767450
0.035200,0.017700,0.178750,0.768350
0.034850,0.017850,0.179850,0.767450
0.035000,0.018050,0.179200,0.767750
0.035200,0.017850,0.179800,0.767150
0.035600,0.017350,0.179300,0.767750
0.035550,0.016650,0.179100,0.768700
0.035200,0.016800,0.179200,0.768800
0.035750,0.016850,0.178650,0.768750
0.035050,0.017050,0.178550,0.769350
0.035150,0.016850,0.178650,0.769350
0.035550,0.016800,0.178200,0.769450
0.036300,0.017300,0.178300,0.768100
0.035800,0.017650,0.178900,0.767650
0.035600,0.017700,0.178750,0.767950
0.035800,0.017950,0.179200,0.767050
0.034800,0.017700,0.179400,0.768100
0.034700,0.017150,0.180250,0.767900
0.035000,0.016550,0.180850,0.767600
0.033500,0.016450,0.180900,0.769150
0.033200,0.016400,0.180700,0.769700
0.033300,0.016650,0.180500,0.769550
0.033200,0.017100,0.180600,0.769100
0.033800,0.015600,0.182350,0.768250
0.033550,0.016250,0.181250,0.768950
0.033650,0.016200,0.180950,0.769200
0.033900,0.015750,0.182000,0.768350
0.034600,0.015550,0.181950,0.767900
0.033700,0.016050,0.181800,0.768450
0.033100,0.016650,0.181450,0.768800
0.033400,0.016250,0.181200,0.769150
0.032550,0.016550,0.181000,0.769900
0.032250,0.016750,0.181800,0.769200
0.033300,0.016700,0.181150,0.768850
0.033250,0.017100,0.180700,0.768950
0.033850,0.016650,0.181300,0.768200
0.033750,0.017000,0.181350,0.767900
0.033350,0.017450,0.180600,0.768600
0.033500,0.017600,0.180950,0.767950
0.032800,0.018000,0.180450,0.768750
0.033700,0.017400,0.181900,0.767000
0.034050,0.016750,0.182600,0.766600
0.034600,0.016800,0.181600,0.767000
0.034600,0.016450,0.181450,0.767500
0.033600,0.017700,0.182000,0.766700
0.033350,0.017900,0.182400,0.766350
0.033000,0.016700,0.183200,0.767100
0.033550,0.016900,0.182500,0.767050
0.033800,0.017100,0.183000,0.766100
0.035200,0.016650,0.183450,0.764700
0.034700,0.017300,0.182850,0.765150
0.035900,0.016100,0.183000,0.765000
0.034900,0.017650,0.181750,0.765700
