I,E,S,R
0.001000,0.000700,0.998300,0.000000
0.001100,0.001150,0.997650,0.000100
0.001250,0.001750,0.996750,0.000250
0.001300,0.002350,0.996000,0.000350
0.001600,0.003100,0.994750,0.000550
0.002400,0.003050,0.993700,0.000850
0.003150,0.004350,0.991300,0.001200
0.004000,0.005800,0.988550,0.001650
0.005700,0.007000,0.985150,0.002150
0.006600,0.009800,0.980500,0.003100
0.009150,0.012850,0.974300,0.003700
0.011850,0.017500,0.965900,0.004750
0.015150,0.024350,0.954450,0.006050
0.019400,0.030650,0.941750,0.008200
0.025200,0.038650,0.925400,0.010750
0.033000,0.047750,0.905100,0.014150
0.041700,0.060800,0.878600,0.018900
0.053100,0.077800,0.845050,0.024050
0.067700,0.091800,0.808800,0.031700
0.084350,0.116800,0.758550,0.040300
0.106050,0.138150,0.704900,0.050900
0.129900,0.164000,0.640750,0.065350
0.158400,0.187800,0.570750,0.083050
0.190200,0.209800,0.495700,0.104300
0.221750,0.227550,0.419200,0.131500
0.256700,0.234650,0.348350,0.160300
0.288100,0.235900,0.282550,0.193450
0.319550,0.228900,0.220200,0.231350
0.342000,0.216350,0.167700,0.273950
0.360050,0.193900,0.126800,0.319250
0.371350,0.169550,0.096300,0.362800
0.369650,0.145900,0.072650,0.411800
0.360750,0.124400,0.054100,0.460750
0.345750,0.102750,0.043350,0.508150
0.329050,0.083150,0.035750,0.552050
0.307500,0.066450,0.029500,0.596550
0.284700,0.053650,0.025150,0.636500
0.261500,0.042900,0.022200,0.673400
0.238100,0.034450,0.020450,0.707000
0.217900,0.027450,0.019600,0.735050
0.197050,0.022800,0.019200,0.760950
0.177550,0.018900,0.018600,0.784950
0.159000,0.016100,0.019550,0.805350
0.141800,0.014000,0.020050,0.824150
0.127150,0.011600,0.021200,0.840050
0.113000,0.009950,0.022200,0.854850
0.100500,0.009150,0.022800,0.867550
0.088550,0.008150,0.024250,0.879050
0.079350,0.006800,0.025350,0.888500
0.070100,0.005950,0.027750,0.896200
0.063250,0.005000,0.029950,0.901800
0.056800,0.004750,0.031250,0.907200
0.051200,0.003850,0.034550,0.910400
0.045150,0.004250,0.037400,0.913200
0.039800,0.003500,0.040050,0.916650
0.035700,0.003300,0.042950,0.918050
0.031750,0.003800,0.044850,0.919600
0.028300,0.003600,0.047550,0.920550
0.025000,0.003450,0.050150,0.921400
0.023000,0.003100,0.051850,0.922050
0.020100,0.003400,0.054700,0.921800
0.018350,0.002850,0.057000,0.921800
0.016550,0.002700,0.059100,0.921650
0.015000,0.002550,0.061750,0.920700
0.013700,0.002450,0.063450,0.920400
0.012700,0.002350,0.065200,0.919750
0.011600,0.002450,0.067800,0.918150
0.010800,0.001950,0.070650,0.916600
0.010150,0.002100,0.072550,0.915200
0.009650,0.002250,0.074700,0.913400
0.008650,0.002050,0.078000,0.911300
0.008100,0.001850,0.080150,0.909900
0.007500,0.001900,0.082850,0.907750
0.006850,0.002050,0.086000,0.905100
0.006350,0.001950,0.088600,0.903100
0.005850,0.002050,0.091300,0.900800
0.005550,0.001950,0.093350,0.899150
0.005250,0.002200,0.096150,0.896400
0.005100,0.001950,0.098100,0.894850
0.005150,0.001800,0.100250,0.892800
0.004800,0.001700,0.103000,0.890500
0.004750,0.001550,0.105800,0.887900
0.004550,0.001450,0.108350,0.885650
0.004350,0.001300,0.111000,0.883350
0.004250,0.001300,0.113800,0.880650
0.003950,0.001400,0.115700,0.878950
0.003650,0.001150,0.118400,0.876800
0.003250,0.001050,0.122100,0.873600
0.003050,0.001450,0.124450,0.871050
0.003200,0.001050,0.127050,0.868700
0.003150,0.001050,0.129400,0.866400
0.003150,0.001200,0.131750,0.863900
0.003150,0.000750,0.134950,0.861150
0.003000,0.000800,0.137100,0.859100
0.002900,0.000750,0.139600,0.856750
0.002700,0.000850,0.142000,0.854450
0.002750,0.000750,0.144600,0.851900
0.002500,0.000700,0.147650,0.849150
0.002200,0.000750,0.149450,0.847600
0.002200,0.000800,0.152050,0.844950
0.002000,0.000650,0.154800,0.842550
0.001950,0.000900,0.156550,0.840600
0.001800,0.001150,0.159350,0.837700
0.001750,0.001100,0.161650,0.835500
0.001950,0.000900,0.163900,0.833250
0.001950,0.000650,0.166700,0.830700
0.001700,0.000700,0.169350,0.828250
0.001500,0.000700,0.171750,0.826050
0.001450,0.000750,0.174200,0.823600
0.001600,0.000700,0.177250,0.820450
0.001650,0.000750,0.179050,0.818550
0.001650,0.000800,0.181650,0.815900
0.001550,0.000750,0.184000,0.813700
0.001550,0.000600,0.186350,0.811500
0.001700,0.000750,0.188550,0.809000
0.001850,0.000900,0.190800,0.806450
0.001850,0.001100,0.192600,0.804450
0.002000,0.000900,0.194750,0.802350
0.002000,0.000950,0.197550,0.799500
0.002050,0.000950,0.199300,0.797700
0.002200,0.000850,0.201900,0.795050
0.002200,0.001050,0.203600,0.793150
0.002150,0.001150,0.205650,0.791050
0.002300,0.000950,0.207950,0.788800
0.002250,0.000950,0.210250,0.786550
0.002250,0.000900,0.212250,0.784600
0.002100,0.000600,0.214500,0.782800
0.001650,0.000900,0.216700,0.780750
0.001700,0.001200,0.218500,0.778600
0.001950,0.001150,0.220450,0.776450
0.001750,0.001450,0.222100,0.774700
0.002350,0.001350,0.223900,0.772400
0.002300,0.001600,0.225600,0.770500
0.002450,0.001500,0.227800,0.768250
0.002350,0.001750,0.229450,0.766450
0.002650,0.001250,0.231100,0.765000
0.002600,0.001450,0.232900,0.763050
0.002900,0.001500,0.234400,0.761200
0.003000,0.001150,0.236200,0.759650
0.002900,0.001200,0.237700,0.758200
0.003100,0.001400,0.238950,0.756550
0.003300,0.001500,0.240800,0.754400
0.003150,0.001900,0.242100,0.752850
0.003600,0.002250,0.243000,0.751150
0.003550,0.002150,0.244600,0.749700
0.003600,0.002300,0.246000,0.748100
0.003750,0.002400,0.247350,0.746500
0.003700,0.002850,0.248900,0.744550
0.004050,0.002550,0.250000,0.743400
0.004650,0.002750,0.251000,0.741600
0.004950,0.003000,0.252150,0.739900
0.005100,0.003150,0.253100,0.738650
0.004900,0.003450,0.254250,0.737400
0.005450,0.003200,0.256350,0.735000
0.005550,0.003550,0.257800,0.733100
0.005700,0.003700,0.259350,0.731250
0.005650,0.003700,0.260300,0.730350
0.005550,0.003800,0.262000,0.728650
0.005900,0.003550,0.263250,0.727300
0.006200,0.004000,0.264300,0.725500
0.006900,0.004000,0.265100,0.724000
0.007300,0.004450,0.265300,0.722950
0.007800,0.004850,0.266150,0.721200
0.008000,0.004800,0.266750,0.720450
0.007700,0.005300,0.267350,0.719650
0.008150,0.005550,0.267900,0.718400
0.008800,0.005400,0.269000,0.716800
0.009400,0.005800,0.268900,0.715900
0.009950,0.005800,0.269600,0.714650
0.009500,0.007050,0.269050,0.714400
0.009950,0.007450,0.269150,0.713450
0.011150,0.007300,0.269200,0.712350
0.012400,0.007100,0.268950,0.711550
0.012450,0.008300,0.267950,0.711300
0.012600,0.009050,0.267250,0.711100
0.013800,0.009600,0.266650,0.709950
0.014200,0.010750,0.265350,0.709700
0.016250,0.010350,0.264450,0.708950
0.017200,0.010750,0.263300,0.708750
0.017500,0.011250,0.262600,0.708650
0.018500,0.011050,0.261700,0.708750
0.019400,0.010850,0.260500,0.709250
0.019200,0.012350,0.258300,0.710150
0.019300,0.013800,0.256200,0.710700
0.020800,0.012950,0.255450,0.710800
0.021700,0.013350,0.253700,0.711250
0.021800,0.013950,0.252300,0.711950
0.022350,0.014600,0.250700,0.712350
0.023450,0.014450,0.250100,0.712000
0.023800,0.015000,0.248750,0.712450
0.025850,0.014550,0.246400,0.713200
0.026500,0.015600,0.243300,0.714600
0.027050,0.016200,0.241100,0.715650
0.027250,0.016800,0.238300,0.717650
0.027950,0.017550,0.235200,0.719300
0.029150,0.017400,0.232650,0.720800
0.029700,0.018500,0.229650,0.722150
0.030900,0.018900,0.227150,0.723050
0.031750,0.019000,0.224050,0.725200
0.031400,0.017850,0.222700,0.728050
0.032400,0.017900,0.220600,0.729100
0.032850,0.018450,0.217500,0.731200
0.034150,0.018600,0.214350,0.732900
0.036550,0.018150,0.211300,0.734000
0.037900,0.018550,0.208200,0.735350
0.037550,0.019400,0.204950,0.738100
0.037950,0.018800,0.201900,0.741350
0.038400,0.019300,0.198700,0.743600
0.038850,0.019650,0.195200,0.746300
0.039250,0.020600,0.192300,0.747850
0.039550,0.019700,0.189700,0.751050
0.040250,0.020000,0.186700,0.753050
0.040600,0.020000,0.184950,0.754450
0.040350,0.020400,0.181450,0.757800
0.040650,0.020450,0.178600,0.760300
0.042100,0.019600,0.176000,0.762300
0.041150,0.019950,0.174000,0.764900
0.039800,0.019700,0.172100,0.768400
0.039750,0.018950,0.170650,0.770650
0.038750,0.019000,0.168900,0.773350
0.038600,0.018750,0.167450,0.775200
0.038700,0.017800,0.166600,0.776900
0.038050,0.017550,0.165550,0.778850
0.037750,0.016700,0.164300,0.781250
0.036450,0.016650,0.163450,0.783450
0.036200,0.016100,0.162850,0.784850
0.036100,0.015500,0.162250,0.786150
0.035250,0.016200,0.161450,0.787100
0.034600,0.016150,0.160850,0.788400
0.034250,0.015950,0.160850,0.788950
0.034500,0.014700,0.160100,0.790700
0.033850,0.014950,0.159650,0.791550
0.033450,0.014950,0.159900,0.791700
0.034150,0.014300,0.159500,0.792050
0.032850,0.014900,0.159400,0.792850
0.032400,0.015300,0.158950,0.793350
0.032450,0.014550,0.159350,0.793650
0.032100,0.014950,0.159050,0.793900
0.031900,0.015000,0.158100,0.795000
0.032950,0.014250,0.158600,0.794200
0.031900,0.014500,0.158300,0.795300
0.032150,0.014300,0.157250,0.796300
0.032100,0.014500,0.157000,0.796400
0.031550,0.014650,0.156450,0.797350
0.032100,0.014050,0.156950,0.796900
0.030300,0.015050,0.156500,0.798150
0.029950,0.014600,0.157000,0.798450
0.030150,0.014050,0.157200,0.798600
0.029600,0.014000,0.157250,0.799150
0.029750,0.013100,0.158350,0.798800
0.028750,0.014150,0.158400,0.798700
0.028800,0.013500,0.159950,0.797750
0.028550,0.012550,0.161100,0.797800
0.028600,0.012250,0.162100,0.797050
0.027700,0.011950,0.163400,0.796950
0.027450,0.011500,0.165200,0.795850
0.027150,0.011800,0.165050,0.796000
0.027150,0.011800,0.165650,0.795400
0.027050,0.012050,0.166250,0.794650
0.026600,0.011900,0.166200,0.795300
0.026300,0.012550,0.167050,0.794100
0.025700,0.011900,0.167750,0.794650
0.025600,0.011400,0.169300,0.793700
0.025550,0.010400,0.171550,0.792500
0.025950,0.011350,0.171650,0.791050
0.024000,0.011900,0.171950,0.792150
0.023700,0.011050,0.173500,0.791750
0.023600,0.011250,0.174500,0.790650
0.023700,0.010500,0.176450,0.789350
0.023850,0.010300,0.177250,0.788600
0.022700,0.010650,0.178400,0.788250
0.022050,0.011100,0.179400,0.787450
0.021650,0.011700,0.180550,0.786100
0.022750,0.010600,0.181750,0.784900
0.022250,0.011250,0.181800,0.784700
0.022100,0.011250,0.182850,0.783800
0.022400,0.011200,0.183550,0.782850
0.022300,0.011100,0.185000,0.781600
0.022200,0.011950,0.185400,0.780450
0.022200,0.011150,0.186350,0.780300
0.022150,0.011150,0.187350,0.779350
0.022800,0.010550,0.189200,0.777450
0.023450,0.010850,0.189650,0.776050
0.023550,0.011200,0.190900,0.774350
0.022800,0.011500,0.192050,0.773650
0.023300,0.011400,0.191800,0.773500
0.023400,0.011400,0.192950,0.772250
0.023400,0.011200,0.193800,0.771600
0.023300,0.011000,0.194750,0.770950
0.023450,0.011800,0.195300,0.769450
0.023200,0.012300,0.196500,0.768000
0.023450,0.012900,0.197150,0.766500
0.023200,0.013300,0.198900,0.764600
0.024550,0.012650,0.199550,0.763250
0.024700,0.011550,0.201050,0.762700
0.024900,0.010850,0.203250,0.761000
0.023850,0.011700,0.203300,0.761150
0.023750,0.012850,0.202900,0.760500
0.023350,0.013400,0.203300,0.759950
0.024450,0.012750,0.204150,0.758650
0.024850,0.013150,0.204250,0.757750
0.025750,0.012600,0.204900,0.756750
0.026000,0.012150,0.205850,0.756000
0.026600,0.013100,0.205550,0.754750
0.026750,0.012900,0.206300,0.754050
0.026900,0.013550,0.206100,0.753450
0.027550,0.013200,0.206550,0.752700
0.027250,0.012850,0.207050,0.752850
0.026350,0.013400,0.207450,0.752800
0.026350,0.014400,0.208300,0.750950
0.026450,0.014350,0.207400,0.751800
0.026400,0.014450,0.208400,0.750750
0.026300,0.014450,0.209650,0.749600
0.026700,0.015050,0.209150,0.749100
0.028450,0.014850,0.207800,0.748900
0.028550,0.016000,0.209500,0.745950
0.028900,0.016250,0.210350,0.744500
0.029950,0.015200,0.210550,0.744300
0.030250,0.015650,0.210400,0.743700
0.030900,0.015100,0.209650,0.744350
0.030900,0.016500,0.208950,0.743650
0.032150,0.016150,0.209450,0.742250
0.032150,0.016750,0.208750,0.742350
0.032150,0.017650,0.208300,0.741900
0.032450,0.017500,0.207800,0.742250
0.031400,0.018750,0.206450,0.743400
0.033000,0.018250,0.205050,0.743700
0.033300,0.019150,0.203450,0.744100
0.034300,0.020350,0.201800,0.743550
0.035900,0.019100,0.201800,0.743200
0.036800,0.019000,0.200050,0.744150
0.037950,0.018950,0.197700,0.745400
0.037750,0.019150,0.195550,0.747550
0.038000,0.018450,0.195600,0.747950
0.038450,0.018500,0.194500,0.748550
0.038800,0.019650,0.193850,0.747700
0.039500,0.019050,0.192500,0.748950
0.039350,0.018850,0.191000,0.750800
0.038350,0.019200,0.191200,0.751250
0.039000,0.018750,0.190700,0.751550
0.038700,0.019200,0.189350,0.752750
0.039350,0.019700,0.186300,0.754650
0.041250,0.018000,0.185950,0.754800
0.041450,0.016800,0.186650,0.755100
0.040750,0.016800,0.185350,0.757100
0.039950,0.017250,0.184100,0.758700
0.039950,0.018050,0.182850,0.759150
0.039150,0.017750,0.182750,0.760350
0.040250,0.018200,0.181700,0.759850
0.039650,0.019600,0.180200,0.760550
0.038850,0.019650,0.179600,0.761900
0.039100,0.018800,0.180700,0.761400
0.039600,0.017800,0.180900,0.761700
0.039250,0.017550,0.180150,0.763050
0.039050,0.018150,0.179300,0.763500
0.038400,0.019300,0.177000,0.765300
0.039450,0.017350,0.177000,0.766200
0.038850,0.018400,0.176050,0.766700
0.038350,0.018400,0.175800,0.767450
0.038150,0.017800,0.175300,0.768750
0.037600,0.017700,0.174250,0.770450
0.038600,0.016150,0.174050,0.771200
0.038500,0.016500,0.173150,0.771850
0.038200,0.016100,0.173600,0.772100
0.036700,0.016650,0.174100,0.772550
0.036750,0.015800,0.175250,0.772200
0.035950,0.015500,0.176400,0.772150
0.034850,0.016150,0.176600,0.772400
0.033750,0.017500,0.176800,0.771950
0.035200,0.016950,0.177000,0.770850
0.034500,0.016450,0.177300,0.771750
0.033200,0.016750,0.178050,0.772000
0.033150,0.017250,0.178100,0.771500
0.034250,0.016650,0.178450,0.770650
0.033950,0.016900,0.178700,0.770450
0.034350,0.017200,0.178750,0.769700
0.034000,0.018350,0.177450,0.770200
0.035350,0.017500,0.177000,0.770150
0.035800,0.017600,0.176100,0.770500
0.036200,0.017650,0.175300,0.770850
0.036450,0.017400,0.174700,0.771450
0.036450,0.017150,0.175650,0.770750
0.037000,0.016150,0.175750,0.771100
0.037000,0.016650,0.175650,0.770700
0.034900,0.017900,0.174950,0.772250
0.035250,0.017300,0.175450,0.772000
0.035800,0.017300,0.174750,0.772150
0.034550,0.018300,0.174250,0.772900
0.034900,0.018650,0.174250,0.772200
0.035300,0.017600,0.174150,0.772950
0.035350,0.017600,0.173750,0.773300
0.035450,0.017550,0.173950,0.773050
0.035850,0.015950,0.174000,0.774200
0.034800,0.016200,0.173950,0.775050
0.034300,0.016300,0.173750,0.775650
0.033900,0.016050,0.174300,0.775750
0.033150,0.016350,0.174400,0.776100
0.032100,0.017450,0.174750,0.775700
0.032750,0.016400,0.176000,0.774850
0.033250,0.015750,0.177050,0.773950
0.032950,0.016100,0.177300,0.773650
0.033550,0.016050,0.178050,0.772350
0.033650,0.015800,0.178100,0.772450
0.033150,0.015450,0.178100,0.773300
0.033600,0.015750,0.177600,0.773050
0.033300,0.016450,0.177600,0.772650
0.034000,0.015650,0.178000,0.772350
0.033050,0.015600,0.178300,0.773050
0.033250,0.016250,0.177500,0.773000
0.032750,0.016400,0.178550,0.772300
0.033100,0.016550,0.177900,0.772450
0.033950,0.017100,0.178300,0.770650
0.034500,0.016650,0.178800,0.770050
0.034650,0.016500,0.179350,0.769500
0.034100,0.017750,0.178050,0.770100
0.035150,0.016650,0.178000,0.770200
0.034900,0.017050,0.177600,0.770450
0.034300,0.016800,0.179050,0.769850
0.033350,0.016900,0.179350,0.770400
0.034100,0.016250,0.179800,0.769850
0.033500,0.014900,0.183000,0.768600
0.033050,0.014850,0.183900,0.768200
0.033950,0.014150,0.183350,0.768550
0.032000,0.014550,0.183950,0.769500
0.031850,0.014300,0.184650,0.769200
0.031600,0.015050,0.184850,0.768500
0.031350,0.015250,0.185350,0.768050
0.030800,0.014900,0.186700,0.767600
0.031050,0.015300,0.186850,0.766800
0.030950,0.015800,0.187350,0.765900
0.031250,0.015600,0.187650,0.765500
0.031500,0.016250,0.187100,0.765150
0.031500,0.014950,0.187850,0.765700
0.030750,0.015700,0.187850,0.765700
0.032350,0.014700,0.188350,0.764600
0.032100,0.015350,0.188250,0.764300
0.032450,0.015200,0.187450,0.764900
0.032500,0.015750,0.187900,0.763850
0.033500,0.015900,0.187550,0.763050
0.032900,0.016650,0.187250,0.763200
0.034500,0.015850,0.187650,0.762000
0.034550,0.016200,0.187850,0.761400
0.034750,0.016300,0.188350,0.760600
0.034000,0.016650,0.188900,0.760450
0.034850,0.016950,0.188150,0.760050
0.034500,0.017350,0.187350,0.760800
0.034900,0.016900,0.187850,0.760350
0.035250,0.016400,0.189050,0.759300
0.035450,0.016750,0.187700,0.760100
0.035750,0.017350,0.186800,0.760100
0.035250,0.017600,0.186450,0.760700
0.035950,0.016150,0.186350,0.761550
0.035600,0.015900,0.186750,0.761750
0.035200,0.015600,0.187450,0.761750
0.034200,0.016550,0.188050,0.761200
0.033200,0.016400,0.188350,0.762050
0.033150,0.016400,0.189100,0.761350
0.032350,0.017550,0.188700,0.761400
0.031750,0.016900,0.189100,0.762250
0.032200,0.016800,0.188600,0.762400
0.031900,0.016600,0.188600,0.762900
0.031150,0.016850,0.188100,0.763900
0.031450,0.016300,0.188350,0.763900
0.031500,0.016550,0.187800,0.764150
0.032500,0.015600,0.188050,0.763850
0.031850,0.015300,0.189300,0.763550
0.031600,0.016900,0.189200,0.762300
0.031500,0.017400,0.189300,0.761800
0.032600,0.017000,0.189050,0.761350
0.033150,0.017250,0.188750,0.760850
0.032900,0.017450,0.188450,0.761200
0.034450,0.017000,0.187650,0.760900
0.034850,0.017400,0.186750,0.761000
0.035600,0.017400,0.186650,0.760350
0.035100,0.019250,0.186850,0.758800
0.034950,0.017800,0.187600,0.759650
0.035850,0.017850,0.187350,0.758950
0.035850,0.017550,0.186700,0.759900
0.035300,0.017650,0.186550,0.760500
0.036750,0.017450,0.186400,0.759400
0.037250,0.016200,0.186550,0.760000
0.034700,0.018000,0.185200,0.762100
0.034950,0.017100,0.184900,0.763050
0.036300,0.016300,0.185400,0.762000
0.035750,0.017550,0.183900,0.762800
0.035800,0.016150,0.185250,0.762800
0.036100,0.016700,0.184450,0.762750
0.035300,0.017300,0.183050,0.764350
0.035900,0.017650,0.183850,0.762600
0.035950,0.017800,0.183750,0.762500
0.036900,0.016550,0.183400,0.763150
0.037550,0.016200,0.183900,0.762350
0.035350,0.017250,0.183650,0.763750
0.035450,0.016800,0.183600,0.764150
0.035700,0.016200,0.183300,0.764800
0.034950,0.016250,0.183550,0.765250
0.033600,0.016300,0.183650,0.766450
0.034700,0.016300,0.183400,0.765600
0.035200,0.017500,0.181650,0.765650
0.035750,0.017600,0.181400,0.765250
0.036000,0.017400,0.181150,0.765450
0.035700,0.018100,0.180600,0.765600
0.035550,0.018800,0.180100,0.765550
0.035950,0.018800,0.179150,0.766100
0.036150,0.018150,0.180100,0.765600
0.036100,0.018900,0.179800,0.765200
0.036900,0.017900,0.179850,0.765350
0.036800,0.018450,0.178800,0.765950
0.035550,0.019100,0.178300,0.767050
0.036600,0.017150,0.180350,0.765900
0.037050,0.017500,0.179650,0.765800
0.036650,0.017650,0.179700,0.766000
0.037350,0.017300,0.179200,0.766150
0.037650,0.017100,0.179100,0.766150
0.037250,0.017600,0.178900,0.766250
0.036950,0.018200,0.178350,0.766500
0.037450,0.017850,0.177100,0.767600
0.038500,0.016450,0.177850,0.767200
0.038400,0.016550,0.178200,0.766850
0.037300,0.016800,0.178350,0.767550
0.036750,0.017650,0.178050,0.767550
0.036650,0.017650,0.178050,0.767650
0.036350,0.017800,0.176950,0.768900
0.038250,0.016250,0.177950,0.767550
0.037650,0.016500,0.177150,0.768700
0.038350,0.016150,0.176500,0.769000
0.036600,0.017500,0.176050,0.769850
0.037650,0.017400,0.175700,0.769250
0.037250,0.017750,0.174700,0.770300
0.036600,0.018200,0.173800,0.771400
0.036700,0.018100,0.173400,0.771800
0.037250,0.018050,0.172900,0.771800
0.036250,0.018050,0.172350,0.773350
0.037050,0.018300,0.172400,0.772250
0.037600,0.018150,0.172100,0.772150
0.036900,0.017850,0.172450,0.772800
0.036250,0.017000,0.173150,0.773600
0.036900,0.016900,0.172650,0.773550
0.036750,0.017300,0.171450,0.774500
0.036200,0.017100,0.171600,0.775100
0.035700,0.016400,0.172700,0.775200
0.035500,0.016350,0.172550,0.775600
0.035650,0.017300,0.172700,0.774350
0.034550,0.017450,0.173700,0.774300
0.034850,0.016850,0.174950,0.773350
0.035250,0.015400,0.176150,0.773200
0.035100,0.014950,0.178550,0.771400
0.033550,0.015450,0.178200,0.772800
0.033700,0.015500,0.178600,0.772200
0.033250,0.016200,0.178650,0.771900
0.033050,0.015800,0.179250,0.771900
0.033250,0.015350,0.179950,0.771450
0.032400,0.015600,0.181050,0.770950
0.031750,0.015450,0.181250,0.771550
0.030850,0.015650,0.181950,0.771550
0.030550,0.016050,0.181500,0.771900
0.031050,0.016000,0.182100,0.770850
0.031950,0.015350,0.183600,0.769100
0.032300,0.014550,0.184050,0.769100
0.031950,0.015050,0.184850,0.768150
0.032450,0.014700,0.186000,0.766850
0.031100,0.015200,0.186800,0.766900
0.029950,0.016100,0.186800,0.767150
0.030100,0.015650,0.187400,0.766850
0.031000,0.015850,0.186650,0.766500
0.032150,0.015000,0.186850,0.766000
0.032250,0.015000,0.186650,0.766100
0.032400,0.015700,0.187250,0.764650
0.032600,0.016800,0.186150,0.764450
0.032200,0.017300,0.186700,0.763800
0.032950,0.016350,0.187500,0.763200
0.032250,0.017650,0.186050,0.764050
0.033000,0.016600,0.187750,0.762650
0.032950,0.016050,0.188400,0.762600
0.033000,0.015450,0.189400,0.762150
0.033350,0.015300,0.188950,0.762400
0.033350,0.016150,0.188300,0.762200
0.032450,0.016400,0.188850,0.762300
0.031700,0.017400,0.188700,0.762200
0.030950,0.017300,0.189300,0.762450
0.031900,0.016100,0.189850,0.762150
0.032050,0.016450,0.189850,0.761650
0.031250,0.016350,0.190350,0.762050
0.031150,0.016150,0.189800,0.762900
0.030750,0.015750,0.190200,0.763300
0.031100,0.015450,0.190950,0.762500
0.030800,0.015700,0.190650,0.762850
0.032150,0.015650,0.191300,0.760900
0.032300,0.015000,0.192250,0.760450
0.032050,0.015650,0.192850,0.759450
0.031350,0.016450,0.192400,0.759800
0.031550,0.016050,0.192500,0.759900
0.032050,0.017350,0.192700,0.757900
0.032850,0.017800,0.193250,0.756100
0.033600,0.016900,0.194000,0.755500
0.033000,0.017400,0.193500,0.756100
0.033850,0.016950,0.193500,0.755700
0.034600,0.017400,0.193500,0.754500
0.034000,0.017200,0.194150,0.754650
0.034050,0.018350,0.192950,0.754650
0.035400,0.017750,0.193000,0.753850
0.035650,0.017100,0.193550,0.753700
0.034500,0.017300,0.194350,0.753850
0.034050,0.018100,0.193600,0.754250
0.034850,0.018500,0.193300,0.753350
0.036400,0.018400,0.192000,0.753200
0.037600,0.019350,0.190400,0.752650
0.038350,0.019450,0.189900,0.752300
0.040150,0.018200,0.189150,0.752500
0.040500,0.017800,0.187900,0.753800
0.039600,0.018600,0.186750,0.755050
0.039450,0.018900,0.186400,0.755250
0.038950,0.019400,0.185950,0.755700
0.039900,0.019900,0.183900,0.756300
0.039550,0.020150,0.183000,0.757300
0.040500,0.018050,0.184400,0.757050
0.039700,0.018450,0.183700,0.758150
0.039050,0.018800,0.183600,0.758550
0.040300,0.017550,0.184300,0.757850
0.039200,0.018150,0.184000,0.758650
0.038600,0.019400,0.182000,0.760000
0.038100,0.018900,0.182300,0.760700
0.037050,0.019750,0.181100,0.762100
0.037900,0.019750,0.179950,0.762400
0.038250,0.019800,0.180100,0.761850
0.038800,0.019450,0.179850,0.761900
0.039550,0.018500,0.180450,0.761500
0.040400,0.019000,0.180100,0.760500
0.040250,0.017900,0.180850,0.761000
0.039350,0.018500,0.181350,0.760800
0.038650,0.018700,0.180500,0.762150
0.039050,0.018600,0.180050,0.762300
0.039700,0.018100,0.179550,0.762650
0.039150,0.018700,0.178400,0.763750
0.040000,0.018950,0.177550,0.763500
0.040700,0.018500,0.177800,0.763000
0.040250,0.018850,0.177200,0.763700
0.039900,0.019500,0.175100,0.765500
0.039500,0.019300,0.174700,0.766500
0.040300,0.019400,0.174000,0.766300
0.040600,0.018450,0.173500,0.767450
0.040150,0.018750,0.173200,0.767900
0.039700,0.018950,0.173350,0.768000
0.040100,0.018200,0.172550,0.769150
0.038950,0.017250,0.172400,0.771400
0.038500,0.016850,0.171200,0.773450
0.038150,0.016800,0.171900,0.773150
0.038250,0.017050,0.172200,0.772500
0.038000,0.016700,0.171650,0.773650
0.038150,0.015850,0.172600,0.773400
0.037050,0.017050,0.172300,0.773600
0.036950,0.018300,0.171700,0.773050
0.037300,0.018850,0.171050,0.772800
0.037900,0.018400,0.171350,0.772350
0.037950,0.018600,0.170200,0.773250
0.039050,0.018300,0.169450,0.773200
0.039350,0.018850,0.168450,0.773350
0.039950,0.016850,0.169600,0.773600
0.039250,0.017550,0.169900,0.773300
0.037900,0.017900,0.170250,0.773950
0.036350,0.018050,0.170450,0.775150
0.036400,0.017550,0.171700,0.774350
0.036650,0.016700,0.172250,0.774400
0.036850,0.016500,0.172350,0.774300
0.036950,0.016000,0.172400,0.774650
0.036550,0.015600,0.172700,0.775150
0.036100,0.016300,0.173850,0.773750
0.036450,0.016700,0.174050,0.772800
0.036250,0.015700,0.174100,0.773950
0.035450,0.016950,0.173700,0.773900
0.033950,0.017500,0.174250,0.774300
0.033350,0.017050,0.175400,0.774200
0.033450,0.016800,0.175100,0.774650
0.032750,0.016500,0.176250,0.774500
0.033300,0.016150,0.176850,0.773700
0.033600,0.016550,0.176100,0.773750
0.034050,0.016450,0.175900,0.773600
0.034200,0.016500,0.176350,0.772950
0.034500,0.016700,0.177100,0.771700
0.034250,0.016400,0.177500,0.771850
0.034800,0.015500,0.178450,0.771250
0.033650,0.016250,0.178900,0.771200
0.033150,0.015450,0.179300,0.772100
0.033650,0.014500,0.180250,0.771600
0.032900,0.014400,0.181400,0.771300
0.033300,0.014750,0.182000,0.769950
0.033100,0.015600,0.181750,0.769550
0.031500,0.015150,0.183000,0.770350
0.031100,0.015800,0.183600,0.769500
0.032450,0.016300,0.184000,0.767250
0.032950,0.016400,0.183950,0.766700
0.033150,0.016750,0.182950,0.767150
0.034800,0.017200,0.181850,0.766150
0.035800,0.017400,0.182600,0.764200
0.035500,0.017750,0.182100,0.764650
0.037050,0.017100,0.182400,0.763450
0.036700,0.017400,0.182200,0.763700
0.036700,0.017550,0.182800,0.762950
0.036850,0.017650,0.181750,0.763750
0.036900,0.018050,0.181450,0.763600
0.036400,0.018500,0.181000,0.764100
0.036050,0.019300,0.179650,0.765000
0.037100,0.017800,0.179150,0.765950
0.036300,0.017550,0.179950,0.766200
0.036400,0.017650,0.179450,0.766500
0.035600,0.017800,0.179200,0.767400
0.035050,0.017250,0.178900,0.768800
0.035050,0.018350,0.177750,0.768850
0.036100,0.016700,0.178150,0.769050
0.036550,0.015700,0.179350,0.768400
0.035200,0.016050,0.179250,0.769500
0.033900,0.016000,0.179950,0.770150
0.033700,0.017200,0.180050,0.769050
0.034500,0.016200,0.180500,0.768800
0.035200,0.016400,0.179700,0.768700
0.035000,0.016350,0.180100,0.768550
0.033850,0.016150,0.180250,0.769750
0.033700,0.014950,0.181500,0.769850
0.033400,0.015250,0.181650,0.769700
0.032900,0.015700,0.182100,0.769300
0.031500,0.016750,0.181800,0.769950
0.031850,0.016750,0.181250,0.770150
0.032300,0.015800,0.181900,0.770000
0.031550,0.016400,0.181450,0.770600
0.031900,0.015450,0.182500,0.770150
0.031400,0.015900,0.182650,0.770050
0.031200,0.016100,0.183400,0.769300
0.031450,0.015750,0.184100,0.768700
0.031800,0.015000,0.184700,0.768500
0.031900,0.015250,0.185800,0.767050
