I,E,S,R
0.001000,0.000700,0.998300,0.000000
0.001200,0.001250,0.997500,0.000050
0.001600,0.002050,0.996250,0.000100
0.002100,0.002550,0.995000,0.000350
0.002500,0.003250,0.993550,0.000700
0.003000,0.004350,0.991700,0.000950
0.003750,0.006150,0.988700,0.001400
0.004800,0.008300,0.985050,0.001850
0.006000,0.010950,0.980500,0.002550
0.007950,0.013550,0.974950,0.003550
0.010650,0.017300,0.967200,0.004850
0.013900,0.021700,0.958050,0.006350
0.018250,0.027600,0.946300,0.007850
0.023100,0.035900,0.930650,0.010350
0.029900,0.044550,0.911250,0.014300
0.037200,0.058950,0.884900,0.018950
0.049900,0.071550,0.855350,0.023200
0.062600,0.090850,0.816650,0.029900
0.080100,0.109350,0.772000,0.038550
0.101800,0.131450,0.718200,0.048550
0.125050,0.155900,0.657750,0.061300
0.150800,0.183050,0.588150,0.078000
0.182250,0.203650,0.516000,0.098100
0.216650,0.223000,0.439550,0.120800
0.252950,0.235550,0.362700,0.148800
0.284850,0.239100,0.292900,0.183150
0.318250,0.231900,0.230150,0.219700
0.339850,0.221350,0.177150,0.261650
0.356600,0.200250,0.134600,0.308550
0.364700,0.176200,0.103050,0.356050
0.362300,0.154200,0.077850,0.405650
0.358450,0.129650,0.059550,0.452350
0.349750,0.107350,0.045700,0.497200
0.334800,0.088350,0.035350,0.541500
0.312500,0.072600,0.028550,0.586350
0.288700,0.058500,0.024300,0.628500
0.269650,0.046300,0.021750,0.662300
0.247250,0.038100,0.019200,0.695450
0.227000,0.029900,0.018250,0.724850
0.205800,0.023700,0.018050,0.752450
0.185600,0.020150,0.017950,0.776300
0.165100,0.016700,0.018900,0.799300
0.147450,0.014500,0.018650,0.819400
0.132350,0.012350,0.019500,0.835800
0.117300,0.010650,0.020450,0.851600
0.105700,0.008750,0.021650,0.863900
0.092200,0.007450,0.023100,0.877250
0.080700,0.006900,0.024800,0.887600
0.070900,0.005700,0.027050,0.896350
0.063450,0.004900,0.029350,0.902300
0.055250,0.004950,0.030650,0.909150
0.049050,0.004750,0.033250,0.912950
0.043150,0.004500,0.035150,0.917200
0.038150,0.004300,0.037550,0.920000
0.034550,0.004350,0.038800,0.922300
0.031800,0.004100,0.040300,0.923800
0.028750,0.003400,0.043100,0.924750
0.025200,0.003550,0.045950,0.925300
0.021950,0.003350,0.048450,0.926250
0.019450,0.003000,0.051700,0.925850
0.018000,0.003250,0.054200,0.924550
0.016300,0.002850,0.057700,0.923150
0.014350,0.002600,0.060450,0.922600
0.012600,0.002450,0.063900,0.921050
0.011500,0.002150,0.066850,0.919500
0.010000,0.002100,0.069700,0.918200
0.008400,0.002000,0.072900,0.916700
0.008100,0.001750,0.075900,0.914250
0.007750,0.001350,0.078650,0.912250
0.007200,0.001450,0.081450,0.909900
0.006600,0.001650,0.083650,0.908100
0.006150,0.001600,0.086750,0.905500
0.005950,0.001250,0.089350,0.903450
0.005350,0.000900,0.092400,0.901350
0.004150,0.001050,0.094950,0.899850
0.003700,0.001100,0.097500,0.897700
0.003550,0.000850,0.100600,0.895000
0.003100,0.001000,0.103800,0.892100
0.002450,0.001050,0.106950,0.889550
0.002450,0.000950,0.108550,0.888050
0.002600,0.000650,0.111800,0.884950
0.002450,0.000500,0.114250,0.882800
0.002300,0.000700,0.117550,0.879450
0.002250,0.000850,0.119450,0.877450
0.002150,0.000600,0.122050,0.875200
0.002050,0.000950,0.124500,0.872500
0.002250,0.000750,0.127150,0.869850
0.002450,0.000700,0.129250,0.867600
0.002400,0.000700,0.131100,0.865800
0.002050,0.000600,0.133850,0.863500
0.001900,0.000700,0.136850,0.860550
0.002000,0.000500,0.139300,0.858200
0.001900,0.000500,0.141650,0.855950
0.001700,0.000550,0.144050,0.853700
0.001650,0.000450,0.146200,0.851700
0.001450,0.000450,0.148800,0.849300
0.001300,0.000500,0.151150,0.847050
0.001300,0.000500,0.153800,0.844400
0.001250,0.000450,0.155750,0.842550
0.001250,0.000400,0.158050,0.840300
0.001250,0.000400,0.160600,0.837750
0.001000,0.000650,0.162550,0.835800
0.001100,0.000750,0.165100,0.833050
0.001050,0.000700,0.167200,0.831050
0.001050,0.000600,0.169900,0.828450
0.001050,0.000600,0.172250,0.826100
0.001000,0.000550,0.174250,0.824200
0.001100,0.000400,0.176800,0.821700
0.001200,0.000400,0.179200,0.819200
0.001050,0.000450,0.181350,0.817150
0.001200,0.000350,0.183050,0.815400
0.001300,0.000150,0.185300,0.813250
0.001150,0.000300,0.186900,0.811650
0.001100,0.000450,0.188600,0.809850
0.000950,0.000350,0.190600,0.808100
0.001000,0.000300,0.193450,0.805250
0.001000,0.000300,0.196400,0.802300
0.001000,0.000250,0.198350,0.800400
0.001000,0.000450,0.200250,0.798300
0.001200,0.000200,0.201950,0.796650
0.001150,0.000250,0.204250,0.794350
0.001200,0.000500,0.206850,0.791450
0.001150,0.000650,0.209500,0.788700
0.001000,0.000600,0.211750,0.786650
0.001050,0.000650,0.213650,0.784650
0.001150,0.000450,0.215700,0.782700
0.001000,0.000700,0.217500,0.780800
0.001050,0.000700,0.218900,0.779350
0.001150,0.000700,0.221450,0.776700
0.001250,0.000800,0.223400,0.774550
0.001300,0.000950,0.225750,0.772000
0.001450,0.000750,0.227850,0.769950
0.001650,0.000750,0.230400,0.767200
0.001500,0.000800,0.232750,0.764950
0.001800,0.000950,0.234400,0.762850
0.001900,0.001200,0.235700,0.761200
0.002300,0.000850,0.237550,0.759300
0.002350,0.000950,0.239000,0.757700
0.002100,0.001100,0.240300,0.756500
0.002050,0.001150,0.242600,0.754200
0.002100,0.001000,0.244200,0.752700
0.002000,0.001100,0.246500,0.750400
0.002050,0.001500,0.248300,0.748150
0.002200,0.001550,0.250200,0.746050
0.002350,0.001700,0.251750,0.744200
0.002750,0.001550,0.254050,0.741650
0.002700,0.001600,0.255950,0.739750
0.002650,0.002250,0.257000,0.738100
0.002950,0.001900,0.259000,0.736150
0.003100,0.002200,0.260150,0.734550
0.003200,0.002400,0.261950,0.732450
0.003750,0.002300,0.263550,0.730400
0.003900,0.002350,0.265000,0.728750
0.003800,0.002650,0.266950,0.726600
0.003900,0.002550,0.268900,0.724650
0.003850,0.003100,0.269850,0.723200
0.004050,0.003150,0.271150,0.721650
0.004250,0.003550,0.272300,0.719900
0.004550,0.003550,0.273550,0.718350
0.005050,0.003300,0.274950,0.716700
0.005400,0.003250,0.275950,0.715400
0.005750,0.003200,0.276700,0.714350
0.006250,0.003350,0.277250,0.713150
0.006400,0.004400,0.277450,0.711750
0.006450,0.004750,0.277950,0.710850
0.007100,0.004650,0.278550,0.709700
0.007650,0.005300,0.278450,0.708600
0.008200,0.005450,0.278700,0.707650
0.008050,0.005750,0.279350,0.706850
0.008450,0.006450,0.279150,0.705950
0.009300,0.006100,0.280050,0.704550
0.009600,0.007600,0.279350,0.703450
0.009850,0.007700,0.279650,0.702800
0.011000,0.007550,0.280150,0.701300
0.011750,0.008500,0.279450,0.700300
0.012100,0.008550,0.279850,0.699500
0.012500,0.008750,0.279500,0.699250
0.012850,0.009050,0.279500,0.698600
0.013550,0.008900,0.279150,0.698400
0.014650,0.008950,0.277550,0.698850
0.015700,0.009650,0.275450,0.699200
0.016400,0.010850,0.273900,0.698850
0.016750,0.011650,0.272450,0.699150
0.017700,0.012550,0.270700,0.699050
0.019650,0.012700,0.268850,0.698800
0.020200,0.012950,0.267450,0.699400
0.021100,0.014500,0.264950,0.699450
0.021700,0.014700,0.262800,0.700800
0.022950,0.015500,0.259500,0.702050
0.024800,0.015900,0.256550,0.702750
0.024900,0.016500,0.253500,0.705100
0.025550,0.016700,0.251850,0.705900
0.027250,0.017250,0.248900,0.706600
0.028450,0.017750,0.245700,0.708100
0.029650,0.018500,0.242800,0.709050
0.030300,0.019100,0.239400,0.711200
0.032300,0.017950,0.236800,0.712950
0.032800,0.017950,0.234450,0.714800
0.033100,0.019000,0.230750,0.717150
0.033800,0.019400,0.227100,0.719700
0.033750,0.020000,0.224750,0.721500
0.034300,0.020600,0.221800,0.723300
0.035650,0.019900,0.218600,0.725850
0.036400,0.021400,0.213700,0.728500
0.038100,0.020300,0.210900,0.730700
0.037300,0.022600,0.206100,0.734000
0.039400,0.021400,0.203500,0.735700
0.041200,0.020650,0.199600,0.738550
0.041050,0.022750,0.194750,0.741450
0.040550,0.022900,0.191850,0.744700
0.041200,0.022050,0.189000,0.747750
0.042250,0.021950,0.185750,0.750050
0.042800,0.022000,0.182450,0.752750
0.044450,0.021150,0.179750,0.754650
0.044400,0.020550,0.177950,0.757100
0.045500,0.019700,0.175000,0.759800
0.044550,0.021050,0.170700,0.763700
0.043950,0.021350,0.168700,0.766000
0.044400,0.020600,0.167300,0.767700
0.043750,0.020400,0.164050,0.771800
0.043700,0.020550,0.161400,0.774350
0.045150,0.019450,0.159100,0.776300
0.044550,0.018900,0.156900,0.779650
0.043800,0.019350,0.154300,0.782550
0.042850,0.019400,0.152250,0.785500
0.042750,0.018750,0.150550,0.787950
0.040700,0.018750,0.149800,0.790750
0.040550,0.018300,0.148950,0.792200
0.039200,0.017800,0.148650,0.794350
0.038750,0.017600,0.147300,0.796350
0.037900,0.017550,0.147850,0.796700
0.037100,0.016900,0.147750,0.798250
0.037400,0.015800,0.147450,0.799350
0.036650,0.015400,0.147800,0.800150
0.036200,0.015100,0.148250,0.800450
0.036350,0.014150,0.148150,0.801350
0.036500,0.013400,0.147450,0.802650
0.035000,0.013750,0.147100,0.804150
0.034700,0.012950,0.147500,0.804850
0.033600,0.013800,0.147900,0.804700
0.032100,0.014250,0.147950,0.805700
0.032100,0.014300,0.148250,0.805350
0.033250,0.014300,0.148250,0.804200
0.032200,0.013550,0.149000,0.805250
0.031700,0.012600,0.150250,0.805450
0.031000,0.013200,0.151200,0.804600
0.030800,0.012000,0.153450,0.803750
0.029700,0.011250,0.154950,0.804100
0.029650,0.011300,0.154600,0.804450
0.028500,0.011000,0.155500,0.805000
0.026500,0.011700,0.156250,0.805550
0.025750,0.011200,0.157900,0.805150
0.025100,0.011500,0.159000,0.804400
0.025750,0.010450,0.160400,0.803400
0.024650,0.011100,0.161950,0.802300
0.023700,0.011800,0.162750,0.801750
0.023800,0.011200,0.164450,0.800550
0.022850,0.012300,0.164900,0.799950
0.023500,0.011350,0.167200,0.797950
0.023700,0.011250,0.167600,0.797450
0.023200,0.011000,0.170100,0.795700
0.021750,0.010500,0.171600,0.796150
0.021600,0.010800,0.173550,0.794050
0.022450,0.009950,0.175050,0.792550
0.022050,0.010400,0.176450,0.791100
0.022900,0.009750,0.178650,0.788700
0.022450,0.010050,0.179550,0.787950
0.022000,0.010250,0.180650,0.787100
0.021900,0.010500,0.182650,0.784950
0.021400,0.010900,0.182550,0.785150
0.021200,0.011500,0.183200,0.784100
0.021200,0.011850,0.184100,0.782850
0.021000,0.011800,0.184750,0.782450
0.021150,0.011750,0.187000,0.780100
0.020800,0.011450,0.188250,0.779500
0.021200,0.011000,0.189750,0.778050
0.022300,0.010100,0.191700,0.775900
0.022200,0.010400,0.192550,0.774850
0.022100,0.010200,0.194350,0.773350
0.022000,0.009850,0.195950,0.772200
0.021300,0.010800,0.197950,0.769950
0.021700,0.011100,0.198850,0.768350
0.022300,0.011200,0.200400,0.766100
0.022500,0.011750,0.201350,0.764400
0.023100,0.011300,0.202350,0.763250
0.022250,0.012500,0.202850,0.762400
0.023350,0.011500,0.203900,0.761250
0.023000,0.012700,0.204600,0.759700
0.024350,0.012300,0.205050,0.758300
0.024100,0.012700,0.205600,0.757600
0.023950,0.012700,0.205700,0.757650
0.024000,0.012900,0.205850,0.757250
0.024300,0.013250,0.206600,0.755850
0.025350,0.013500,0.206200,0.754950
0.026050,0.013300,0.206300,0.754350
0.026850,0.013150,0.206400,0.753600
0.026900,0.013550,0.206650,0.752900
0.025950,0.014800,0.205800,0.753450
0.027050,0.014300,0.207000,0.751650
0.026400,0.015500,0.206300,0.751800
0.027250,0.015050,0.206300,0.751400
0.027750,0.015000,0.206500,0.750750
0.028350,0.015900,0.206800,0.748950
0.028750,0.016350,0.206450,0.748450
0.029550,0.017050,0.206250,0.747150
0.030550,0.017350,0.204250,0.747850
0.031400,0.016950,0.204500,0.747150
0.030700,0.017300,0.203750,0.748250
0.031200,0.017200,0.203850,0.747750
0.031850,0.017600,0.203100,0.747450
0.032350,0.017850,0.202300,0.747500
0.033000,0.017700,0.201150,0.748150
0.033550,0.017900,0.200750,0.747800
0.034100,0.018200,0.199600,0.748100
0.033900,0.019400,0.197600,0.749100
0.035200,0.018500,0.197000,0.749300
0.035100,0.018250,0.196450,0.750200
0.035450,0.019950,0.194500,0.750100
0.036750,0.018450,0.194850,0.749950
0.036750,0.019450,0.192400,0.751400
0.035900,0.019050,0.192250,0.752800
0.035550,0.018400,0.192950,0.753100
0.036800,0.018750,0.192200,0.752250
0.036700,0.018400,0.192150,0.752750
0.035450,0.019000,0.192900,0.752650
0.036050,0.018850,0.192350,0.752750
0.036700,0.017250,0.192250,0.753800
0.036850,0.017850,0.190850,0.754450
0.036950,0.017700,0.191050,0.754300
0.036750,0.018400,0.190900,0.753950
0.037300,0.016950,0.191200,0.754550
0.038050,0.017100,0.190750,0.754100
0.038500,0.017350,0.189500,0.754650
0.037650,0.017400,0.188100,0.756850
0.038250,0.018550,0.186600,0.756600
0.037500,0.019250,0.184700,0.758550
0.038950,0.018100,0.185350,0.757600
0.038250,0.019050,0.183900,0.758800
0.037500,0.018900,0.183900,0.759700
0.037600,0.018450,0.184050,0.759900
0.037100,0.018750,0.183650,0.760500
0.037200,0.019200,0.183100,0.760500
0.037550,0.018600,0.182800,0.761050
0.037800,0.018950,0.181700,0.761550
0.037450,0.018600,0.182500,0.761450
0.036750,0.018400,0.182350,0.762500
0.038350,0.018700,0.181100,0.761850
0.038650,0.018300,0.180500,0.762550
0.038450,0.019000,0.180450,0.762100
0.038850,0.018650,0.179650,0.762850
0.038550,0.018100,0.179850,0.763500
0.039800,0.018200,0.179500,0.762500
0.039500,0.019550,0.177150,0.763800
0.041400,0.018900,0.176850,0.762850
0.040350,0.020150,0.175900,0.763600
0.040850,0.019400,0.175450,0.764300
0.040650,0.018750,0.174750,0.765850
0.041550,0.017950,0.174750,0.765750
0.041400,0.018550,0.173250,0.766800
0.040850,0.018500,0.173700,0.766950
0.040500,0.019000,0.172550,0.767950
0.040500,0.018450,0.172400,0.768650
0.039900,0.018450,0.172650,0.769000
0.039350,0.018050,0.172700,0.769900
0.040200,0.017400,0.172700,0.769700
0.039200,0.017950,0.172250,0.770600
0.040000,0.017650,0.171550,0.770800
0.039950,0.017400,0.171650,0.771000
0.039400,0.017650,0.171550,0.771400
0.039150,0.018100,0.169950,0.772800
0.039500,0.018600,0.168800,0.773100
0.039000,0.018350,0.169300,0.773350
0.038900,0.017650,0.169050,0.774400
0.038150,0.017950,0.168800,0.775100
0.038300,0.016850,0.169450,0.775400
0.037150,0.017200,0.169700,0.775950
0.037050,0.016400,0.171600,0.774950
0.037600,0.014650,0.172650,0.775100
0.036200,0.015400,0.172650,0.775750
0.036050,0.015050,0.173000,0.775900
0.034850,0.015250,0.171750,0.778150
0.035950,0.014900,0.172600,0.776550
0.036500,0.014300,0.173400,0.775800
0.036500,0.015650,0.172400,0.775450
0.037000,0.014700,0.172850,0.775450
0.035750,0.016000,0.173200,0.775050
0.035450,0.016000,0.173350,0.775200
0.034200,0.017450,0.172150,0.776200
0.034550,0.016800,0.173250,0.775400
0.033550,0.015800,0.175250,0.775400
0.034000,0.015600,0.175650,0.774750
0.033450,0.015050,0.176150,0.775350
0.033500,0.014650,0.176700,0.775150
0.034200,0.014300,0.178200,0.773300
0.033900,0.013650,0.178750,0.773700
0.032500,0.014800,0.179150,0.773550
0.032350,0.015350,0.179000,0.773300
0.033550,0.015200,0.179850,0.771400
0.033550,0.015350,0.179900,0.771200
0.032700,0.015900,0.179600,0.771800
0.032650,0.016100,0.180850,0.770400
0.033350,0.016400,0.180450,0.769800
0.032500,0.015900,0.181850,0.769750
0.032000,0.016150,0.182150,0.769700
0.032150,0.016650,0.182500,0.768700
0.032800,0.015600,0.182950,0.768650
0.032750,0.016350,0.183100,0.767800
0.032750,0.016700,0.183400,0.767150
0.032700,0.016900,0.182650,0.767750
0.032000,0.017400,0.182850,0.767750
0.032950,0.016500,0.183250,0.767300
0.032800,0.016200,0.183850,0.767150
0.033700,0.014650,0.185550,0.766100
0.032300,0.015850,0.185150,0.766700
0.032850,0.015350,0.186150,0.765650
0.033000,0.014900,0.186250,0.765850
0.032950,0.015450,0.185850,0.765750
0.032300,0.014850,0.186950,0.765900
0.032200,0.015450,0.186450,0.765900
0.032350,0.015700,0.187550,0.764400
0.031700,0.015650,0.188900,0.763750
0.032250,0.016000,0.188100,0.763650
0.033000,0.016400,0.188350,0.762250
0.032300,0.016800,0.187900,0.763000
0.032800,0.016700,0.187800,0.762700
0.032700,0.016750,0.189050,0.761500
0.032500,0.016200,0.190000,0.761300
0.033450,0.016600,0.190050,0.759900
0.032400,0.017100,0.190450,0.760050
0.033800,0.015600,0.190400,0.760200
0.033800,0.014800,0.192100,0.759300
0.033600,0.014700,0.192650,0.759050
0.033400,0.014450,0.192400,0.759750
0.033100,0.015000,0.192650,0.759250
0.032850,0.015250,0.192000,0.759900
0.033000,0.015250,0.191500,0.760250
0.034200,0.014800,0.192200,0.758800
0.034200,0.015350,0.191550,0.758900
0.034300,0.015200,0.191600,0.758900
0.034250,0.016650,0.190650,0.758450
0.033950,0.016500,0.190400,0.759150
0.033750,0.016700,0.190150,0.759400
0.033550,0.017000,0.189850,0.759600
0.034400,0.015900,0.189950,0.759750
0.034000,0.016900,0.189600,0.759500
0.034350,0.016750,0.189700,0.759200
0.034050,0.016450,0.189500,0.760000
0.034050,0.016450,0.189100,0.760400
0.033600,0.017350,0.188650,0.760400
0.033450,0.016950,0.189200,0.760400
0.033950,0.017250,0.187800,0.761000
0.035250,0.017000,0.187250,0.760500
0.034550,0.017650,0.186500,0.761300
0.033800,0.018100,0.186200,0.761900
0.034250,0.017750,0.186050,0.761950
0.035500,0.018000,0.184550,0.761950
0.035500,0.017950,0.184350,0.762200
0.035100,0.018650,0.184200,0.762050
0.034350,0.019500,0.183100,0.763050
0.035550,0.019250,0.181550,0.763650
0.035700,0.018750,0.182250,0.763300
0.035750,0.018850,0.181350,0.764050
0.035700,0.018950,0.180950,0.764400
0.036800,0.019050,0.179550,0.764600
0.036750,0.019150,0.178700,0.765400
0.036450,0.019200,0.177550,0.766800
0.036700,0.018750,0.177050,0.767500
0.035400,0.020100,0.175300,0.769200
0.036050,0.019550,0.175150,0.769250
0.035700,0.019150,0.174750,0.770400
0.036550,0.018350,0.174300,0.770800
0.037800,0.017750,0.172700,0.771750
0.037600,0.017700,0.172750,0.771950
0.037550,0.016650,0.172200,0.773600
0.036450,0.018100,0.172200,0.773250
0.036700,0.017900,0.171550,0.773850
0.036700,0.018450,0.171100,0.773750
0.035900,0.018550,0.169850,0.775700
0.035950,0.017850,0.170550,0.775650
0.036200,0.017400,0.170700,0.775700
0.034950,0.016700,0.171800,0.776550
0.035050,0.017200,0.171600,0.776150
0.035250,0.015850,0.172050,0.776850
0.034700,0.015850,0.171750,0.777700
0.034200,0.015300,0.172650,0.777850
0.034450,0.016300,0.171400,0.777850
0.033800,0.016200,0.171550,0.778450
0.033150,0.016400,0.171900,0.778550
0.033350,0.015650,0.172350,0.778650
0.033550,0.015750,0.172800,0.777900
0.032850,0.016500,0.172750,0.777900
0.033050,0.016350,0.174150,0.776450
0.034200,0.015850,0.174150,0.775800
0.034900,0.015250,0.174400,0.775450
0.034150,0.016100,0.173800,0.775950
0.033250,0.017000,0.173750,0.776000
0.032850,0.017050,0.173800,0.776300
0.033900,0.016650,0.174250,0.775200
0.034200,0.016750,0.174650,0.774400
0.034000,0.016400,0.174900,0.774700
0.033600,0.016750,0.175050,0.774600
0.032900,0.017900,0.175500,0.773700
0.033500,0.017500,0.175600,0.773400
0.033650,0.017550,0.176200,0.772600
0.034250,0.016850,0.177100,0.771800
0.034400,0.016050,0.177650,0.771900
0.034100,0.016200,0.178250,0.771450
0.034300,0.015850,0.179150,0.770700
0.035200,0.015900,0.178500,0.770400
0.035700,0.015200,0.179100,0.770000
0.034900,0.016450,0.178800,0.769850
0.034850,0.017100,0.179050,0.769000
0.036200,0.016700,0.178300,0.768800
0.036250,0.017650,0.177250,0.768850
0.036850,0.017300,0.177550,0.768300
0.037050,0.017700,0.176550,0.768700
0.037200,0.018200,0.176000,0.768600
0.037550,0.016800,0.177450,0.768200
0.037800,0.016050,0.177950,0.768200
0.036850,0.016850,0.178950,0.767350
0.036350,0.016450,0.178600,0.768600
0.035200,0.017700,0.178600,0.768500
0.034550,0.016950,0.179300,0.769200
0.033950,0.017500,0.179650,0.768900
0.034800,0.018250,0.180150,0.766800
0.034750,0.019300,0.178450,0.767500
0.035850,0.017700,0.179550,0.766900
0.036450,0.017150,0.179850,0.766550
0.036650,0.018450,0.179450,0.765450
0.037750,0.017900,0.179150,0.765200
0.037150,0.018000,0.178650,0.766200
0.037750,0.017750,0.178350,0.766150
0.037750,0.017950,0.178050,0.766250
0.038400,0.018850,0.176700,0.766050
0.038700,0.017450,0.176500,0.767350
0.038700,0.016450,0.176750,0.768100
0.037450,0.018250,0.175650,0.768650
0.037750,0.018250,0.175200,0.768800
0.037600,0.018450,0.174550,0.769400
0.037050,0.018850,0.173850,0.770250
0.036950,0.018400,0.174950,0.769700
0.037200,0.018800,0.174450,0.769550
0.038400,0.017700,0.174900,0.769000
0.038600,0.016900,0.175000,0.769500
0.037650,0.017400,0.174500,0.770450
0.037200,0.017950,0.174850,0.770000
0.036250,0.017900,0.175400,0.770450
0.036800,0.017550,0.175400,0.770250
0.036350,0.017950,0.176350,0.769350
0.036350,0.018150,0.177450,0.768050
0.036500,0.018550,0.177300,0.767650
0.036000,0.018500,0.177750,0.767750
0.037550,0.017300,0.177950,0.767200
0.037250,0.016550,0.178950,0.767250
0.036400,0.017550,0.178450,0.767600
0.036800,0.017650,0.178350,0.767200
0.036300,0.018400,0.178500,0.766800
0.036350,0.017650,0.178650,0.767350
0.037300,0.017100,0.178850,0.766750
0.035650,0.016950,0.178700,0.768700
0.035750,0.016250,0.179450,0.768550
0.035650,0.016650,0.179700,0.768000
0.035450,0.016650,0.180900,0.767000
0.034700,0.016850,0.181500,0.766950
0.034450,0.017250,0.181950,0.766350
0.035450,0.017200,0.182500,0.764850
0.035500,0.017550,0.182350,0.764600
0.034900,0.017950,0.182900,0.764250
0.034800,0.017600,0.183200,0.764400
0.035850,0.016650,0.184350,0.763150
0.034350,0.017850,0.183300,0.764500
0.034000,0.017050,0.184150,0.764800
0.034250,0.017850,0.184100,0.763800
0.035550,0.016850,0.184500,0.763100
0.035500,0.016500,0.184500,0.763500
0.035000,0.017450,0.183400,0.764150
0.035300,0.017100,0.183600,0.764000
0.035200,0.017200,0.184050,0.763550
0.035700,0.017200,0.184650,0.762450
0.036200,0.017150,0.185700,0.760950
0.036550,0.016750,0.185050,0.761650
0.036400,0.016900,0.184650,0.762050
0.036500,0.017550,0.184000,0.761950
0.036450,0.017450,0.183800,0.762300
0.035800,0.017200,0.185150,0.761850
0.034600,0.018350,0.184650,0.762400
0.035550,0.017700,0.184500,0.762250
0.035250,0.018500,0.183350,0.762900
0.035950,0.018150,0.183600,0.762300
0.036850,0.017400,0.184950,0.760800
0.035950,0.018200,0.184200,0.761650
0.036900,0.016900,0.185100,0.761100
0.036300,0.017650,0.184550,0.761500
0.036500,0.017400,0.184200,0.761900
0.036000,0.017900,0.184700,0.761400
0.035450,0.019050,0.183450,0.762050
0.036200,0.019300,0.182750,0.761750
0.036900,0.018400,0.183650,0.761050
0.037800,0.018150,0.183500,0.760550
0.037800,0.018300,0.183350,0.760550
0.038450,0.017850,0.182900,0.760800
0.037850,0.018350,0.183100,0.760700
0.037700,0.018350,0.182300,0.761650
0.037900,0.018500,0.182200,0.761400
0.036950,0.019000,0.182300,0.761750
0.036850,0.018000,0.182900,0.762250
0.036700,0.017950,0.182850,0.762500
0.035600,0.018550,0.184100,0.761750
0.035800,0.018250,0.183450,0.762500
0.035700,0.019350,0.182550,0.762400
0.037350,0.018650,0.182300,0.761700
0.037700,0.019150,0.182650,0.760500
0.038800,0.018450,0.182750,0.760000
0.037650,0.019050,0.181600,0.761700
0.037050,0.019800,0.181250,0.761900
0.037150,0.018850,0.181250,0.762750
0.037450,0.018050,0.181500,0.763000
0.036750,0.017700,0.182200,0.763350
0.038050,0.017100,0.182200,0.762650
0.037900,0.017250,0.182350,0.762500
0.037450,0.018100,0.181650,0.762800
0.037550,0.019200,0.180250,0.763000
0.038050,0.018950,0.179600,0.763400
0.039250,0.019250,0.179350,0.762150
0.038800,0.018800,0.180100,0.762300
0.039000,0.018750,0.179750,0.762500
0.037750,0.020250,0.178800,0.763200
0.039250,0.018300,0.178500,0.763950
0.039700,0.019500,0.177950,0.762850
0.039700,0.018450,0.178450,0.763400
0.037700,0.018900,0.178250,0.765150
0.038950,0.018750,0.177150,0.765150
0.037000,0.019700,0.176100,0.767200
0.038300,0.020450,0.176150,0.765100
0.038900,0.020100,0.176300,0.764700
0.039900,0.019900,0.176600,0.763600
0.040400,0.019150,0.176650,0.763800
0.039450,0.019700,0.175450,0.765400
0.039450,0.018600,0.176200,0.765750
0.039050,0.018200,0.176050,0.766700
0.039100,0.018700,0.174750,0.767450
0.038850,0.018600,0.174950,0.767600
0.038950,0.019150,0.174150,0.767750
0.038650,0.019600,0.173800,0.767950
0.040150,0.019150,0.173250,0.767450
0.039600,0.018900,0.172250,0.769250
0.038800,0.018350,0.173000,0.769850
0.037900,0.018500,0.172200,0.771400
0.037400,0.018700,0.171900,0.772000
0.037000,0.017600,0.173550,0.771850
0.037100,0.016900,0.173450,0.772550
0.036600,0.016700,0.173450,0.773250
0.036500,0.016800,0.173800,0.772900
0.036900,0.016150,0.174150,0.772800
0.036450,0.016750,0.174700,0.772100
0.035800,0.017500,0.174950,0.771750
0.035550,0.016750,0.175200,0.772500
0.035550,0.017300,0.174150,0.773000
0.035500,0.017000,0.174200,0.773300
0.035900,0.017250,0.173550,0.773300
0.037150,0.016900,0.173550,0.772400
0.037600,0.016650,0.173600,0.772150
0.036850,0.018150,0.171850,0.773150
0.036450,0.017400,0.172450,0.773700
0.035950,0.017450,0.172150,0.774450
0.035550,0.017000,0.171950,0.775500
0.035650,0.017000,0.172550,0.774800
0.035100,0.017250,0.173150,0.774500
0.035050,0.017950,0.172850,0.774150
0.035250,0.017750,0.173000,0.774000
0.035550,0.016950,0.173900,0.773600
0.036100,0.016050,0.174550,0.773300
0.035700,0.015550,0.175900,0.772850
0.034650,0.016100,0.177200,0.772050
0.034550,0.016250,0.177850,0.771350
0.035000,0.016550,0.178100,0.770350
0.034000,0.016450,0.178950,0.770600
0.034350,0.015750,0.179800,0.770100
0.034400,0.016100,0.179850,0.769650
0.034400,0.016350,0.179050,0.770200
0.035850,0.014950,0.179650,0.769550
0.035350,0.014100,0.181200,0.769350
0.033550,0.015400,0.181050,0.770000
0.034200,0.015400,0.180800,0.769600
0.034600,0.014450,0.181100,0.769850
0.034450,0.014500,0.181000,0.770050
0.034000,0.015000,0.181150,0.769850
0.034350,0.016550,0.181500,0.767600
0.033900,0.016750,0.182150,0.767200
0.034050,0.016050,0.182050,0.767850
0.034250,0.016450,0.181750,0.767550
0.033750,0.017000,0.181600,0.767650
0.034650,0.016700,0.181600,0.767050
0.034500,0.017700,0.181650,0.766150
0.034650,0.016900,0.181750,0.766700
0.033750,0.017300,0.182450,0.766500
0.034500,0.017250,0.182550,0.765700
0.033550,0.018000,0.181650,0.766800
0.033250,0.017950,0.182050,0.766750
0.034600,0.016750,0.182500,0.766150
0.034950,0.017250,0.183050,0.764750
0.034350,0.018300,0.182500,0.764850
0.033700,0.018300,0.182200,0.765800
0.033700,0.019000,0.182600,0.764700
0.033950,0.018700,0.182450,0.764900
0.033700,0.018950,0.181800,0.765550
0.035000,0.017300,0.182700,0.765000
0.035700,0.016600,0.182900,0.764800
0.035950,0.017650,0.181750,0.764650
0.037700,0.016900,0.182250,0.763150
0.036700,0.017800,0.181500,0.764000
0.038100,0.018150,0.180650,0.763100
0.038800,0.017400,0.180800,0.763000
0.038250,0.018200,0.179800,0.763750
0.038300,0.018050,0.179950,0.763700
0.038600,0.018550,0.178500,0.764350
0.038800,0.017750,0.178300,0.765150
0.038550,0.018350,0.176950,0.766150
0.038650,0.018450,0.177500,0.765400
0.039200,0.018400,0.177250,0.765150
0.038750,0.019150,0.177000,0.765100
0.038850,0.019100,0.175950,0.766100
0.038700,0.019100,0.174400,0.767800
0.038150,0.019650,0.173600,0.768600
0.038200,0.019000,0.173000,0.769800
0.038400,0.018300,0.172600,0.770700
0.038100,0.017650,0.172250,0.772000
0.039150,0.016900,0.172650,0.771300
0.039300,0.016950,0.172050,0.771700
0.039750,0.016150,0.172600,0.771500
