I,E,S,R
0.001000,0.000800,0.998200,0.000000
0.001100,0.001250,0.997550,0.000100
0.001650,0.001300,0.996750,0.000300
0.002050,0.002200,0.995400,0.000350
0.002400,0.003600,0.993350,0.000650
0.002950,0.004650,0.991500,0.000900
0.004400,0.006300,0.987950,0.001350
0.005250,0.008900,0.983750,0.002100
0.006850,0.010950,0.979400,0.002800
0.009050,0.014100,0.973250,0.003600
0.011950,0.018600,0.964900,0.004550
0.015200,0.024900,0.953500,0.006400
0.020600,0.030050,0.940750,0.008600
0.027550,0.038500,0.922400,0.011550
0.035300,0.050350,0.899350,0.015000
0.045100,0.063200,0.872300,0.019400
0.057550,0.079200,0.838450,0.024800
0.072850,0.099150,0.795750,0.032250
0.092050,0.120000,0.746300,0.041650
0.114100,0.142400,0.690700,0.052800
0.138000,0.166650,0.628200,0.067150
0.165400,0.190500,0.559150,0.084950
0.197450,0.212550,0.484300,0.105700
0.233100,0.228100,0.408250,0.130550
0.267800,0.232300,0.338300,0.161600
0.297050,0.229400,0.274500,0.199050
0.325650,0.226300,0.212300,0.235750
0.346650,0.212850,0.163950,0.276550
0.362250,0.190900,0.124550,0.322300
0.363000,0.173250,0.092950,0.370800
0.362650,0.145300,0.072250,0.419800
0.358100,0.119850,0.057400,0.464650
0.342350,0.100650,0.044800,0.512200
0.324550,0.082050,0.036050,0.557350
0.302500,0.066100,0.030500,0.600900
0.283100,0.052700,0.026100,0.638100
0.260250,0.043000,0.022850,0.673900
0.236150,0.035000,0.021250,0.707600
0.212500,0.029000,0.019550,0.738950
0.193300,0.024400,0.018900,0.763400
0.177000,0.019650,0.019400,0.783950
0.159050,0.017200,0.019800,0.803950
0.142550,0.014850,0.021050,0.821550
0.128100,0.012600,0.022100,0.837200
0.116150,0.010350,0.022600,0.850900
0.102800,0.008900,0.023650,0.864650
0.091850,0.007750,0.025500,0.874900
0.080700,0.007450,0.026600,0.885250
0.072950,0.006800,0.027800,0.892450
0.064450,0.005750,0.029750,0.900050
0.057200,0.005100,0.032150,0.905550
0.050750,0.005200,0.034300,0.909750
0.044700,0.004200,0.037050,0.914050
0.039600,0.003750,0.039950,0.916700
0.035250,0.003500,0.042550,0.918700
0.031000,0.003400,0.045350,0.920250
0.027450,0.003500,0.048200,0.920850
0.023950,0.003300,0.051150,0.921600
0.021000,0.002950,0.054300,0.921750
0.018450,0.002650,0.056450,0.922450
0.016500,0.002500,0.059300,0.921700
0.014800,0.002150,0.062150,0.920900
0.012200,0.002550,0.065700,0.919550
0.011350,0.002250,0.068300,0.918100
0.009550,0.002400,0.071550,0.916500
0.008850,0.002100,0.073600,0.915450
0.007700,0.002000,0.076250,0.914050
0.007500,0.001700,0.079250,0.911550
0.006650,0.001800,0.081800,0.909750
0.006150,0.001500,0.085050,0.907300
0.006100,0.001550,0.088600,0.903750
0.005600,0.001400,0.091150,0.901850
0.005150,0.001450,0.093950,0.899450
0.005300,0.001550,0.095700,0.897450
0.004700,0.001600,0.098550,0.895150
0.004050,0.001150,0.100950,0.893850
0.003450,0.001450,0.103750,0.891350
0.003150,0.001300,0.106350,0.889200
0.002850,0.001300,0.109400,0.886450
0.002600,0.001000,0.112300,0.884100
0.002400,0.000800,0.114500,0.882300
0.002250,0.000800,0.116950,0.880000
0.002250,0.000800,0.119450,0.877500
0.002150,0.000850,0.122550,0.874450
0.001950,0.000750,0.125100,0.872200
0.001750,0.000650,0.128100,0.869500
0.001800,0.000600,0.130900,0.866700
0.001700,0.000700,0.133700,0.863900
0.001800,0.000650,0.136150,0.861400
0.001800,0.000500,0.138500,0.859200
0.001900,0.000400,0.140650,0.857050
0.001650,0.000650,0.143450,0.854250
0.001600,0.000550,0.146700,0.851150
0.001700,0.000450,0.148900,0.848950
0.001500,0.000400,0.151650,0.846450
0.001350,0.000500,0.153900,0.844250
0.001300,0.000550,0.156500,0.841650
0.001050,0.000600,0.159050,0.839300
0.000850,0.000600,0.161550,0.837000
0.000900,0.000550,0.163350,0.835200
0.000850,0.000800,0.165850,0.832500
0.001000,0.000600,0.168450,0.829950
0.001000,0.000700,0.170250,0.828050
0.001100,0.000650,0.172550,0.825700
0.001400,0.000500,0.175450,0.822650
0.001150,0.000550,0.178000,0.820300
0.001100,0.000450,0.180300,0.818150
0.001050,0.000300,0.182750,0.815900
0.000900,0.000300,0.185150,0.813650
0.000900,0.000400,0.187850,0.810850
0.000900,0.000300,0.190500,0.808300
0.000950,0.000350,0.192700,0.806000
0.000900,0.000350,0.195400,0.803350
0.001000,0.000250,0.198200,0.800550
0.000850,0.000400,0.200500,0.798250
0.000900,0.000450,0.202750,0.795900
0.000900,0.000450,0.205100,0.793550
0.000750,0.000450,0.207150,0.791650
0.000800,0.000300,0.209500,0.789400
0.000750,0.000350,0.211350,0.787550
0.000850,0.000250,0.213500,0.785400
0.000800,0.000400,0.215650,0.783150
0.000750,0.000350,0.218450,0.780450
0.000800,0.000450,0.220050,0.778700
0.000800,0.000350,0.222500,0.776350
0.000950,0.000250,0.224750,0.774050
0.001000,0.000250,0.227000,0.771750
0.001000,0.000400,0.229150,0.769450
0.000900,0.000500,0.231400,0.767200
0.001150,0.000350,0.233350,0.765150
0.001050,0.000400,0.234950,0.763600
0.000750,0.000600,0.237200,0.761450
0.000850,0.000500,0.239550,0.759100
0.000750,0.000550,0.242000,0.756700
0.000850,0.000450,0.244250,0.754450
0.001050,0.000550,0.246700,0.751700
0.000950,0.000700,0.248700,0.749650
0.001050,0.000500,0.250650,0.747800
0.001000,0.000650,0.252450,0.745900
0.001050,0.000550,0.254400,0.744000
0.001250,0.000600,0.256400,0.741750
0.001100,0.000700,0.258900,0.739300
0.001150,0.000550,0.260850,0.737450
0.000950,0.000600,0.262950,0.735500
0.000750,0.000550,0.264550,0.734150
0.000750,0.000750,0.265800,0.732700
0.000750,0.000650,0.267400,0.731200
0.000850,0.000650,0.268950,0.729550
0.001000,0.000600,0.271150,0.727250
0.000900,0.000700,0.273200,0.725200
0.001000,0.000600,0.274800,0.723600
0.001150,0.000450,0.277000,0.721400
0.001100,0.000500,0.279100,0.719300
0.000950,0.000800,0.280200,0.718050
0.001200,0.000850,0.281950,0.716000
0.001300,0.000750,0.283750,0.714200
0.001350,0.000900,0.286000,0.711750
0.001350,0.000950,0.287550,0.710150
0.001500,0.001050,0.289250,0.708200
0.001550,0.001150,0.290400,0.706900
0.001800,0.001000,0.292200,0.705000
0.001800,0.001250,0.293850,0.703100
0.001800,0.001400,0.295450,0.701350
0.001950,0.001550,0.296800,0.699700
0.002300,0.001650,0.298350,0.697700
0.002600,0.001550,0.299250,0.696600
0.002750,0.001750,0.300800,0.694700
0.002950,0.002150,0.301750,0.693150
0.003000,0.002350,0.303150,0.691500
0.003050,0.002550,0.304650,0.689750
0.003500,0.002600,0.305600,0.688300
0.003450,0.003350,0.306550,0.686650
0.004050,0.003100,0.308200,0.684650
0.004500,0.003150,0.309400,0.682950
0.004700,0.003450,0.310600,0.681250
0.005300,0.003150,0.311650,0.679900
0.005300,0.003550,0.312200,0.678950
0.005100,0.003950,0.312900,0.678050
0.005550,0.004750,0.313100,0.676600
0.005750,0.004850,0.313450,0.675950
0.006550,0.004800,0.314750,0.673900
0.006800,0.005300,0.315450,0.672450
0.007800,0.004800,0.315650,0.671750
0.007600,0.005350,0.315200,0.671850
0.008400,0.006250,0.314950,0.670400
0.008950,0.007050,0.315050,0.668950
0.010250,0.007000,0.315200,0.667550
0.010600,0.007150,0.315000,0.667250
0.011150,0.008100,0.314600,0.666150
0.011650,0.008700,0.313450,0.666200
0.012900,0.008950,0.312150,0.666000
0.013400,0.009400,0.311500,0.665700
0.013700,0.010050,0.310700,0.665550
0.014600,0.011950,0.308600,0.664850
0.016400,0.011300,0.307150,0.665150
0.018700,0.011300,0.305300,0.664700
0.019750,0.012600,0.302800,0.664850
0.020900,0.014200,0.299600,0.665300
0.021800,0.015000,0.296150,0.667050
0.022600,0.017000,0.292150,0.668250
0.024450,0.017300,0.288600,0.669650
0.026600,0.017950,0.284800,0.670650
0.027350,0.018850,0.280900,0.672900
0.029350,0.019950,0.276700,0.674000
0.030550,0.021350,0.272700,0.675400
0.032550,0.021700,0.267650,0.678100
0.034150,0.021700,0.264200,0.679950
0.036050,0.022000,0.258500,0.683450
0.036700,0.022050,0.254800,0.686450
0.037650,0.023750,0.249650,0.688950
0.039400,0.023750,0.245300,0.691550
0.040300,0.024700,0.240400,0.694600
0.042250,0.024850,0.235600,0.697300
0.043600,0.025800,0.229650,0.700950
0.044700,0.026700,0.224250,0.704350
0.047250,0.025750,0.219400,0.707600
0.047250,0.026950,0.213900,0.711900
0.048100,0.026950,0.208250,0.716700
0.048800,0.026700,0.203550,0.720950
0.048700,0.027900,0.198150,0.725250
0.051250,0.026650,0.194200,0.727900
0.052100,0.026100,0.189100,0.732700
0.052100,0.026300,0.184850,0.736750
0.050500,0.026200,0.181350,0.741950
0.050400,0.027000,0.176600,0.746000
0.051600,0.026550,0.171800,0.750050
0.052900,0.025300,0.168300,0.753500
0.052050,0.026650,0.164700,0.756600
0.051800,0.026650,0.161250,0.760300
0.051750,0.026600,0.157800,0.763850
0.052750,0.026100,0.154850,0.766300
0.052650,0.024750,0.152750,0.769850
0.052750,0.022550,0.151200,0.773500
0.052200,0.022100,0.148950,0.776750
0.051600,0.020750,0.146400,0.781250
0.049550,0.020700,0.144100,0.785650
0.049150,0.019850,0.142150,0.788850
0.049500,0.018700,0.140250,0.791550
0.047350,0.018600,0.138850,0.795200
0.045500,0.020250,0.136950,0.797300
0.044850,0.018200,0.136200,0.800750
0.043950,0.016400,0.135700,0.803950
0.041950,0.016200,0.134900,0.806950
0.039850,0.016400,0.134050,0.809700
0.038750,0.016000,0.134350,0.810900
0.038200,0.015350,0.134700,0.811750
0.037050,0.014600,0.135350,0.813000
0.036300,0.013550,0.136400,0.813750
0.034100,0.013900,0.136950,0.815050
0.033100,0.013150,0.137900,0.815850
0.032300,0.013050,0.138350,0.816300
0.030550,0.013150,0.138900,0.817400
0.030600,0.012000,0.140650,0.816750
0.029500,0.011950,0.141800,0.816750
0.029100,0.011100,0.143800,0.816000
0.028700,0.010900,0.144800,0.815600
0.027900,0.010950,0.145900,0.815250
0.027250,0.010600,0.146200,0.815950
0.026600,0.009900,0.148050,0.815450
0.025250,0.010200,0.149400,0.815150
0.024250,0.010550,0.151400,0.813800
0.024050,0.010600,0.152850,0.812500
0.023950,0.011100,0.153750,0.811200
0.023100,0.010850,0.155750,0.810300
0.023400,0.009050,0.158300,0.809250
0.021950,0.009400,0.160400,0.808250
0.021300,0.009550,0.163150,0.806000
0.021350,0.009500,0.165200,0.803950
0.020750,0.009700,0.167300,0.802250
0.020400,0.009500,0.168400,0.801700
0.019350,0.009500,0.170050,0.801100
0.018550,0.010250,0.170700,0.800500
0.018550,0.009650,0.172350,0.799450
0.019050,0.008750,0.174350,0.797850
0.018600,0.009050,0.175900,0.796450
0.018400,0.009500,0.176850,0.795250
0.017850,0.009100,0.179400,0.793650
0.018300,0.008950,0.181700,0.791050
0.018300,0.008900,0.183550,0.789250
0.019150,0.008100,0.186000,0.786750
0.018700,0.009000,0.187400,0.784900
0.018050,0.008800,0.190050,0.783100
0.018200,0.008600,0.191600,0.781600
0.018100,0.008650,0.193500,0.779750
0.017900,0.009500,0.194650,0.777950
0.017950,0.010400,0.195300,0.776350
0.018400,0.010000,0.197200,0.774400
0.019700,0.009700,0.198800,0.771800
0.019850,0.010050,0.199550,0.770550
0.019500,0.009950,0.201450,0.769100
0.019350,0.010400,0.202300,0.767950
0.020450,0.010450,0.203200,0.765900
0.021300,0.010800,0.203500,0.764400
0.021200,0.011350,0.203750,0.763700
0.021300,0.012100,0.204450,0.762150
0.022100,0.011150,0.205400,0.761350
0.022200,0.012150,0.206250,0.759400
0.022800,0.011900,0.207100,0.758200
0.023050,0.012100,0.206850,0.758000
0.023750,0.011750,0.207000,0.757500
0.024850,0.011950,0.207400,0.755800
0.024650,0.013250,0.207300,0.754800
0.024950,0.014350,0.206850,0.753850
0.026200,0.014850,0.206650,0.752300
0.026550,0.013950,0.207350,0.752150
0.026200,0.013650,0.208100,0.752050
0.027050,0.012700,0.209100,0.751150
0.027350,0.012600,0.210000,0.750050
0.026900,0.012900,0.210750,0.749450
0.027100,0.013450,0.210850,0.748600
0.027400,0.014900,0.210650,0.747050
0.026900,0.016100,0.211450,0.745550
0.028250,0.015350,0.211150,0.745250
0.028850,0.015050,0.211300,0.744800
0.029350,0.015200,0.211000,0.744450
0.029550,0.015500,0.211050,0.743900
0.029500,0.016100,0.211450,0.742950
0.030500,0.016050,0.211100,0.742350
0.031100,0.015800,0.210600,0.742500
0.030350,0.016700,0.211050,0.741900
0.029100,0.018800,0.210100,0.742000
0.030350,0.016700,0.211000,0.741950
0.030250,0.017000,0.210150,0.742600
0.030600,0.017200,0.210100,0.742100
0.031500,0.017150,0.210050,0.741300
0.031500,0.018300,0.209000,0.741200
0.032900,0.017550,0.209500,0.740050
0.034150,0.017150,0.208800,0.739900
0.034700,0.017100,0.207200,0.741000
0.035900,0.016900,0.206700,0.740500
0.036100,0.017500,0.205200,0.741200
0.036700,0.018700,0.202900,0.741700
0.038000,0.018900,0.202100,0.741000
0.038850,0.019500,0.199400,0.742250
0.039400,0.020050,0.197900,0.742650
0.039750,0.021100,0.196200,0.742950
0.038950,0.021500,0.194700,0.744850
0.040600,0.019900,0.194850,0.744650
0.041000,0.020450,0.193500,0.745050
0.039850,0.021300,0.191500,0.747350
0.040150,0.020800,0.190750,0.748300
0.040700,0.021700,0.188050,0.749550
0.041150,0.020700,0.187000,0.751150
0.041000,0.020950,0.186500,0.751550
0.041500,0.020300,0.185800,0.752400
0.041650,0.019600,0.185300,0.753450
0.040650,0.018750,0.185150,0.755450
0.040500,0.019250,0.184250,0.756000
0.041050,0.019450,0.182600,0.756900
0.041900,0.019500,0.180950,0.757650
0.040800,0.019150,0.180250,0.759800
0.040750,0.018900,0.178700,0.761650
0.041350,0.019900,0.177350,0.761400
0.040750,0.018800,0.177700,0.762750
0.040200,0.019950,0.176450,0.763400
0.038750,0.019900,0.176450,0.764900
0.039500,0.018950,0.176700,0.764850
0.040100,0.018600,0.176400,0.764900
0.039050,0.019000,0.176150,0.765800
0.039050,0.018700,0.175350,0.766900
0.039300,0.019450,0.174450,0.766800
0.039600,0.019050,0.173950,0.767400
0.039800,0.020100,0.173350,0.766750
0.039100,0.020350,0.172400,0.768150
0.038950,0.020650,0.171450,0.768950
0.039100,0.018800,0.172750,0.769350
0.039300,0.019250,0.172450,0.769000
0.039300,0.020900,0.170950,0.768850
0.040100,0.019550,0.172450,0.767900
0.040600,0.019200,0.171850,0.768350
0.040800,0.018900,0.171650,0.768650
0.040100,0.018950,0.172150,0.768800
0.038950,0.019500,0.172400,0.769150
0.038500,0.019200,0.172350,0.769950
0.038600,0.018950,0.172650,0.769800
0.039050,0.018200,0.173250,0.769500
0.040150,0.018000,0.172250,0.769600
0.039750,0.017750,0.171700,0.770800
0.038950,0.016700,0.172400,0.771950
0.038050,0.018750,0.170900,0.772300
0.038300,0.018700,0.170500,0.772500
0.038300,0.019300,0.170200,0.772200
0.038600,0.019050,0.169950,0.772400
0.039100,0.018200,0.170300,0.772400
0.037900,0.018950,0.169200,0.773950
0.038350,0.018150,0.169450,0.774050
0.037550,0.018000,0.169800,0.774650
0.036950,0.017950,0.169900,0.775200
0.037350,0.017450,0.170050,0.775150
0.037350,0.017450,0.170350,0.774850
0.036400,0.017750,0.171450,0.774400
0.036750,0.017700,0.172700,0.772850
0.036500,0.017250,0.173500,0.772750
0.036100,0.016500,0.174750,0.772650
0.035800,0.015850,0.175650,0.772700
0.035650,0.015700,0.175500,0.773150
0.034950,0.017050,0.174900,0.773100
0.034400,0.016250,0.175950,0.773400
0.034650,0.015750,0.175950,0.773650
0.034750,0.016650,0.175550,0.773050
0.034400,0.015700,0.176750,0.773150
0.033700,0.015850,0.177250,0.773200
0.032950,0.016600,0.178050,0.772400
0.033000,0.016450,0.178900,0.771650
0.033650,0.015950,0.179300,0.771100
0.033700,0.014900,0.180350,0.771050
0.032700,0.014750,0.181400,0.771150
0.031550,0.014850,0.181900,0.771700
0.031650,0.014850,0.182700,0.770800
0.030650,0.016500,0.182600,0.770250
0.031750,0.016100,0.181800,0.770350
0.032000,0.017000,0.181300,0.769700
0.032550,0.017200,0.182500,0.767750
0.033600,0.016550,0.182650,0.767200
0.034000,0.017100,0.181300,0.767600
0.034100,0.017050,0.181350,0.767500
0.033400,0.016900,0.181400,0.768300
0.033800,0.016000,0.182100,0.768100
0.033800,0.016200,0.182250,0.767750
0.032400,0.017300,0.182800,0.767500
0.033900,0.017050,0.183100,0.765950
0.033550,0.016700,0.185300,0.764450
0.034050,0.016350,0.185500,0.764100
0.034150,0.016150,0.185850,0.763850
0.033450,0.016400,0.185950,0.764200
0.032600,0.016350,0.186600,0.764450
0.033150,0.015800,0.187150,0.763900
0.032950,0.016700,0.185950,0.764400
0.031900,0.016850,0.186400,0.764850
0.031400,0.017050,0.186500,0.765050
0.032250,0.015500,0.187500,0.764750
0.032900,0.015150,0.187800,0.764150
0.033100,0.014850,0.187900,0.764150
0.032550,0.015150,0.188500,0.763800
0.031600,0.017150,0.187000,0.764250
0.032550,0.016350,0.187650,0.763450
0.031300,0.017150,0.187150,0.764400
0.031250,0.015800,0.188900,0.764050
0.031250,0.015700,0.189200,0.763850
0.030900,0.017000,0.188700,0.763400
0.031050,0.016150,0.190100,0.762700
0.031500,0.015850,0.188800,0.763850
0.030600,0.015250,0.189200,0.764950
0.030050,0.016350,0.189300,0.764300
0.030250,0.016400,0.189950,0.763400
0.031000,0.015850,0.190950,0.762200
0.031550,0.014850,0.192100,0.761500
0.031650,0.015200,0.193650,0.759500
0.032250,0.014750,0.194400,0.758600
0.031250,0.015500,0.193800,0.759450
0.032100,0.016300,0.193600,0.758000
0.032700,0.014600,0.194950,0.757750
0.032200,0.015250,0.195350,0.757200
0.032150,0.016350,0.194000,0.757500
0.031800,0.016450,0.193550,0.758200
0.032850,0.015700,0.194200,0.757250
0.032750,0.014900,0.194750,0.757600
0.032900,0.014650,0.194950,0.757500
0.031950,0.014550,0.195100,0.758400
0.031600,0.015600,0.194950,0.757850
0.031200,0.016300,0.194650,0.757850
0.030750,0.016550,0.195550,0.757150
0.030550,0.017050,0.196350,0.756050
0.032350,0.016650,0.196000,0.755000
0.031450,0.017150,0.196100,0.755300
0.032450,0.016300,0.195900,0.755350
0.032200,0.016700,0.195200,0.755900
0.033300,0.016250,0.194600,0.755850
0.032900,0.016650,0.195150,0.755300
0.033150,0.017300,0.193850,0.755700
0.033900,0.016600,0.194150,0.755350
0.033300,0.016750,0.194150,0.755800
0.033550,0.017900,0.192850,0.755700
0.033950,0.017900,0.192250,0.755900
0.034700,0.018400,0.191200,0.755700
0.035000,0.018600,0.190800,0.755600
0.036300,0.016950,0.191350,0.755400
0.035000,0.018750,0.190350,0.755900
0.035450,0.019450,0.189100,0.756000
0.035900,0.019000,0.188550,0.756550
0.037150,0.019250,0.187050,0.756550
0.038050,0.018600,0.186550,0.756800
0.038250,0.018600,0.186250,0.756900
0.037750,0.019100,0.186050,0.757100
0.038450,0.018800,0.185700,0.757050
0.038050,0.018700,0.184700,0.758550
0.037500,0.018550,0.184400,0.759550
0.037950,0.019600,0.182600,0.759850
0.038200,0.019400,0.181350,0.761050
0.038050,0.019350,0.180550,0.762050
0.037700,0.018550,0.180800,0.762950
0.038200,0.018200,0.180150,0.763450
0.037200,0.019400,0.179450,0.763950
0.036700,0.018950,0.179900,0.764450
0.036250,0.018550,0.180400,0.764800
0.035900,0.018700,0.179100,0.766300
0.035900,0.019800,0.178050,0.766250
0.036350,0.019900,0.177250,0.766500
0.036050,0.020350,0.175650,0.767950
0.037650,0.020400,0.174300,0.767650
0.037750,0.020450,0.173250,0.768550
0.038400,0.020350,0.171750,0.769500
0.039500,0.019100,0.170550,0.770850
0.038700,0.019350,0.169900,0.772050
0.038900,0.018500,0.169550,0.773050
0.038950,0.017950,0.169050,0.774050
0.038800,0.017400,0.168400,0.775400
0.038550,0.017550,0.168300,0.775600
0.038250,0.017750,0.168350,0.775650
0.037850,0.017950,0.168250,0.775950
0.038050,0.017250,0.169300,0.775400
0.038300,0.017350,0.169150,0.775200
0.038850,0.017200,0.170300,0.773650
0.038000,0.016450,0.170500,0.775050
0.037100,0.016850,0.170200,0.775850
0.037500,0.016550,0.170250,0.775700
0.036450,0.017000,0.170850,0.775700
0.036550,0.016200,0.171450,0.775800
0.034850,0.015800,0.171900,0.777450
0.034250,0.015950,0.173150,0.776650
0.034500,0.014500,0.173600,0.777400
0.034500,0.015050,0.172700,0.777750
0.033400,0.015400,0.172850,0.778350
0.032850,0.015050,0.174400,0.777700
0.032550,0.015500,0.174300,0.777650
0.032600,0.014550,0.175450,0.777400
0.031500,0.014400,0.176800,0.777300
0.031300,0.015000,0.177700,0.776000
0.030600,0.014750,0.178500,0.776150
0.030250,0.015700,0.178200,0.775850
0.029300,0.016500,0.178050,0.776150
0.030000,0.015300,0.178800,0.775900
0.030000,0.014800,0.179650,0.775550
0.030100,0.014250,0.180900,0.774750
0.030250,0.014050,0.181300,0.774400
0.030350,0.013700,0.182700,0.773250
0.030800,0.014000,0.184150,0.771050
0.029650,0.014150,0.185750,0.770450
0.030100,0.013800,0.186800,0.769300
0.029500,0.014300,0.187800,0.768400
0.029600,0.014500,0.188050,0.767850
0.028800,0.015300,0.188500,0.767400
0.029250,0.015950,0.188700,0.766100
0.029550,0.015700,0.188700,0.766050
0.030800,0.014600,0.189850,0.764750
0.031000,0.015350,0.190500,0.763150
0.030750,0.015300,0.191500,0.762450
0.030800,0.015050,0.193500,0.760650
0.031750,0.015000,0.193650,0.759600
0.031450,0.015450,0.193450,0.759650
0.032100,0.015300,0.193850,0.758750
0.031300,0.015000,0.195100,0.758600
0.032550,0.014800,0.195450,0.757200
0.032800,0.014850,0.195050,0.757300
0.033000,0.015000,0.195000,0.757000
0.031650,0.015850,0.195550,0.756950
0.031950,0.016950,0.195100,0.756000
0.031800,0.016550,0.196900,0.754750
0.031450,0.015050,0.198650,0.754850
0.031500,0.014550,0.199700,0.754250
0.030400,0.016650,0.198800,0.754150
0.031100,0.016450,0.199300,0.753150
0.031950,0.015900,0.200100,0.752050
0.031700,0.016550,0.200000,0.751750
0.032050,0.018150,0.198850,0.750950
0.033350,0.018600,0.198600,0.749450
0.033350,0.018250,0.199750,0.748650
0.033900,0.018700,0.198900,0.748500
0.034750,0.019250,0.197950,0.748050
0.036250,0.018950,0.197100,0.747700
0.036450,0.019500,0.195700,0.748350
0.037300,0.020400,0.194450,0.747850
0.037700,0.020050,0.193750,0.748500
0.037650,0.019650,0.194100,0.748600
0.037650,0.019100,0.194350,0.748900
0.037750,0.020800,0.192650,0.748800
0.038700,0.020000,0.192350,0.748950
0.039350,0.019050,0.192350,0.749250
0.038900,0.019700,0.191300,0.750100
0.038750,0.020350,0.190300,0.750600
0.039600,0.020450,0.189950,0.750000
0.040500,0.020050,0.189550,0.749900
0.040350,0.020200,0.189500,0.749950
0.040500,0.019450,0.190000,0.750050
0.039550,0.020000,0.189750,0.750700
0.039250,0.020600,0.188500,0.751650
0.039650,0.021650,0.187800,0.750900
0.042000,0.020250,0.187100,0.750650
0.042800,0.020600,0.185900,0.750700
0.041700,0.020550,0.185700,0.752050
0.041250,0.021550,0.183650,0.753550
0.042100,0.021050,0.184000,0.752850
0.041650,0.020350,0.182800,0.755200
0.041250,0.020350,0.182900,0.755500
0.041650,0.020700,0.182300,0.755350
0.041900,0.021250,0.181950,0.754900
0.043250,0.019750,0.181900,0.755100
0.043650,0.019550,0.181050,0.755750
0.044150,0.019750,0.179700,0.756400
0.043950,0.020300,0.177500,0.758250
0.042400,0.020850,0.176600,0.760150
0.042050,0.021400,0.176050,0.760500
0.040900,0.021850,0.175450,0.761800
0.043000,0.020650,0.174950,0.761400
0.043350,0.020650,0.173500,0.762500
0.042350,0.020250,0.174200,0.763200
0.041500,0.020750,0.174500,0.763250
0.040700,0.021500,0.173750,0.764050
0.041300,0.020050,0.173600,0.765050
0.040550,0.020100,0.172900,0.766450
0.040300,0.020150,0.172400,0.767150
0.040400,0.018750,0.173500,0.767350
0.039750,0.019200,0.172800,0.768250
0.040000,0.018850,0.172800,0.768350
0.038400,0.019000,0.172100,0.770500
0.037600,0.019250,0.172000,0.771150
0.038100,0.017950,0.172250,0.771700
0.037050,0.018500,0.171600,0.772850
0.037700,0.018550,0.170400,0.773350
0.038250,0.018250,0.170700,0.772800
0.037550,0.019050,0.171350,0.772050
0.038550,0.018200,0.172250,0.771000
0.038500,0.018600,0.171400,0.771500
0.038600,0.019350,0.171250,0.770800
0.038450,0.019300,0.171700,0.770550
0.038300,0.018900,0.172550,0.770250
0.037800,0.018950,0.172750,0.770500
0.037250,0.018350,0.171750,0.772650
0.036250,0.018450,0.172300,0.773000
0.035800,0.017700,0.172850,0.773650
0.036750,0.016950,0.173550,0.772750
0.036450,0.016700,0.173950,0.772900
0.035050,0.017450,0.173900,0.773600
0.034450,0.018100,0.173650,0.773800
0.034550,0.017250,0.174550,0.773650
0.035700,0.016000,0.175500,0.772800
0.034850,0.015800,0.176200,0.773150
0.033450,0.016150,0.176800,0.773600
0.033100,0.015650,0.178150,0.773100
0.033200,0.015500,0.178450,0.772850
0.032600,0.015750,0.179200,0.772450
0.032050,0.016200,0.180050,0.771700
0.032700,0.015550,0.180900,0.770850
0.033100,0.016450,0.180050,0.770400
0.032400,0.016950,0.180500,0.770150
0.033000,0.016750,0.181400,0.768850
0.033300,0.015900,0.182500,0.768300
0.033850,0.017000,0.181850,0.767300
0.034500,0.017400,0.181600,0.766500
0.034950,0.017600,0.181700,0.765750
0.034150,0.017850,0.181700,0.766300
0.033650,0.017900,0.180900,0.767550
0.034700,0.016550,0.181400,0.767350
0.034150,0.016950,0.182400,0.766500
0.035000,0.016900,0.181950,0.766150
0.035350,0.016950,0.181600,0.766100
0.035850,0.017450,0.180850,0.765850
0.035150,0.017750,0.181100,0.766000
0.035550,0.018150,0.181000,0.765300
0.035900,0.017500,0.181250,0.765350
0.036900,0.017200,0.180800,0.765100
0.036250,0.016200,0.182700,0.764850
0.036100,0.015600,0.182550,0.765750
0.035600,0.017750,0.182300,0.764350
0.035650,0.018250,0.182100,0.764000
0.035950,0.017950,0.181850,0.764250
0.035800,0.018450,0.181250,0.764500
0.036250,0.018100,0.182000,0.763650
0.035650,0.020050,0.181450,0.762850
0.036800,0.019450,0.180800,0.762950
0.038700,0.018850,0.180100,0.762350
0.038700,0.018950,0.180600,0.761750
0.038950,0.019650,0.179700,0.761700
0.039400,0.020300,0.178850,0.761450
0.039250,0.019850,0.178500,0.762400
0.039550,0.019850,0.178050,0.762550
0.039650,0.019250,0.177350,0.763750
0.040550,0.019300,0.176500,0.763650
0.040450,0.020100,0.176150,0.763300
0.040350,0.019500,0.176650,0.763500
0.041050,0.019600,0.175450,0.763900
0.041500,0.018750,0.174750,0.765000
0.041250,0.019150,0.174450,0.765150
0.041650,0.018550,0.173550,0.766250
0.041250,0.018600,0.173400,0.766750
0.040450,0.018800,0.173500,0.767250
0.040300,0.018900,0.173500,0.767300
0.039600,0.018900,0.173750,0.767750
0.039900,0.018250,0.173350,0.768500
0.038250,0.019300,0.172850,0.769600
0.038250,0.019200,0.172250,0.770300
0.038100,0.018550,0.172200,0.771150
0.037900,0.019300,0.170850,0.771950
0.038400,0.019400,0.170100,0.772100
0.038150,0.018750,0.169200,0.773900
0.036750,0.017950,0.170000,0.775300
0.036800,0.016750,0.171150,0.775300
0.036500,0.016900,0.171000,0.775600
0.034550,0.017100,0.171600,0.776750
0.033550,0.016300,0.172450,0.777700
0.034100,0.016200,0.173050,0.776650
0.034000,0.015150,0.174050,0.776800
0.034650,0.014550,0.175050,0.775750
0.036600,0.014350,0.174650,0.774400
0.034800,0.014950,0.175500,0.774750
0.034050,0.015700,0.175900,0.774350
0.033550,0.015100,0.177700,0.773650
0.033050,0.014600,0.179200,0.773150
0.032500,0.015400,0.179650,0.772450
0.032450,0.016100,0.181250,0.770200
0.032300,0.016950,0.181100,0.769650
0.032300,0.015900,0.182050,0.769750
0.032600,0.015350,0.182950,0.769100
0.033550,0.015550,0.183250,0.767650
0.033100,0.017250,0.182600,0.767050
0.032550,0.017050,0.183300,0.767100
0.033050,0.017100,0.184550,0.765300
0.034050,0.017700,0.183750,0.764500
0.034500,0.017450,0.184450,0.763600
0.033800,0.016500,0.183800,0.765900
0.033700,0.017550,0.183300,0.765450
0.035100,0.017650,0.182900,0.764350
0.035200,0.017450,0.182800,0.764550
0.034800,0.017500,0.183800,0.763900
0.034800,0.017150,0.183300,0.764750
0.034900,0.015700,0.184600,0.764800
0.033650,0.017100,0.184100,0.765150
0.033550,0.016400,0.185150,0.764900
0.033600,0.017950,0.184400,0.764050
0.035500,0.016600,0.183150,0.764750
