time_results/time_results_java.txt:
real: 36.68575, user: 36.73, sys: 36.73

time_results/time_results_ruby.txt:
real: 1279.21, user: 1276.512875, sys: 2.5875000000000004

time_results/time_results_python.txt:
real: 673.7360833333333, user: 673.6764166666666, sys: 0.005083333333333334

time_results/time_results_cppO3.txt:
real: 194.60219999999998, user: 194.5892, sys: 0.0008

time_results/time_results_cO2.txt:
real: 73.49333333333333, user: 73.48633333333333, sys: 0.00175

time_results/time_results_cppO2.txt:
real: 194.5976, user: 194.58160000000004, sys: 0.0016

time_results/time_results_cpp.txt:
real: 194.66449999999998, user: 194.6491666666667, sys: 0.0006666666666666666

time_results/time_results_cO3.txt:
real: 73.49640000000001, user: 73.4906, sys: 0.0002

time_results/time_results_c.txt:
real: 73.44008333333333, user: 73.43341666666667, sys: 0.0013333333333333333

