I,E,S,R
0.001000,0.000450,0.998550,0.000000
0.001150,0.001250,0.997500,0.000100
0.001450,0.001700,0.996700,0.000150
0.001800,0.002700,0.995200,0.000300
0.002300,0.003350,0.993700,0.000650
0.002850,0.004300,0.991850,0.001000
0.003900,0.005100,0.989800,0.001200
0.004850,0.006050,0.987300,0.001800
0.005750,0.008650,0.983100,0.002500
0.007800,0.011600,0.977450,0.003150
0.010000,0.014500,0.971150,0.004350
0.012000,0.019400,0.962350,0.006250
0.015250,0.024450,0.952550,0.007750
0.020750,0.029850,0.940050,0.009350
0.026700,0.037800,0.924000,0.011500
0.033250,0.048750,0.902100,0.015900
0.044050,0.063000,0.872650,0.020300
0.057400,0.077950,0.838050,0.026600
0.072250,0.095600,0.797100,0.035050
0.089650,0.118700,0.747000,0.044650
0.109100,0.143050,0.690650,0.057200
0.139300,0.162850,0.627950,0.069900
0.166700,0.186600,0.557800,0.088900
0.198500,0.213400,0.478350,0.109750
0.232650,0.225200,0.407350,0.134800
0.266100,0.231400,0.334900,0.167600
0.296450,0.233450,0.266750,0.203350
0.324100,0.225450,0.208450,0.242000
0.346150,0.211500,0.159300,0.283050
0.360700,0.192550,0.120450,0.326300
0.370000,0.167150,0.090700,0.372150
0.368900,0.140700,0.068850,0.421550
0.362650,0.115800,0.051950,0.469600
0.346900,0.095250,0.040950,0.516900
0.327400,0.077800,0.032750,0.562050
0.305600,0.062200,0.027050,0.605150
0.281600,0.051550,0.023150,0.643700
0.259300,0.040700,0.020600,0.679400
0.237150,0.032100,0.019700,0.711050
0.215550,0.025550,0.019200,0.739700
0.195450,0.021150,0.018900,0.764500
0.175050,0.017400,0.018600,0.788950
0.157200,0.014650,0.018850,0.809300
0.141600,0.011850,0.020150,0.826400
0.125250,0.010800,0.020400,0.843550
0.110650,0.009600,0.021400,0.858350
0.097950,0.008300,0.022450,0.871300
0.087350,0.006800,0.023900,0.881950
0.076150,0.005750,0.025950,0.892150
0.066650,0.005250,0.027550,0.900550
0.059750,0.005050,0.029150,0.906050
0.052700,0.005400,0.030150,0.911750
0.047250,0.004600,0.032150,0.916000
0.042200,0.003400,0.035050,0.919350
0.037650,0.003100,0.038050,0.921200
0.034100,0.002800,0.040600,0.922500
0.030900,0.002750,0.042950,0.923400
0.026350,0.002800,0.045000,0.925850
0.023150,0.002900,0.047700,0.926250
0.020350,0.002500,0.049950,0.927200
0.018250,0.002700,0.052800,0.926250
0.016650,0.003250,0.055550,0.924550
0.015350,0.003000,0.058150,0.923500
0.013950,0.002800,0.060850,0.922400
0.012650,0.002450,0.062900,0.922000
0.011400,0.002000,0.065450,0.921150
0.010400,0.002000,0.068150,0.919450
0.009600,0.001950,0.071650,0.916800
0.008450,0.001900,0.074200,0.915450
0.007850,0.001750,0.076850,0.913550
0.007550,0.001700,0.080050,0.910700
0.006900,0.001750,0.082900,0.908450
0.006650,0.001300,0.085800,0.906250
0.006450,0.001350,0.088500,0.903700
0.005850,0.001400,0.090850,0.901900
0.004900,0.001650,0.093300,0.900150
0.004200,0.001400,0.096700,0.897700
0.003800,0.001200,0.099350,0.895650
0.004100,0.001050,0.102500,0.892350
0.003550,0.001250,0.104850,0.890350
0.003650,0.001100,0.107750,0.887500
0.003600,0.000950,0.110300,0.885150
0.003650,0.000950,0.113300,0.882100
0.003450,0.000950,0.115800,0.879800
0.003100,0.000850,0.118700,0.877350
0.003000,0.000950,0.120850,0.875200
0.002750,0.001150,0.123000,0.873100
0.002600,0.001600,0.125000,0.870800
0.002600,0.001500,0.127400,0.868500
0.002900,0.001150,0.130300,0.865650
0.003000,0.000950,0.133250,0.862800
0.002950,0.000800,0.135700,0.860550
0.002900,0.001300,0.137850,0.857950
0.002800,0.001500,0.139900,0.855800
0.003000,0.001300,0.142150,0.853550
0.002900,0.001200,0.144400,0.851500
0.003050,0.000800,0.147000,0.849150
0.002650,0.001150,0.148650,0.847550
0.002350,0.001250,0.151200,0.845200
0.002250,0.001150,0.153300,0.843300
0.002050,0.001450,0.155200,0.841300
0.002100,0.001400,0.157150,0.839350
0.001950,0.001400,0.159150,0.837500
0.002250,0.001100,0.162100,0.834550
0.002050,0.000900,0.165250,0.831800
0.001900,0.001100,0.167450,0.829550
0.002050,0.000850,0.170700,0.826400
0.002150,0.000800,0.172850,0.824200
0.002150,0.000650,0.175400,0.821800
0.001900,0.000800,0.177550,0.819750
0.002250,0.000500,0.180000,0.817250
0.002150,0.000500,0.182350,0.815000
0.002100,0.000550,0.184100,0.813250
0.001950,0.000750,0.185950,0.811350
0.001850,0.000750,0.188550,0.808850
0.001900,0.000750,0.191100,0.806250
0.002100,0.000800,0.193050,0.804050
0.002500,0.000600,0.194900,0.802000
0.002350,0.000800,0.197600,0.799250
0.002150,0.001100,0.198850,0.797900
0.002100,0.001200,0.200950,0.795750
0.002250,0.001300,0.202600,0.793850
0.002350,0.001350,0.204400,0.791900
0.002550,0.001250,0.206600,0.789600
0.002650,0.001150,0.208900,0.787300
0.002600,0.001050,0.210850,0.785500
0.002200,0.001000,0.213250,0.783550
0.002100,0.000950,0.215600,0.781350
0.002250,0.001200,0.217700,0.778850
0.002250,0.001050,0.220300,0.776400
0.002350,0.001100,0.222300,0.774250
0.002350,0.001000,0.223850,0.772800
0.002100,0.001150,0.226150,0.770600
0.002050,0.001000,0.227950,0.769000
0.002150,0.000750,0.230150,0.766950
0.002100,0.000750,0.232800,0.764350
0.002000,0.001100,0.234500,0.762400
0.001750,0.001100,0.236200,0.760950
0.002150,0.001200,0.237700,0.758950
0.002200,0.001500,0.239000,0.757300
0.001850,0.001400,0.241500,0.755250
0.001950,0.001500,0.243050,0.753500
0.002150,0.001450,0.244950,0.751450
0.002350,0.001200,0.247600,0.748850
0.002200,0.001450,0.248950,0.747400
0.002350,0.001600,0.250800,0.745250
0.002250,0.001500,0.253000,0.743250
0.002450,0.001650,0.254900,0.741000
0.002500,0.001500,0.256600,0.739400
0.002250,0.001800,0.257900,0.738050
0.002450,0.001450,0.260400,0.735700
0.002550,0.001400,0.261750,0.734300
0.002950,0.001600,0.262850,0.732600
0.003000,0.001750,0.264400,0.730850
0.003100,0.002050,0.266000,0.728850
0.003200,0.001750,0.267650,0.727400
0.003400,0.001800,0.269550,0.725250
0.003350,0.002200,0.270350,0.724100
0.003650,0.002300,0.271700,0.722350
0.003950,0.002400,0.273050,0.720600
0.004200,0.002050,0.274550,0.719200
0.004250,0.002950,0.275850,0.716950
0.004850,0.002550,0.277750,0.714850
0.004650,0.002800,0.278450,0.714100
0.005100,0.003050,0.279100,0.712750
0.005150,0.003400,0.279650,0.711800
0.005150,0.003650,0.280450,0.710750
0.005500,0.003500,0.281700,0.709300
0.005900,0.003800,0.282350,0.707950
0.006250,0.004150,0.283050,0.706550
0.006750,0.004300,0.283600,0.705350
0.006850,0.005100,0.283800,0.704250
0.007450,0.005150,0.283900,0.703500
0.008100,0.005600,0.283850,0.702450
0.008950,0.005650,0.284400,0.701000
0.009550,0.006000,0.284600,0.699850
0.009800,0.006450,0.284650,0.699100
0.009950,0.006850,0.285600,0.697600
0.010350,0.007850,0.285350,0.696450
0.011300,0.007850,0.285200,0.695650
0.011950,0.007800,0.285700,0.694550
0.012900,0.008000,0.284900,0.694200
0.013150,0.008900,0.284250,0.693700
0.013800,0.009600,0.283550,0.693050
0.015150,0.009850,0.282800,0.692200
0.016200,0.010500,0.281000,0.692300
0.017550,0.010800,0.280200,0.691450
0.018250,0.012400,0.277600,0.691750
0.020050,0.012900,0.275600,0.691450
0.020400,0.013850,0.273650,0.692100
0.022200,0.013400,0.271850,0.692550
0.023950,0.013650,0.270050,0.692350
0.025250,0.015050,0.267150,0.692550
0.026650,0.014850,0.265450,0.693050
0.028150,0.015100,0.262800,0.693950
0.029000,0.016300,0.259900,0.694800
0.029500,0.018450,0.255900,0.696150
0.030250,0.019650,0.252300,0.697800
0.032100,0.019550,0.248850,0.699500
0.034200,0.019200,0.244850,0.701750
0.035150,0.020050,0.240150,0.704650
0.036550,0.020600,0.236250,0.706600
0.039450,0.021500,0.230500,0.708550
0.039500,0.022950,0.225750,0.711800
0.041150,0.023250,0.221700,0.713900
0.042850,0.022600,0.217750,0.716800
0.043250,0.022750,0.213750,0.720250
0.044550,0.023950,0.208250,0.723250
0.045500,0.024950,0.203100,0.726450
0.045200,0.024900,0.197300,0.732600
0.046350,0.023400,0.194200,0.736050
0.046250,0.025300,0.188800,0.739650
0.047650,0.024850,0.185000,0.742500
0.048250,0.024050,0.181350,0.746350
0.047500,0.023100,0.177800,0.751600
0.046950,0.022300,0.175150,0.755600
0.046300,0.023400,0.170550,0.759750
0.047000,0.022250,0.167900,0.762850
0.047300,0.019950,0.165950,0.766800
0.047950,0.020000,0.163450,0.768600
0.046550,0.021450,0.160050,0.771950
0.046350,0.021750,0.157150,0.774750
0.045600,0.021650,0.154450,0.778300
0.046400,0.019900,0.153000,0.780700
0.045850,0.019500,0.151200,0.783450
0.045950,0.018400,0.149700,0.785950
0.046100,0.018650,0.147900,0.787350
0.044250,0.020050,0.145200,0.790500
0.043400,0.019750,0.142650,0.794200
0.043150,0.018700,0.141350,0.796800
0.042900,0.018100,0.140350,0.798650
0.041400,0.017900,0.139750,0.800950
0.041000,0.017150,0.139800,0.802050
0.040250,0.015850,0.140450,0.803450
0.038050,0.015800,0.139950,0.806200
0.037250,0.015400,0.139750,0.807600
0.036450,0.015000,0.139450,0.809100
0.036600,0.013900,0.139850,0.809650
0.035450,0.013050,0.140450,0.811050
0.034900,0.012800,0.140550,0.811750
0.033400,0.013250,0.140050,0.813300
0.031400,0.012500,0.141500,0.814600
0.031100,0.011800,0.141850,0.815250
0.031550,0.010650,0.143900,0.813900
0.029950,0.011400,0.143750,0.814900
0.028550,0.011350,0.145400,0.814700
0.027700,0.010600,0.147300,0.814400
0.026900,0.009950,0.150100,0.813050
0.026350,0.010400,0.150700,0.812550
0.026000,0.010300,0.151600,0.812100
0.024400,0.010800,0.153250,0.811550
0.023700,0.011250,0.154800,0.810250
0.022850,0.011150,0.155600,0.810400
0.023450,0.010550,0.156750,0.809250
0.023450,0.010000,0.158400,0.808150
0.022750,0.010550,0.160650,0.806050
0.022400,0.010100,0.162300,0.805200
0.022550,0.009700,0.163550,0.804200
0.023200,0.008950,0.164700,0.803150
0.023200,0.009200,0.165950,0.801650
0.021950,0.009600,0.167650,0.800800
0.022350,0.009650,0.169000,0.799000
0.021450,0.010450,0.170300,0.797800
0.021400,0.010150,0.172050,0.796400
0.022500,0.008800,0.173450,0.795250
0.021900,0.008950,0.175000,0.794150
0.021300,0.009300,0.176250,0.793150
0.021000,0.009100,0.177300,0.792600
0.020600,0.009350,0.178800,0.791250
0.021000,0.009150,0.179750,0.790100
0.020500,0.009800,0.181550,0.788150
0.020950,0.009100,0.183050,0.786900
0.021200,0.009200,0.183950,0.785650
0.021300,0.008850,0.185850,0.784000
0.020550,0.009250,0.187100,0.783100
0.019950,0.010300,0.187950,0.781800
0.020150,0.010000,0.189150,0.780700
0.019700,0.009950,0.191050,0.779300
0.019650,0.010550,0.191100,0.778700
0.020200,0.011000,0.192100,0.776700
0.019950,0.011050,0.192400,0.776600
0.020300,0.010950,0.192350,0.776400
0.020550,0.011200,0.193050,0.775200
0.020650,0.011400,0.193400,0.774550
0.021350,0.011600,0.193950,0.773100
0.022050,0.010650,0.195300,0.772000
0.022600,0.010700,0.196400,0.770300
0.023350,0.010750,0.197350,0.768550
0.024350,0.011550,0.197250,0.766850
0.024000,0.011300,0.199550,0.765150
0.024250,0.013700,0.199600,0.762450
0.024900,0.013150,0.200850,0.761100
0.024600,0.013850,0.201200,0.760350
0.025750,0.012950,0.202000,0.759300
0.026550,0.012450,0.202600,0.758400
0.026450,0.013050,0.202550,0.757950
0.026100,0.013000,0.203300,0.757600
0.026000,0.014150,0.202950,0.756900
0.026400,0.014300,0.202800,0.756500
0.027350,0.015400,0.201700,0.755550
0.028050,0.014850,0.202600,0.754500
0.028750,0.015550,0.201700,0.754000
0.029050,0.015750,0.201100,0.754100
0.029750,0.016700,0.199900,0.753650
0.030750,0.016200,0.200550,0.752500
0.030700,0.015900,0.201000,0.752400
0.031050,0.016050,0.201350,0.751550
0.030950,0.016000,0.200200,0.752850
0.029900,0.016200,0.200800,0.753100
0.029800,0.016800,0.200550,0.752850
0.030750,0.016900,0.199900,0.752450
0.031250,0.016950,0.199850,0.751950
0.032650,0.016950,0.198800,0.751600
0.033450,0.017050,0.198500,0.751000
0.034150,0.016950,0.197250,0.751650
0.034100,0.016550,0.197400,0.751950
0.034650,0.016700,0.196650,0.752000
0.035450,0.017250,0.195350,0.751950
0.034400,0.018050,0.194050,0.753500
0.035250,0.017450,0.192550,0.754750
0.035600,0.018700,0.191450,0.754250
0.036200,0.017750,0.190400,0.755650
0.036200,0.017800,0.189400,0.756600
0.036600,0.018000,0.188000,0.757400
0.037850,0.016700,0.187650,0.757800
0.037750,0.016900,0.186850,0.758500
0.037250,0.016800,0.186650,0.759300
0.036750,0.016900,0.186500,0.759850
0.036750,0.016400,0.187000,0.759850
0.037300,0.017150,0.185950,0.759600
0.037100,0.016200,0.186600,0.760100
0.037100,0.015600,0.187000,0.760300
0.036800,0.016550,0.186550,0.760100
0.037000,0.016900,0.186250,0.759850
0.037450,0.017700,0.185100,0.759750
0.036650,0.017700,0.185950,0.759700
0.036250,0.018700,0.184900,0.760150
0.036850,0.018750,0.185150,0.759250
0.036900,0.019500,0.183650,0.759950
0.038400,0.019800,0.182900,0.758900
0.038200,0.020450,0.181550,0.759800
0.039500,0.019800,0.180400,0.760300
0.040600,0.020200,0.178300,0.760900
0.039850,0.020800,0.177750,0.761600
0.039800,0.020700,0.176800,0.762700
0.041150,0.019050,0.177600,0.762200
0.042050,0.018150,0.176700,0.763100
0.040500,0.018500,0.176450,0.764550
0.040350,0.019050,0.175300,0.765300
0.040200,0.018200,0.175600,0.766000
0.040550,0.016800,0.175250,0.767400
0.039750,0.017450,0.175250,0.767550
0.039200,0.017600,0.175550,0.767650
0.039650,0.017300,0.174850,0.768200
0.039050,0.017600,0.175250,0.768100
0.039750,0.016900,0.175500,0.767850
0.038750,0.017650,0.175550,0.768050
0.038950,0.017050,0.175600,0.768400
0.038700,0.016350,0.175950,0.769000
0.038800,0.016350,0.175950,0.768900
0.037200,0.016800,0.176000,0.770000
0.037050,0.016550,0.177100,0.769300
0.036050,0.017500,0.176200,0.770250
0.037200,0.015050,0.177850,0.769900
0.036550,0.014700,0.177700,0.771050
0.034800,0.016450,0.177150,0.771600
0.034700,0.016450,0.177800,0.771050
0.034200,0.016950,0.178550,0.770300
0.034200,0.016300,0.178250,0.771250
0.034550,0.016600,0.178000,0.770850
0.034750,0.015750,0.178650,0.770850
0.033600,0.016250,0.178800,0.771350
0.033700,0.015300,0.180150,0.770850
0.033400,0.016200,0.181250,0.769150
0.032600,0.015750,0.182550,0.769100
0.033200,0.016000,0.182100,0.768700
0.034500,0.016600,0.181800,0.767100
0.034750,0.015350,0.183200,0.766700
0.034400,0.015650,0.184000,0.765950
0.034050,0.017000,0.183350,0.765600
0.035300,0.016100,0.183750,0.764850
0.035700,0.016700,0.183200,0.764400
0.035950,0.016650,0.183950,0.763450
0.034850,0.017050,0.185150,0.762950
0.035300,0.015400,0.186650,0.762650
0.035350,0.016500,0.186250,0.761900
0.035150,0.016650,0.187250,0.760950
0.035400,0.017550,0.185850,0.761200
0.035650,0.016900,0.186350,0.761100
0.035850,0.017300,0.186150,0.760700
0.035550,0.016550,0.186550,0.761350
0.034500,0.017600,0.185750,0.762150
0.034600,0.018250,0.184750,0.762400
0.034250,0.018650,0.183850,0.763250
0.034700,0.017650,0.185000,0.762650
0.034350,0.017900,0.183200,0.764550
0.035200,0.017150,0.183200,0.764450
0.034000,0.016150,0.184300,0.765550
0.033650,0.015850,0.184200,0.766300
0.034000,0.015250,0.184650,0.766100
0.032750,0.015950,0.184300,0.767000
0.033700,0.015750,0.184000,0.766550
0.032800,0.015950,0.184200,0.767050
0.033050,0.016550,0.183350,0.767050
0.033950,0.015650,0.183850,0.766550
0.034700,0.015550,0.184150,0.765600
0.035350,0.015650,0.184500,0.764500
0.034450,0.015600,0.184050,0.765900
0.034400,0.015500,0.185550,0.764550
0.034400,0.015900,0.184900,0.764800
0.034450,0.016100,0.184000,0.765450
0.033300,0.016600,0.183900,0.766200
0.034050,0.016700,0.183000,0.766250
0.034150,0.016900,0.182850,0.766100
0.034800,0.017500,0.182300,0.765400
0.035450,0.017500,0.181800,0.765250
0.036300,0.017200,0.181800,0.764700
0.035300,0.017450,0.181400,0.765850
0.034200,0.017950,0.180600,0.767250
0.033850,0.017050,0.180900,0.768200
0.035100,0.016050,0.182750,0.766100
0.034800,0.016700,0.181950,0.766550
0.034650,0.016850,0.182150,0.766350
0.035150,0.016900,0.181500,0.766450
0.035700,0.016100,0.181400,0.766800
0.035400,0.016700,0.181550,0.766350
0.035750,0.016950,0.180700,0.766600
0.036350,0.015900,0.180700,0.767050
0.036150,0.015850,0.181500,0.766500
0.035800,0.015750,0.182200,0.766250
0.035350,0.017850,0.180700,0.766100
0.035200,0.018300,0.181100,0.765400
0.036200,0.017000,0.180950,0.765850
0.034650,0.017000,0.181650,0.766700
0.034400,0.016950,0.182100,0.766550
0.034150,0.016850,0.182300,0.766700
0.033050,0.016600,0.183650,0.766700
0.032500,0.016350,0.183500,0.767650
0.033100,0.015150,0.184150,0.767600
0.032450,0.015650,0.184100,0.767800
0.032500,0.016350,0.183350,0.767800
0.034200,0.014950,0.183850,0.767000
0.033850,0.015500,0.183350,0.767300
0.033550,0.015900,0.184200,0.766350
0.034150,0.016000,0.183100,0.766750
0.032900,0.016700,0.182950,0.767450
0.032850,0.017550,0.181450,0.768150
0.032700,0.018000,0.180800,0.768500
0.032900,0.018950,0.179800,0.768350
0.033650,0.018900,0.179250,0.768200
0.034200,0.017200,0.179150,0.769450
0.035600,0.015800,0.179850,0.768750
0.034850,0.016750,0.179800,0.768600
0.034850,0.016550,0.180100,0.768500
0.034400,0.016800,0.179650,0.769150
0.034400,0.016650,0.180100,0.768850
0.034200,0.016250,0.179650,0.769900
0.034400,0.016200,0.180250,0.769150
0.034300,0.016550,0.180250,0.768900
0.034350,0.017700,0.178100,0.769850
0.033900,0.018650,0.177750,0.769700
0.034100,0.017700,0.177500,0.770700
0.035050,0.016150,0.178350,0.770450
0.036100,0.016200,0.177400,0.770300
0.034450,0.017100,0.177500,0.770950
0.035900,0.016250,0.177200,0.770650
0.036050,0.016150,0.177100,0.770700
0.036150,0.016800,0.177000,0.770050
0.036900,0.017100,0.176700,0.769300
0.036700,0.018300,0.175200,0.769800
0.038100,0.017250,0.174300,0.770350
0.037900,0.016800,0.173500,0.771800
0.037600,0.016150,0.173550,0.772700
0.037750,0.016050,0.173850,0.772350
0.036750,0.016550,0.173050,0.773650
0.037750,0.015800,0.173350,0.773100
0.037050,0.016650,0.173400,0.772900
0.036050,0.016900,0.173000,0.774050
0.036750,0.016250,0.173600,0.773400
0.036750,0.016950,0.173400,0.772900
0.036750,0.017200,0.173650,0.772400
0.037200,0.016700,0.173800,0.772300
0.037650,0.016350,0.173300,0.772700
0.036150,0.016350,0.174250,0.773250
0.036500,0.016600,0.174200,0.772700
0.036650,0.015950,0.174350,0.773050
0.035600,0.017700,0.173500,0.773200
0.035250,0.017400,0.173400,0.773950
0.036550,0.016650,0.172400,0.774400
0.037200,0.016750,0.172350,0.773700
0.036600,0.017350,0.171700,0.774350
0.037150,0.017100,0.172200,0.773550
0.036800,0.017350,0.172300,0.773550
0.036650,0.016750,0.171800,0.774800
0.037000,0.016550,0.172300,0.774150
0.036500,0.017150,0.171950,0.774400
0.037050,0.017200,0.171200,0.774550
0.036800,0.017050,0.170700,0.775450
0.037100,0.016150,0.171800,0.774950
0.036600,0.016200,0.171950,0.775250
0.035950,0.016900,0.171400,0.775750
0.035950,0.017250,0.171100,0.775700
0.036050,0.016900,0.171700,0.775350
0.036000,0.017500,0.171200,0.775300
0.036350,0.017650,0.170600,0.775400
0.036800,0.016950,0.170650,0.775600
0.036550,0.016950,0.169250,0.777250
0.036650,0.017050,0.168400,0.777900
0.037600,0.017400,0.167450,0.777550
0.037450,0.016400,0.167950,0.778200
0.037250,0.016350,0.168000,0.778400
0.037350,0.015450,0.168800,0.778400
0.036400,0.016250,0.168450,0.778900
0.036500,0.015400,0.168100,0.780000
0.036800,0.015150,0.168850,0.779200
0.035200,0.016700,0.167950,0.780150
0.034600,0.015450,0.169150,0.780800
0.034850,0.014650,0.170450,0.780050
0.033500,0.015400,0.170750,0.780350
0.033650,0.015450,0.171200,0.779700
0.033600,0.014450,0.173000,0.778950
0.032750,0.015250,0.172850,0.779150
0.033000,0.015900,0.172900,0.778200
0.033650,0.016050,0.173550,0.776750
0.033500,0.015900,0.174250,0.776350
0.034250,0.015800,0.174700,0.775250
0.035050,0.014950,0.174700,0.775300
0.034400,0.015700,0.173600,0.776300
0.033250,0.016700,0.174200,0.775850
0.033200,0.016950,0.174600,0.775250
0.033300,0.016550,0.176150,0.774000
0.033200,0.015300,0.177200,0.774300
0.033050,0.016150,0.176650,0.774150
0.032350,0.016300,0.177400,0.773950
0.032300,0.016100,0.178000,0.773600
0.032500,0.014500,0.179600,0.773400
0.031350,0.015250,0.180900,0.772500
0.032800,0.014750,0.181950,0.770500
0.032150,0.015150,0.182650,0.770050
0.032250,0.014800,0.184150,0.768800
0.033400,0.014500,0.185150,0.766950
0.033650,0.015250,0.185700,0.765400
0.033550,0.016050,0.186050,0.764350
0.032800,0.015850,0.186200,0.765150
0.032550,0.015900,0.186950,0.764600
0.033100,0.016050,0.186100,0.764750
0.033600,0.016700,0.185650,0.764050
0.034350,0.016900,0.185550,0.763200
0.034950,0.017250,0.185400,0.762400
0.034900,0.017800,0.185200,0.762100
0.035100,0.017850,0.184400,0.762650
0.035300,0.017950,0.183450,0.763300
0.035500,0.018200,0.183550,0.762750
0.035650,0.017500,0.183350,0.763500
0.036450,0.018050,0.182100,0.763400
0.036050,0.018650,0.181700,0.763600
0.036100,0.019350,0.181850,0.762700
0.036850,0.019600,0.182100,0.761450
0.037200,0.019500,0.181550,0.761750
0.038050,0.019100,0.181050,0.761800
0.038650,0.018050,0.181450,0.761850
0.038400,0.018250,0.180950,0.762400
0.037900,0.019800,0.179600,0.762700
0.037900,0.020650,0.179250,0.762200
0.038950,0.019350,0.179000,0.762700
0.038950,0.019500,0.178350,0.763200
0.039050,0.018850,0.177850,0.764250
0.038600,0.018650,0.177650,0.765100
0.038450,0.018400,0.177800,0.765350
0.039350,0.016750,0.178250,0.765650
0.039600,0.017850,0.176850,0.765700
0.038600,0.018450,0.176700,0.766250
0.039150,0.017900,0.176800,0.766150
0.038550,0.017350,0.176800,0.767300
0.037800,0.018250,0.176400,0.767550
0.036650,0.019500,0.176300,0.767550
0.037050,0.018050,0.177300,0.767600
0.038900,0.017400,0.178000,0.765700
0.038200,0.018300,0.177550,0.765950
0.038100,0.018000,0.177700,0.766200
0.037300,0.018750,0.175950,0.768000
0.037650,0.017650,0.176350,0.768350
0.038300,0.017400,0.175300,0.769000
0.038500,0.018050,0.174400,0.769050
0.038900,0.018250,0.173700,0.769150
0.038600,0.018950,0.173100,0.769350
0.038800,0.018650,0.173400,0.769150
0.039250,0.019000,0.172400,0.769350
0.039600,0.018400,0.171550,0.770450
0.039300,0.018800,0.171500,0.770400
0.041450,0.017250,0.171600,0.769700
0.040700,0.018200,0.170200,0.770900
0.039950,0.019150,0.169900,0.771000
0.040000,0.018850,0.169300,0.771850
0.039550,0.018050,0.169450,0.772950
0.039500,0.017550,0.169050,0.773900
0.039250,0.018350,0.168350,0.774050
0.038650,0.017950,0.167800,0.775600
0.038450,0.018250,0.168100,0.775200
0.039550,0.017950,0.168100,0.774400
0.039600,0.017350,0.168450,0.774600
0.040600,0.016750,0.168200,0.774450
0.039450,0.017250,0.168450,0.774850
0.040500,0.016100,0.169050,0.774350
0.040250,0.015900,0.168200,0.775650
0.039300,0.016100,0.167450,0.777150
0.038400,0.016600,0.167150,0.777850
0.038150,0.016250,0.166950,0.778650
0.036950,0.017200,0.167550,0.778300
0.037700,0.016450,0.169150,0.776700
0.037550,0.016600,0.169400,0.776450
0.037600,0.017050,0.168850,0.776500
0.037450,0.016200,0.169250,0.777100
0.038100,0.016300,0.169400,0.776200
0.037500,0.015450,0.170550,0.776500
0.036650,0.016900,0.171050,0.775400
0.036750,0.016300,0.171250,0.775700
0.035550,0.016400,0.173150,0.774900
0.035550,0.015400,0.173800,0.775250
0.034850,0.016800,0.173450,0.774900
0.035100,0.016800,0.173800,0.774300
0.035300,0.016850,0.175050,0.772800
0.035450,0.017600,0.174450,0.772500
0.036350,0.017200,0.174300,0.772150
0.036200,0.016850,0.174000,0.772950
0.036300,0.016350,0.175000,0.772350
0.035700,0.016600,0.174950,0.772750
0.036150,0.016000,0.175600,0.772250
0.035750,0.016200,0.175050,0.773000
0.034950,0.016550,0.174750,0.773750
0.034350,0.017000,0.174850,0.773800
0.034000,0.017450,0.174900,0.773650
0.034550,0.016100,0.175850,0.773500
0.033550,0.016550,0.176250,0.773650
0.033850,0.015800,0.176450,0.773900
0.034400,0.016150,0.175700,0.773750
0.034950,0.015700,0.176900,0.772450
0.034150,0.015250,0.178850,0.771750
0.033850,0.015650,0.179750,0.770750
0.033700,0.016300,0.179550,0.770450
0.034050,0.014850,0.180900,0.770200
0.033800,0.015700,0.181600,0.768900
0.033550,0.015400,0.182100,0.768950
0.033800,0.016300,0.182100,0.767800
0.032850,0.017000,0.182750,0.767400
0.033750,0.016850,0.183050,0.766350
0.033500,0.017600,0.182300,0.766600
0.034900,0.017450,0.183200,0.764450
0.035100,0.017300,0.183400,0.764200
0.035800,0.016950,0.184100,0.763150
0.036000,0.017000,0.183700,0.763300
0.036100,0.016950,0.184550,0.762400
0.035850,0.017050,0.184550,0.762550
0.036400,0.017750,0.184100,0.761750
0.036250,0.018000,0.183050,0.762700
0.036750,0.016900,0.183400,0.762950
0.036900,0.016750,0.183300,0.763050
0.036600,0.016900,0.183600,0.762900
0.036500,0.017100,0.183400,0.763000
0.035550,0.017650,0.182600,0.764200
0.034050,0.017600,0.183000,0.765350
0.035050,0.017250,0.183700,0.764000
0.035450,0.016650,0.184100,0.763800
0.035550,0.015350,0.184650,0.764450
0.034900,0.016400,0.183900,0.764800
0.035450,0.016550,0.183800,0.764200
0.035250,0.015900,0.184100,0.764750
0.034100,0.016200,0.185250,0.764450
0.034700,0.015000,0.186450,0.763850
0.033600,0.016800,0.185600,0.764000
0.033800,0.016350,0.185500,0.764350
0.032850,0.016050,0.186250,0.764850
0.033750,0.015500,0.186350,0.764400
0.034350,0.015650,0.187250,0.762750
0.034050,0.016350,0.187250,0.762350
0.034350,0.016600,0.187050,0.762000
0.035450,0.015900,0.188300,0.760350
0.034450,0.016600,0.187450,0.761500
0.034550,0.016950,0.187150,0.761350
0.034800,0.016950,0.188100,0.760150
0.036350,0.016000,0.186800,0.760850
0.036450,0.016250,0.187200,0.760100
0.037450,0.016500,0.186000,0.760050
0.036600,0.016850,0.185750,0.760800
0.035900,0.016850,0.185200,0.762050
0.035550,0.017300,0.184700,0.762450
0.035350,0.017350,0.183750,0.763550
0.036000,0.016050,0.184450,0.763500
0.035850,0.016100,0.184450,0.763600
0.037250,0.015000,0.185000,0.762750
0.036150,0.016250,0.184300,0.763300
0.036150,0.016300,0.184000,0.763550
0.035650,0.018000,0.181800,0.764550
0.036000,0.017300,0.181900,0.764800
0.036000,0.016350,0.182750,0.764900
0.036750,0.016650,0.181950,0.764650
0.036650,0.018200,0.180100,0.765050
0.036450,0.017800,0.180000,0.765750
0.036250,0.017750,0.179400,0.766600
0.036900,0.016950,0.178850,0.767300
0.037200,0.017550,0.177700,0.767550
0.036750,0.017450,0.178350,0.767450
0.035950,0.017750,0.178800,0.767500
0.035900,0.017950,0.178650,0.767500
0.035800,0.019000,0.178300,0.766900
0.035400,0.018900,0.179050,0.766650
0.036750,0.017550,0.179850,0.765850
0.037600,0.016100,0.180900,0.765400
0.036400,0.017150,0.180300,0.766150
0.036800,0.016000,0.180300,0.766900
0.037300,0.015100,0.179800,0.767800
0.037700,0.014400,0.179200,0.768700
0.037150,0.014650,0.179250,0.768950
0.035850,0.015250,0.180250,0.768650
0.036000,0.015400,0.181300,0.767300
0.035450,0.015500,0.181400,0.767650
0.034600,0.016150,0.182050,0.767200
0.033650,0.015850,0.182850,0.767650
0.034150,0.014400,0.183850,0.767600
0.034150,0.015100,0.184800,0.765950
0.032550,0.014750,0.186150,0.766550
0.032700,0.015050,0.186050,0.766200
0.032600,0.015250,0.186400,0.765750
0.032350,0.015600,0.187250,0.764800
0.032750,0.015750,0.186600,0.764900
0.032750,0.016400,0.186800,0.764050
0.033150,0.016000,0.187350,0.763500
0.032900,0.017050,0.186750,0.763300
0.033400,0.016250,0.186650,0.763700
0.033350,0.016250,0.185750,0.764650
