I,E,S,R
0.001000,0.000750,0.998250,0.000000
0.001100,0.001350,0.997400,0.000150
0.001500,0.001900,0.996450,0.000150
0.002000,0.002350,0.995200,0.000450
0.002450,0.003400,0.993500,0.000650
0.003050,0.003900,0.992100,0.000950
0.004100,0.005450,0.989100,0.001350
0.005400,0.008100,0.984750,0.001750
0.007200,0.010450,0.980150,0.002200
0.009500,0.013700,0.973800,0.003000
0.012750,0.016850,0.966450,0.003950
0.016650,0.022800,0.955300,0.005250
0.020500,0.029200,0.942850,0.007450
0.025900,0.037000,0.926950,0.010150
0.033100,0.046950,0.906500,0.013450
0.040600,0.060850,0.880050,0.018500
0.053000,0.071800,0.851550,0.023650
0.067200,0.091100,0.811300,0.030400
0.085100,0.111250,0.764500,0.039150
0.106400,0.136250,0.706700,0.050650
0.131350,0.167800,0.637050,0.063800
0.163550,0.186500,0.568500,0.081450
0.195400,0.207900,0.494400,0.102300
0.225500,0.227450,0.417950,0.129100
0.259100,0.240250,0.342400,0.158250
0.289300,0.241450,0.276350,0.192900
0.321100,0.230450,0.218000,0.230450
0.343000,0.217050,0.169250,0.270700
0.360450,0.195550,0.128400,0.315600
0.367600,0.170250,0.098250,0.363900
0.364500,0.147900,0.075500,0.412100
0.360450,0.123200,0.057900,0.458450
0.346800,0.102550,0.045650,0.505000
0.330850,0.083250,0.036400,0.549500
0.307700,0.066550,0.030850,0.594900
0.287900,0.053100,0.026500,0.632500
0.264200,0.044450,0.022950,0.668400
0.239750,0.035500,0.020500,0.704250
0.217700,0.030000,0.018650,0.733650
0.199050,0.024150,0.017600,0.759200
0.178850,0.020200,0.018250,0.782700
0.161850,0.015700,0.019050,0.803400
0.147400,0.012550,0.019600,0.820450
0.132050,0.010450,0.021000,0.836500
0.117350,0.009700,0.022750,0.850200
0.104950,0.008250,0.023700,0.863100
0.092400,0.008300,0.024850,0.874450
0.083050,0.007450,0.025850,0.883650
0.075000,0.006900,0.027150,0.890950
0.067250,0.006800,0.028750,0.897200
0.060750,0.006200,0.030700,0.902350
0.054500,0.005800,0.032750,0.906950
0.049100,0.005100,0.034800,0.911000
0.042100,0.004400,0.037100,0.916400
0.037600,0.004050,0.039800,0.918550
0.033300,0.004100,0.042150,0.920450
0.029150,0.003650,0.045200,0.922000
0.024900,0.003650,0.048100,0.923350
0.022250,0.002750,0.051050,0.923950
0.019800,0.002650,0.054650,0.922900
0.017900,0.002200,0.057800,0.922100
0.016050,0.002300,0.060200,0.921450
0.013550,0.002700,0.063400,0.920350
0.012300,0.002250,0.065900,0.919550
0.010900,0.002200,0.068550,0.918350
0.009500,0.002000,0.072000,0.916500
0.008700,0.002000,0.074650,0.914650
0.008250,0.001750,0.077950,0.912050
0.007300,0.001400,0.080500,0.910800
0.006350,0.001400,0.083500,0.908750
0.005550,0.001700,0.086100,0.906650
0.005400,0.001800,0.088900,0.903900
0.005050,0.001450,0.091250,0.902250
0.004700,0.001400,0.094250,0.899650
0.004400,0.001400,0.097500,0.896700
0.004050,0.001250,0.099550,0.895150
0.003750,0.001250,0.102400,0.892600
0.003500,0.001150,0.105200,0.890150
0.003500,0.001000,0.107300,0.888200
0.003400,0.000850,0.110750,0.885000
0.003250,0.000850,0.113550,0.882350
0.003050,0.000700,0.116000,0.880250
0.003000,0.000900,0.118300,0.877800
0.002950,0.000800,0.121350,0.874900
0.002550,0.000500,0.124300,0.872650
0.002400,0.000850,0.126650,0.870100
0.002350,0.000900,0.129000,0.867750
0.002200,0.000950,0.131850,0.865000
0.002000,0.000950,0.133850,0.863200
0.002100,0.000650,0.135150,0.862100
0.001900,0.000700,0.137800,0.859600
0.001850,0.000700,0.141350,0.856100
0.001850,0.000450,0.144000,0.853700
0.001850,0.000550,0.146800,0.850800
0.001650,0.000650,0.148900,0.848800
0.001750,0.000500,0.151050,0.846700
0.001700,0.000300,0.153900,0.844100
0.001600,0.000350,0.156300,0.841750
0.001300,0.000700,0.158800,0.839200
0.001450,0.000700,0.161050,0.836800
0.001300,0.000800,0.163850,0.834050
0.001250,0.000700,0.166300,0.831750
0.001500,0.000450,0.169200,0.828850
0.001450,0.000400,0.172100,0.826050
0.001350,0.000450,0.174600,0.823600
0.001300,0.000500,0.177250,0.820950
0.001300,0.000450,0.179400,0.818850
0.001400,0.000400,0.181900,0.816300
0.001450,0.000300,0.183900,0.814350
0.001500,0.000450,0.186450,0.811600
0.001500,0.000750,0.188450,0.809300
0.001500,0.000800,0.191250,0.806450
0.001800,0.000600,0.193550,0.804050
0.001700,0.000800,0.195650,0.801850
0.002000,0.000600,0.197450,0.799950
0.001700,0.000750,0.199600,0.797950
0.001600,0.000850,0.202150,0.795400
0.001800,0.000750,0.203550,0.793900
0.001750,0.000750,0.205450,0.792050
0.001650,0.000850,0.207300,0.790200
0.001750,0.000800,0.208950,0.788500
0.001700,0.001000,0.210800,0.786500
0.001750,0.000950,0.213300,0.784000
0.001650,0.000850,0.214850,0.782650
0.001650,0.001050,0.217050,0.780250
0.001700,0.001150,0.218600,0.778550
0.001550,0.001050,0.220400,0.777000
0.001550,0.001000,0.222150,0.775300
0.001600,0.001100,0.224300,0.773000
0.001850,0.001050,0.226200,0.770900
0.001750,0.001400,0.228050,0.768800
0.001900,0.001000,0.229950,0.767150
0.001950,0.001450,0.231700,0.764900
0.002050,0.001300,0.233500,0.763150
0.002150,0.001400,0.235450,0.761000
0.002050,0.001300,0.237550,0.759100
0.002000,0.001550,0.239200,0.757250
0.002350,0.001400,0.240800,0.755450
0.002400,0.001400,0.242300,0.753900
0.002550,0.001600,0.243600,0.752250
0.002650,0.001200,0.245550,0.750600
0.002650,0.001400,0.247450,0.748500
0.002650,0.001650,0.249500,0.746200
0.002450,0.001650,0.250850,0.745050
0.002600,0.001600,0.252700,0.743100
0.002700,0.001800,0.254100,0.741400
0.003150,0.001750,0.255300,0.739800
0.003450,0.001750,0.257400,0.737400
0.003550,0.001700,0.259500,0.735250
0.003750,0.002050,0.261400,0.732800
0.003800,0.002150,0.263500,0.730550
0.003850,0.002350,0.264850,0.728950
0.003950,0.002450,0.266550,0.727050
0.003950,0.002700,0.267350,0.726000
0.004500,0.002700,0.268450,0.724350
0.004650,0.003200,0.269600,0.722550
0.004800,0.003000,0.271350,0.720850
0.005200,0.003200,0.272500,0.719100
0.005850,0.003250,0.273300,0.717600
0.005900,0.003700,0.274150,0.716250
0.006450,0.003950,0.275150,0.714450
0.006000,0.004400,0.276150,0.713450
0.006200,0.004700,0.276750,0.712350
0.006700,0.004700,0.277100,0.711500
0.007300,0.005050,0.277050,0.710600
0.008200,0.005250,0.277950,0.708600
0.008200,0.005700,0.278650,0.707450
0.008450,0.005600,0.279100,0.706850
0.008950,0.005850,0.279000,0.706200
0.009400,0.005800,0.279300,0.705500
0.010500,0.006600,0.278750,0.704150
0.011300,0.007300,0.278800,0.702600
0.011700,0.007750,0.279000,0.701550
0.012750,0.007650,0.278650,0.700950
0.013150,0.008400,0.278000,0.700450
0.014000,0.008400,0.277500,0.700100
0.014650,0.008950,0.276600,0.699800
0.015350,0.009900,0.276050,0.698700
0.016000,0.010350,0.274900,0.698750
0.016650,0.010800,0.274100,0.698450
0.016650,0.011900,0.272500,0.698950
0.017700,0.012500,0.271000,0.698800
0.018850,0.013000,0.268950,0.699200
0.019550,0.014300,0.266600,0.699550
0.020650,0.014800,0.263750,0.700800
0.021950,0.015000,0.261700,0.701350
0.023450,0.015250,0.259550,0.701750
0.024700,0.014650,0.258150,0.702500
0.027100,0.014800,0.255750,0.702350
0.027700,0.016150,0.252700,0.703450
0.028800,0.015550,0.250200,0.705450
0.029950,0.016200,0.246750,0.707100
0.030250,0.017300,0.243350,0.709100
0.030950,0.018650,0.240550,0.709850
0.032850,0.019950,0.236650,0.710550
0.033900,0.021750,0.231850,0.712500
0.036500,0.021300,0.227450,0.714750
0.036750,0.021800,0.223350,0.718100
0.037350,0.023600,0.218850,0.720200
0.040450,0.022100,0.215300,0.722150
0.040950,0.022000,0.211650,0.725400
0.041550,0.022350,0.207300,0.728800
0.042600,0.022200,0.202950,0.732250
0.043800,0.020400,0.201350,0.734450
0.042850,0.021100,0.198100,0.737950
0.042950,0.021300,0.194650,0.741100
0.044650,0.019500,0.192050,0.743800
0.045050,0.019650,0.189550,0.745750
0.043800,0.021850,0.185250,0.749100
0.043350,0.022200,0.182400,0.752050
0.044350,0.022100,0.178400,0.755150
0.045150,0.022400,0.175150,0.757300
0.044550,0.022550,0.172250,0.760650
0.046100,0.021850,0.169450,0.762600
0.045150,0.022550,0.165650,0.766650
0.044900,0.022100,0.163400,0.769600
0.045550,0.021300,0.160300,0.772850
0.044800,0.020550,0.157750,0.776900
0.043900,0.020750,0.155900,0.779450
0.043400,0.021050,0.154400,0.781150
0.042600,0.019950,0.152500,0.784950
0.042100,0.018450,0.151900,0.787550
0.041200,0.018400,0.150100,0.790300
0.041150,0.017350,0.149200,0.792300
0.040850,0.016750,0.148650,0.793750
0.039400,0.016650,0.147750,0.796200
0.039050,0.016250,0.147550,0.797150
0.037300,0.016250,0.146650,0.799800
0.037650,0.015100,0.146950,0.800300
0.035950,0.014950,0.147050,0.802050
0.035150,0.014350,0.147000,0.803500
0.034700,0.013750,0.147450,0.804100
0.033700,0.014000,0.147150,0.805150
0.032600,0.014300,0.147150,0.805950
0.032000,0.013650,0.146800,0.807550
0.031400,0.013650,0.147850,0.807100
0.031700,0.012950,0.148700,0.806650
0.031550,0.013650,0.149100,0.805700
0.031300,0.012900,0.149900,0.805900
0.031500,0.012650,0.150350,0.805500
0.029950,0.012700,0.150950,0.806400
0.029900,0.012450,0.151700,0.805950
0.029400,0.011750,0.152700,0.806150
0.029000,0.011900,0.153650,0.805450
0.028750,0.011750,0.155250,0.804250
0.027100,0.011400,0.156650,0.804850
0.026450,0.011000,0.158100,0.804450
0.026100,0.010750,0.159600,0.803550
0.025650,0.011100,0.160450,0.802800
0.024500,0.011600,0.161850,0.802050
0.024050,0.011300,0.162750,0.801900
0.024050,0.010700,0.163950,0.801300
0.023350,0.010900,0.165400,0.800350
0.023150,0.010400,0.167000,0.799450
0.023600,0.010950,0.166850,0.798600
0.022700,0.011500,0.167450,0.798350
0.023050,0.011350,0.168400,0.797200
0.023650,0.010900,0.169650,0.795800
0.023950,0.011200,0.170100,0.794750
0.024500,0.010550,0.171400,0.793550
0.023900,0.010500,0.172550,0.793050
0.023750,0.011050,0.172550,0.792650
0.024600,0.010100,0.174000,0.791300
0.023450,0.010600,0.175500,0.790450
0.022300,0.010300,0.178150,0.789250
0.021750,0.010550,0.179050,0.788650
0.021850,0.010950,0.179700,0.787500
0.020950,0.011450,0.181000,0.786600
0.021450,0.012150,0.182350,0.784050
0.021800,0.012700,0.183300,0.782200
0.021900,0.012150,0.185750,0.780200
0.022850,0.010500,0.187600,0.779050
0.022050,0.010600,0.189000,0.778350
0.021800,0.011150,0.190400,0.776650
0.021900,0.011450,0.191450,0.775200
0.022200,0.010850,0.192800,0.774150
0.023100,0.010550,0.194150,0.772200
0.023300,0.010600,0.195050,0.771050
0.022400,0.012700,0.195300,0.769600
0.023150,0.012600,0.195800,0.768450
0.023850,0.012450,0.196450,0.767250
0.025100,0.011150,0.197700,0.766050
0.024450,0.011650,0.197850,0.766050
0.024000,0.011550,0.198900,0.765550
0.023950,0.012000,0.199400,0.764650
0.023750,0.011750,0.200900,0.763600
0.024150,0.012500,0.201350,0.762000
0.024300,0.012900,0.202450,0.760350
0.024850,0.012950,0.202500,0.759700
0.025750,0.013150,0.202350,0.758750
0.025950,0.012950,0.202600,0.758500
0.025950,0.012600,0.204200,0.757250
0.026000,0.013100,0.203750,0.757150
0.025750,0.013050,0.204500,0.756700
0.024700,0.013950,0.204750,0.756600
0.026050,0.013450,0.204300,0.756200
0.026300,0.013150,0.204700,0.755850
0.026950,0.014500,0.204900,0.753650
0.027100,0.014900,0.204950,0.753050
0.028450,0.014050,0.204950,0.752550
0.028700,0.014100,0.205400,0.751800
0.028450,0.014050,0.205700,0.751800
0.028050,0.015000,0.205850,0.751100
0.028500,0.015800,0.205650,0.750050
0.028650,0.015150,0.205850,0.750350
0.029050,0.015450,0.206700,0.748800
0.029650,0.014450,0.207400,0.748500
0.030200,0.014600,0.207750,0.747450
0.030850,0.015200,0.208450,0.745500
0.031500,0.014900,0.208600,0.745000
0.031250,0.014600,0.208850,0.745300
0.031500,0.015700,0.207150,0.745650
0.030900,0.016200,0.207600,0.745300
0.030950,0.016350,0.207600,0.745100
0.031350,0.016800,0.206700,0.745150
0.032050,0.016800,0.206100,0.745050
0.033250,0.016050,0.206000,0.744700
0.033250,0.018150,0.203550,0.745050
0.032350,0.018150,0.203500,0.746000
0.033450,0.017700,0.203300,0.745550
0.033850,0.018350,0.201900,0.745900
0.035000,0.019450,0.200200,0.745350
0.035650,0.018700,0.199450,0.746200
0.036600,0.018150,0.199350,0.745900
0.037350,0.017500,0.198850,0.746300
0.035900,0.017350,0.198900,0.747850
0.035500,0.017650,0.198400,0.748450
0.035400,0.017900,0.197850,0.748850
0.036800,0.018550,0.197050,0.747600
0.036800,0.018700,0.197350,0.747150
0.036900,0.019200,0.196100,0.747800
0.036750,0.019950,0.194300,0.749000
0.038000,0.019850,0.193800,0.748350
0.039350,0.020150,0.192450,0.748050
0.039650,0.020000,0.192200,0.748150
0.040850,0.019950,0.191350,0.747850
0.041650,0.022350,0.188100,0.747900
0.042300,0.021850,0.186850,0.749000
0.042850,0.021400,0.185300,0.750450
0.042400,0.021250,0.184450,0.751900
0.042150,0.020950,0.184250,0.752650
0.042850,0.020300,0.182450,0.754400
0.042300,0.021750,0.181150,0.754800
0.044700,0.020300,0.179900,0.755100
0.045000,0.020450,0.178400,0.756150
0.045300,0.020700,0.176850,0.757150
0.044750,0.020450,0.175800,0.759000
0.043350,0.022300,0.173950,0.760400
0.044000,0.021350,0.172000,0.762650
0.044950,0.020350,0.171700,0.763000
0.045250,0.019150,0.170600,0.765000
0.043000,0.020800,0.168950,0.767250
0.042000,0.021050,0.169300,0.767650
0.041100,0.019750,0.170200,0.768950
0.042100,0.019550,0.168650,0.769700
0.041600,0.019850,0.168300,0.770250
0.041300,0.019200,0.166550,0.772950
0.040000,0.018950,0.167200,0.773850
0.040500,0.017550,0.167400,0.774550
0.039200,0.018750,0.167050,0.775000
0.038800,0.018850,0.166800,0.775550
0.038350,0.019000,0.166500,0.776150
0.037600,0.017600,0.167150,0.777650
0.037100,0.017450,0.168100,0.777350
0.036450,0.017350,0.167950,0.778250
0.037200,0.017250,0.168700,0.776850
0.036500,0.016900,0.169400,0.777200
0.036500,0.016350,0.169150,0.778000
0.035750,0.017750,0.168450,0.778050
0.035650,0.017750,0.169350,0.777250
0.036650,0.017400,0.168900,0.777050
0.035350,0.017950,0.169100,0.777600
0.036500,0.016550,0.168900,0.778050
0.036100,0.014900,0.170550,0.778450
0.036200,0.015200,0.171350,0.777250
0.036150,0.014750,0.172150,0.776950
0.034950,0.015350,0.172800,0.776900
0.034950,0.015350,0.174200,0.775500
0.035250,0.015250,0.174450,0.775050
0.034900,0.016050,0.174700,0.774350
0.035750,0.015400,0.174950,0.773900
0.035300,0.015950,0.174200,0.774550
0.034350,0.016400,0.173600,0.775650
0.034150,0.015850,0.174800,0.775200
0.034650,0.015450,0.175900,0.774000
0.034100,0.016250,0.176250,0.773400
0.034800,0.016150,0.176350,0.772700
0.034300,0.016000,0.176900,0.772800
0.033700,0.015950,0.176950,0.773400
0.034050,0.015800,0.177750,0.772400
0.035050,0.015300,0.178150,0.771500
0.034200,0.016400,0.178000,0.771400
0.033300,0.017100,0.178050,0.771550
0.033850,0.015500,0.179750,0.770900
0.033400,0.016300,0.178800,0.771500
0.033300,0.015850,0.179500,0.771350
0.032950,0.015600,0.179200,0.772250
0.033050,0.015250,0.179400,0.772300
0.031600,0.015200,0.180250,0.772950
0.031950,0.015000,0.181150,0.771900
0.031550,0.015550,0.182450,0.770450
0.031700,0.016500,0.181250,0.770550
0.031700,0.016400,0.182000,0.769900
0.031600,0.016750,0.182450,0.769200
0.032000,0.016650,0.183250,0.768100
0.033050,0.016350,0.183350,0.767250
0.033200,0.016500,0.182650,0.767650
0.032350,0.016100,0.184750,0.766800
0.031600,0.016800,0.184750,0.766850
0.032000,0.017700,0.184150,0.766150
0.031850,0.017000,0.184900,0.766250
0.032200,0.016450,0.185350,0.766000
0.031350,0.016400,0.185700,0.766550
0.033150,0.014700,0.186300,0.765850
0.033550,0.014650,0.186700,0.765100
0.033500,0.015250,0.186850,0.764400
0.032200,0.015200,0.187400,0.765200
0.031850,0.015450,0.187150,0.765550
0.032700,0.014500,0.187100,0.765700
0.032150,0.014950,0.187700,0.765200
0.030850,0.015200,0.188200,0.765750
0.030750,0.014300,0.189800,0.765150
0.030900,0.015700,0.190150,0.763250
0.031150,0.016050,0.190050,0.762750
0.031250,0.017200,0.189250,0.762300
0.031100,0.017600,0.188750,0.762550
0.032150,0.017300,0.188250,0.762300
0.033550,0.016550,0.188350,0.761550
0.032550,0.016500,0.189300,0.761650
0.033450,0.016200,0.189850,0.760500
0.033850,0.016750,0.189500,0.759900
0.033550,0.017050,0.190200,0.759200
0.034150,0.017200,0.189000,0.759650
0.034000,0.017350,0.188400,0.760250
0.034650,0.017650,0.186550,0.761150
0.035600,0.017950,0.186350,0.760100
0.035850,0.017950,0.185400,0.760800
0.036850,0.015300,0.186250,0.761600
0.037350,0.014250,0.185900,0.762500
0.036000,0.015300,0.186050,0.762650
0.035100,0.015800,0.186300,0.762800
0.035050,0.015650,0.186650,0.762650
0.035300,0.014900,0.187150,0.762650
0.034950,0.015950,0.186250,0.762850
0.034300,0.016550,0.185800,0.763350
0.035350,0.015750,0.185650,0.763250
0.034500,0.016300,0.185950,0.763250
0.034400,0.017650,0.185250,0.762700
0.034700,0.016600,0.186600,0.762100
0.035350,0.016050,0.187000,0.761600
0.035500,0.017250,0.185600,0.761650
0.034950,0.018000,0.184950,0.762100
0.034600,0.017900,0.185750,0.761750
0.033050,0.017650,0.185850,0.763450
0.033800,0.017100,0.186150,0.762950
0.033700,0.018250,0.185100,0.762950
0.035350,0.018350,0.185100,0.761200
0.035150,0.017900,0.184000,0.762950
0.034600,0.018750,0.183950,0.762700
0.033950,0.018550,0.183800,0.763700
0.035500,0.018350,0.181850,0.764300
0.035550,0.017450,0.182550,0.764450
0.035500,0.016800,0.183450,0.764250
0.034700,0.017250,0.183300,0.764750
0.035700,0.016700,0.183150,0.764450
0.035650,0.016700,0.183050,0.764600
0.035150,0.016600,0.182450,0.765800
0.035150,0.016400,0.183000,0.765450
0.034950,0.016550,0.182750,0.765750
0.035850,0.017600,0.181300,0.765250
0.036000,0.017750,0.180000,0.766250
0.036900,0.017500,0.179950,0.765650
0.037100,0.016700,0.179950,0.766250
0.037400,0.016900,0.179950,0.765750
0.037200,0.017000,0.180400,0.765400
0.036900,0.017150,0.179100,0.766850
0.036400,0.017350,0.179550,0.766700
0.037000,0.017250,0.178350,0.767400
0.037000,0.017300,0.178300,0.767400
0.037900,0.015900,0.178500,0.767700
0.037700,0.016400,0.178900,0.767000
0.036750,0.017450,0.178400,0.767400
0.036650,0.017850,0.177550,0.767950
0.036000,0.017750,0.177200,0.769050
0.036000,0.017100,0.178400,0.768500
0.036450,0.017150,0.178600,0.767800
0.035550,0.016150,0.178550,0.769750
0.035350,0.016850,0.177300,0.770500
0.035700,0.016450,0.178200,0.769650
0.035900,0.016650,0.177850,0.769600
0.036000,0.016800,0.178600,0.768600
0.035550,0.017100,0.178300,0.769050
0.035650,0.017000,0.178700,0.768650
0.035150,0.017600,0.179400,0.767850
0.034750,0.017100,0.179000,0.769150
0.034900,0.017000,0.178450,0.769650
0.035050,0.016700,0.179350,0.768900
0.035450,0.016900,0.178600,0.769050
0.035800,0.015900,0.179500,0.768800
0.035400,0.016100,0.179950,0.768550
0.034800,0.016300,0.180800,0.768100
0.034900,0.016750,0.180700,0.767650
0.035900,0.016100,0.181750,0.766250
0.035650,0.016500,0.182350,0.765500
0.035200,0.015400,0.183600,0.765800
0.033650,0.016900,0.183800,0.765650
0.033200,0.017000,0.183450,0.766350
0.034050,0.016450,0.183800,0.765700
0.034800,0.015550,0.184200,0.765450
0.035150,0.015550,0.184200,0.765100
0.035700,0.015300,0.184850,0.764150
0.034400,0.015900,0.185100,0.764600
0.033900,0.015650,0.184900,0.765550
0.033150,0.016200,0.185300,0.765350
0.033650,0.016900,0.184550,0.764900
0.033950,0.016950,0.184500,0.764600
0.034200,0.017650,0.184700,0.763450
0.035100,0.017050,0.185300,0.762550
0.034000,0.017050,0.185300,0.763650
0.033500,0.018050,0.185450,0.763000
0.034450,0.016550,0.185000,0.764000
0.034600,0.016600,0.184450,0.764350
0.034200,0.017200,0.183600,0.765000
0.033700,0.015950,0.185150,0.765200
0.033050,0.015650,0.186150,0.765150
0.032050,0.016400,0.187400,0.764150
0.032450,0.016600,0.187200,0.763750
0.033550,0.016050,0.187150,0.763250
0.033600,0.016800,0.187500,0.762100
0.033450,0.015950,0.188050,0.762550
0.034500,0.015350,0.188100,0.762050
0.033650,0.016300,0.187900,0.762150
0.034950,0.016150,0.186750,0.762150
0.034700,0.017400,0.187050,0.760850
0.034450,0.017450,0.187300,0.760800
0.034450,0.017750,0.186650,0.761150
0.034050,0.018600,0.186300,0.761050
0.033700,0.017850,0.186600,0.761850
0.034150,0.016900,0.187900,0.761050
0.034900,0.016750,0.188100,0.760250
0.035350,0.016050,0.188100,0.760500
0.036000,0.015450,0.188600,0.759950
0.034400,0.016250,0.189550,0.759800
0.033950,0.016800,0.189350,0.759900
0.032750,0.017300,0.189150,0.760800
0.033900,0.016850,0.188900,0.760350
0.033900,0.017200,0.188200,0.760700
0.033900,0.017700,0.187800,0.760600
0.034200,0.017100,0.188500,0.760200
0.035250,0.016050,0.188550,0.760150
0.034250,0.017400,0.188150,0.760200
0.035600,0.016050,0.187700,0.760650
0.035800,0.016200,0.187700,0.760300
0.035450,0.016300,0.187900,0.760350
0.034150,0.017700,0.187600,0.760550
0.035150,0.016400,0.188050,0.760400
0.034650,0.017000,0.187950,0.760400
0.036000,0.017050,0.187900,0.759050
0.034650,0.018950,0.186750,0.759650
0.035750,0.017600,0.187500,0.759150
0.036350,0.017850,0.185600,0.760200
0.035600,0.018250,0.185600,0.760550
0.036250,0.018250,0.185550,0.759950
0.036350,0.018250,0.185450,0.759950
0.036100,0.019650,0.183950,0.760300
0.036350,0.019250,0.183600,0.760800
0.035450,0.018900,0.183500,0.762150
0.035800,0.018300,0.183550,0.762350
0.035850,0.017950,0.184050,0.762150
0.036450,0.017450,0.184600,0.761500
0.037350,0.016150,0.185500,0.761000
0.036750,0.016150,0.186650,0.760450
0.036200,0.016250,0.187050,0.760500
0.036500,0.016750,0.187200,0.759550
0.036500,0.017150,0.186600,0.759750
0.036000,0.017000,0.186350,0.760650
0.035700,0.017050,0.187000,0.760250
0.035500,0.017450,0.186850,0.760200
0.035950,0.017700,0.186250,0.760100
0.036450,0.017750,0.185800,0.760000
0.037050,0.017200,0.186450,0.759300
0.036550,0.017950,0.186650,0.758850
0.036850,0.017800,0.187600,0.757750
0.036900,0.018350,0.187000,0.757750
0.037700,0.018100,0.187200,0.757000
0.036950,0.019250,0.187100,0.756700
0.037350,0.019500,0.185800,0.757350
0.038000,0.019800,0.185400,0.756800
0.039700,0.019350,0.184250,0.756700
0.039550,0.019250,0.184250,0.756950
0.038450,0.019300,0.184450,0.757800
0.038250,0.020400,0.182300,0.759050
0.039300,0.019250,0.182750,0.758700
0.039750,0.019200,0.181700,0.759350
0.040900,0.019600,0.179600,0.759900
0.040400,0.019650,0.178750,0.761200
0.040300,0.020200,0.178400,0.761100
0.041100,0.020200,0.178300,0.760400
0.040950,0.019800,0.177650,0.761600
0.041150,0.020000,0.177550,0.761300
0.041000,0.020550,0.176500,0.761950
0.041500,0.019950,0.176350,0.762200
0.042350,0.019750,0.174950,0.762950
0.041900,0.019550,0.175200,0.763350
0.041150,0.020100,0.174150,0.764600
0.040800,0.020550,0.173350,0.765300
0.040900,0.020800,0.171900,0.766400
0.040700,0.020050,0.172700,0.766550
0.040750,0.020100,0.172400,0.766750
0.040600,0.020650,0.170300,0.768450
0.040650,0.020200,0.170500,0.768650
0.041750,0.019600,0.168800,0.769850
0.042400,0.019550,0.168500,0.769550
0.040500,0.019500,0.168600,0.771400
0.040400,0.019800,0.167950,0.771850
0.040200,0.019400,0.168350,0.772050
0.040050,0.019500,0.168350,0.772100
0.039350,0.019300,0.168250,0.773100
0.040700,0.017600,0.169050,0.772650
0.039800,0.017750,0.169650,0.772800
0.038050,0.017400,0.171200,0.773350
0.037350,0.017400,0.171100,0.774150
0.036400,0.016850,0.171800,0.774950
0.036650,0.016500,0.170900,0.775950
0.035050,0.016250,0.172650,0.776050
0.035450,0.015900,0.172650,0.776000
0.034800,0.016000,0.173050,0.776150
0.034950,0.015450,0.174500,0.775100
0.034700,0.016450,0.174750,0.774100
0.034400,0.016850,0.175150,0.773600
0.034750,0.016600,0.175800,0.772850
0.033850,0.017150,0.177700,0.771300
0.033750,0.017900,0.176800,0.771550
0.033950,0.017350,0.178550,0.770150
0.034950,0.017500,0.178250,0.769300
0.034200,0.017400,0.178650,0.769750
0.034800,0.016450,0.179300,0.769450
0.033650,0.017350,0.179300,0.769700
0.034850,0.016350,0.179500,0.769300
0.034650,0.016650,0.179800,0.768900
0.035150,0.016950,0.179800,0.768100
0.035500,0.016550,0.180050,0.767900
0.035250,0.017750,0.180450,0.766550
0.035450,0.018750,0.180800,0.765000
0.037250,0.018050,0.181100,0.763600
0.037700,0.017450,0.181350,0.763500
0.037300,0.018200,0.180850,0.763650
0.036650,0.018950,0.179450,0.764950
0.037000,0.018150,0.180200,0.764650
0.036200,0.017700,0.181500,0.764600
0.036600,0.017750,0.181750,0.763900
0.036050,0.017900,0.181350,0.764700
0.036450,0.016950,0.181750,0.764850
0.036500,0.017250,0.182300,0.763950
0.036350,0.016900,0.182300,0.764450
0.035550,0.017450,0.181900,0.765100
0.036700,0.016850,0.181850,0.764600
0.037450,0.016250,0.181750,0.764550
0.037800,0.016700,0.179750,0.765750
0.037550,0.017250,0.179200,0.766000
0.037500,0.017600,0.178700,0.766200
0.036300,0.018800,0.178050,0.766850
0.035850,0.018050,0.178200,0.767900
0.036700,0.016900,0.178350,0.768050
0.036000,0.017500,0.178800,0.767700
0.036450,0.017600,0.178700,0.767250
0.036650,0.016900,0.177850,0.768600
0.035950,0.017250,0.178500,0.768300
0.036000,0.016700,0.179000,0.768300
0.034900,0.016650,0.179250,0.769200
0.036050,0.015550,0.179350,0.769050
0.033800,0.016700,0.180500,0.769000
0.033550,0.016800,0.182000,0.767650
0.034600,0.017300,0.182300,0.765800
0.034600,0.016600,0.183450,0.765350
0.034800,0.016750,0.183700,0.764750
0.034250,0.017950,0.184050,0.763750
0.035700,0.016950,0.184000,0.763350
0.035300,0.017100,0.184200,0.763400
0.035300,0.017100,0.184100,0.763500
0.035950,0.017350,0.184100,0.762600
0.036500,0.017300,0.183750,0.762450
0.036350,0.017750,0.184600,0.761300
0.036350,0.017700,0.183500,0.762450
0.036350,0.018450,0.182700,0.762500
0.037450,0.017700,0.182550,0.762300
0.038100,0.017550,0.181950,0.762400
0.036800,0.018800,0.181050,0.763350
0.037550,0.018500,0.181000,0.762950
0.037650,0.019000,0.180900,0.762450
0.038600,0.019200,0.180800,0.761400
0.038200,0.019900,0.179400,0.762500
0.038400,0.019750,0.178350,0.763500
0.039200,0.018550,0.178900,0.763350
0.037850,0.017800,0.179950,0.764400
0.038300,0.017650,0.180250,0.763800
0.038700,0.017050,0.180350,0.763900
0.038250,0.019000,0.178700,0.764050
0.037650,0.018050,0.179850,0.764450
0.038600,0.017750,0.179950,0.763700
0.038600,0.017600,0.179750,0.764050
0.039600,0.018200,0.179400,0.762800
0.038600,0.018850,0.179650,0.762900
0.038200,0.019000,0.178950,0.763850
0.039150,0.018750,0.178850,0.763250
0.040800,0.017050,0.178350,0.763800
0.040700,0.017050,0.179300,0.762950
0.040350,0.018150,0.178600,0.762900
0.038350,0.018050,0.178900,0.764700
0.038450,0.019100,0.178000,0.764450
0.038250,0.018800,0.176850,0.766100
0.037950,0.018050,0.177550,0.766450
0.037900,0.017650,0.178000,0.766450
0.037350,0.017950,0.176750,0.767950
0.037000,0.017600,0.177600,0.767800
0.036750,0.017200,0.178100,0.767950
0.038200,0.018100,0.177000,0.766700
0.037750,0.019450,0.176100,0.766700
0.037250,0.018800,0.176650,0.767300
0.037500,0.018950,0.176450,0.767100
0.038400,0.018750,0.176500,0.766350
0.038850,0.017950,0.176850,0.766350
0.038050,0.017600,0.177750,0.766600
0.037350,0.017650,0.176950,0.768050
0.037550,0.018250,0.176700,0.767500
0.037300,0.018600,0.175950,0.768150
0.037950,0.017250,0.176850,0.767950
0.037950,0.018150,0.175950,0.767950
0.037450,0.018350,0.174950,0.769250
0.038000,0.018700,0.175000,0.768300
