
--------------------------
Total energy: 974.30 Joules, including:
	CPU energy: 974.30 Joules
	GPU energy: 0.00 Joules
--------------------------

--------------------------
Total energy: 1053.19 Joules, including:
	CPU energy: 1053.19 Joules
	GPU energy: 0.00 Joules
--------------------------

--------------------------
Total energy: 1270.01 Joules, including:
	CPU energy: 1270.01 Joules
	GPU energy: 0.00 Joules
--------------------------

--------------------------
Total energy: 1270.27 Joules, including:
	CPU energy: 1270.27 Joules
	GPU energy: 0.00 Joules
--------------------------

--------------------------
Total energy: 1263.86 Joules, including:
	CPU energy: 1263.86 Joules
	GPU energy: 0.00 Joules
--------------------------
