I,E,S,R
0.001000,0.001050,0.997950,0.000000
0.001100,0.001750,0.997000,0.000150
0.001650,0.002200,0.995950,0.000200
0.002250,0.002850,0.994550,0.000350
0.002650,0.004150,0.992550,0.000650
0.003650,0.005400,0.990000,0.000950
0.004900,0.007150,0.986600,0.001350
0.006350,0.009050,0.982700,0.001900
0.007750,0.012800,0.976800,0.002650
0.010800,0.015800,0.969650,0.003750
0.013300,0.020650,0.960750,0.005300
0.017500,0.026350,0.949100,0.007050
0.022900,0.035650,0.932350,0.009100
0.030850,0.044350,0.913000,0.011800
0.038050,0.058450,0.887350,0.016150
0.048950,0.070850,0.858950,0.021250
0.063450,0.085550,0.823800,0.027200
0.079250,0.105800,0.778950,0.036000
0.100900,0.129650,0.723600,0.045850
0.122900,0.151450,0.665800,0.059850
0.149850,0.174550,0.599100,0.076500
0.179800,0.197050,0.526650,0.096500
0.211550,0.217350,0.450900,0.120200
0.241600,0.231750,0.375900,0.150750
0.276850,0.235500,0.306750,0.180900
0.308050,0.232200,0.243250,0.216500
0.331850,0.221600,0.189800,0.256750
0.347450,0.204350,0.145800,0.302400
0.361650,0.180700,0.109450,0.348200
0.369150,0.154600,0.083250,0.393000
0.363250,0.132050,0.063000,0.441700
0.349550,0.110200,0.048900,0.491350
0.334700,0.089400,0.038350,0.537550
0.317800,0.072200,0.032050,0.577950
0.294550,0.058600,0.027200,0.619650
0.274000,0.046600,0.024450,0.654950
0.251350,0.037950,0.021850,0.688850
0.229350,0.030400,0.020450,0.719800
0.204450,0.024300,0.020150,0.751100
0.181350,0.020500,0.020550,0.777600
0.163000,0.017550,0.020650,0.798800
0.147850,0.013900,0.021100,0.817150
0.132100,0.012200,0.021600,0.834100
0.116900,0.010700,0.022250,0.850150
0.104150,0.009150,0.023200,0.863500
0.093200,0.008150,0.025250,0.873400
0.082750,0.007200,0.026850,0.883200
0.074000,0.007200,0.027700,0.891100
0.065600,0.006500,0.029550,0.898350
0.057850,0.006200,0.031350,0.904600
0.052250,0.005750,0.033250,0.908750
0.046300,0.005700,0.034500,0.913500
0.041350,0.004850,0.036900,0.916900
0.037250,0.004250,0.039950,0.918550
0.033350,0.003850,0.042300,0.920500
0.029500,0.003750,0.044650,0.922100
0.026850,0.003250,0.047750,0.922150
0.023600,0.003350,0.050100,0.922950
0.021800,0.002900,0.053400,0.921900
0.019000,0.002850,0.056100,0.922050
0.017700,0.002350,0.058850,0.921100
0.015150,0.002350,0.061800,0.920700
0.013950,0.002200,0.064150,0.919700
0.012850,0.002500,0.067150,0.917500
0.011700,0.002550,0.069850,0.915900
0.010550,0.002850,0.072550,0.914050
0.009700,0.002800,0.074900,0.912600
0.009100,0.002450,0.078100,0.910350
0.008700,0.002150,0.080300,0.908850
0.007550,0.002200,0.083700,0.906550
0.007100,0.002100,0.086800,0.904000
0.005850,0.002400,0.088700,0.903050
0.005700,0.002200,0.091800,0.900300
0.005350,0.002050,0.094500,0.898100
0.005150,0.001750,0.097850,0.895250
0.004750,0.001650,0.101050,0.892550
0.004600,0.001450,0.103850,0.890100
0.004200,0.001450,0.106550,0.887800
0.004100,0.001200,0.109950,0.884750
0.003800,0.001150,0.112400,0.882650
0.003700,0.001000,0.115450,0.879850
0.003500,0.001100,0.118350,0.877050
0.003150,0.001200,0.120750,0.874900
0.003050,0.001150,0.123200,0.872600
0.003200,0.001050,0.125500,0.870250
0.003200,0.001100,0.128050,0.867650
0.002950,0.001000,0.130700,0.865350
0.002800,0.001050,0.133900,0.862250
0.002500,0.001100,0.135750,0.860650
0.002400,0.001200,0.138850,0.857550
0.002450,0.001050,0.141300,0.855200
0.002500,0.000900,0.143500,0.853100
0.002600,0.001150,0.146200,0.850050
0.002550,0.001300,0.148250,0.847900
0.002450,0.001250,0.151200,0.845100
0.002500,0.000950,0.153500,0.843050
0.002400,0.000850,0.156000,0.840750
0.002300,0.000900,0.158300,0.838500
0.002100,0.000850,0.160350,0.836700
0.001950,0.000800,0.163000,0.834250
0.001700,0.000800,0.165250,0.832250
0.001750,0.000700,0.167450,0.830100
0.001650,0.000700,0.170200,0.827450
0.001650,0.001050,0.172300,0.825000
0.001900,0.001000,0.174550,0.822550
0.001900,0.000850,0.176600,0.820650
0.001800,0.000600,0.179400,0.818200
0.001550,0.000750,0.181700,0.816000
0.001550,0.000850,0.183850,0.813750
0.001450,0.000750,0.185900,0.811900
0.001650,0.000800,0.187650,0.809900
0.001600,0.000650,0.189800,0.807950
0.001650,0.000650,0.191900,0.805800
0.001400,0.000650,0.194300,0.803650
0.001500,0.000650,0.196550,0.801300
0.001750,0.000500,0.199450,0.798300
0.001650,0.000500,0.201200,0.796650
0.001450,0.000600,0.203250,0.794700
0.001550,0.000600,0.205050,0.792800
0.001550,0.000900,0.206600,0.790950
0.001500,0.000900,0.209100,0.788500
0.001600,0.000900,0.210900,0.786600
0.001700,0.000800,0.213150,0.784350
0.001850,0.000600,0.215500,0.782050
0.001850,0.000950,0.217250,0.779950
0.001700,0.001050,0.219500,0.777750
0.001600,0.000950,0.221750,0.775700
0.001750,0.001050,0.224650,0.772550
0.001850,0.001400,0.226600,0.770150
0.001900,0.001350,0.228750,0.768000
0.002250,0.001200,0.230600,0.765950
0.002500,0.001150,0.231850,0.764500
0.002400,0.001100,0.233150,0.763350
0.002400,0.001500,0.234500,0.761600
0.002200,0.001400,0.236950,0.759450
0.002000,0.001450,0.239450,0.757100
0.002100,0.001450,0.241600,0.754850
0.002100,0.001450,0.243800,0.752650
0.002450,0.001150,0.246000,0.750400
0.002650,0.001250,0.248000,0.748100
0.002300,0.001600,0.249600,0.746500
0.002800,0.001350,0.251600,0.744250
0.002850,0.001500,0.252600,0.743050
0.002500,0.001750,0.253800,0.741950
0.002500,0.001700,0.255300,0.740500
0.002600,0.001750,0.257300,0.738350
0.002650,0.001850,0.258700,0.736800
0.003000,0.001750,0.260450,0.734800
0.003350,0.001950,0.261450,0.733250
0.003700,0.002050,0.262650,0.731600
0.003850,0.002200,0.263650,0.730300
0.003850,0.002550,0.264900,0.728700
0.004150,0.002500,0.267250,0.726100
0.004650,0.002400,0.268450,0.724500
0.004450,0.002750,0.269300,0.723500
0.003950,0.003200,0.270600,0.722250
0.004300,0.003050,0.272050,0.720600
0.004050,0.003450,0.273200,0.719300
0.004000,0.003950,0.274250,0.717800
0.005050,0.003600,0.275250,0.716100
0.005250,0.003850,0.275500,0.715400
0.005800,0.003500,0.276750,0.713950
0.005750,0.003900,0.278100,0.712250
0.006500,0.004150,0.279150,0.710200
0.007250,0.004000,0.279600,0.709150
0.007150,0.004150,0.281300,0.707400
0.007100,0.004900,0.281550,0.706450
0.007750,0.005450,0.282450,0.704350
0.008200,0.005700,0.282800,0.703300
0.008900,0.005450,0.283950,0.701700
0.009600,0.006250,0.283800,0.700350
0.010550,0.006450,0.283250,0.699750
0.011000,0.007050,0.282750,0.699200
0.011150,0.007500,0.282300,0.699050
0.011300,0.008100,0.282000,0.698600
0.012150,0.007850,0.282450,0.697550
0.012750,0.008200,0.282400,0.696650
0.012900,0.008500,0.282350,0.696250
0.014000,0.008650,0.281800,0.695550
0.014850,0.009000,0.281450,0.694700
0.015450,0.010300,0.279700,0.694550
0.015900,0.011550,0.278200,0.694350
0.017050,0.011050,0.277750,0.694150
0.018400,0.011600,0.275650,0.694350
0.018650,0.013200,0.272600,0.695550
0.019000,0.013100,0.271750,0.696150
0.020900,0.012200,0.270800,0.696100
0.020950,0.013050,0.269450,0.696550
0.021600,0.013450,0.267750,0.697200
0.021950,0.014900,0.264750,0.698400
0.022700,0.015700,0.262850,0.698750
0.023350,0.015950,0.261000,0.699700
0.024800,0.017100,0.257100,0.701000
0.026200,0.018950,0.253350,0.701500
0.028500,0.018950,0.250000,0.702550
0.029250,0.018000,0.247900,0.704850
0.030550,0.018050,0.244850,0.706550
0.032400,0.017200,0.242400,0.708000
0.033450,0.017500,0.240100,0.708950
0.033150,0.017600,0.237650,0.711600
0.033550,0.018350,0.235300,0.712800
0.033450,0.019500,0.231500,0.715550
0.034350,0.020500,0.227150,0.718000
0.036800,0.019950,0.224100,0.719150
0.037450,0.021450,0.221050,0.720050
0.039200,0.020750,0.218150,0.721900
0.039400,0.020800,0.215450,0.724350
0.038450,0.022100,0.211450,0.728000
0.039950,0.021900,0.208850,0.729300
0.040400,0.022950,0.205450,0.731200
0.041250,0.022550,0.201450,0.734750
0.041750,0.023050,0.197750,0.737450
0.042700,0.023000,0.194500,0.739800
0.042450,0.022850,0.192200,0.742500
0.043300,0.022450,0.188250,0.746000
0.043750,0.022000,0.184850,0.749400
0.043850,0.021450,0.182050,0.752650
0.044350,0.021200,0.178950,0.755500
0.045350,0.021100,0.175750,0.757800
0.045050,0.020450,0.174100,0.760400
0.044550,0.020800,0.170900,0.763750
0.043700,0.021550,0.168000,0.766750
0.044400,0.021400,0.164650,0.769550
0.045400,0.020300,0.163050,0.771250
0.043450,0.020400,0.161700,0.774450
0.042300,0.019600,0.159250,0.778850
0.041450,0.018900,0.157800,0.781850
0.042200,0.018550,0.156750,0.782500
0.041600,0.018450,0.155500,0.784450
0.042550,0.017600,0.153800,0.786050
0.041250,0.017300,0.152650,0.788800
0.040650,0.016450,0.152550,0.790350
0.039400,0.016750,0.151900,0.791950
0.038150,0.015700,0.151650,0.794500
0.037700,0.015900,0.150100,0.796300
0.036750,0.016150,0.149550,0.797550
0.037250,0.014800,0.150000,0.797950
0.035900,0.015050,0.148900,0.800150
0.035500,0.015100,0.148500,0.800900
0.035150,0.014550,0.147800,0.802500
0.034500,0.013700,0.149350,0.802450
0.034050,0.014000,0.149050,0.802900
0.034050,0.012900,0.150000,0.803050
0.032850,0.013800,0.149850,0.803500
0.032100,0.013350,0.150750,0.803800
0.031000,0.013700,0.151400,0.803900
0.031200,0.012850,0.152400,0.803550
0.030300,0.013050,0.152900,0.803750
0.029550,0.012300,0.154500,0.803650
0.028650,0.012750,0.155100,0.803500
0.027750,0.012600,0.155750,0.803900
0.027400,0.013000,0.155650,0.803950
0.027500,0.012250,0.156650,0.803600
0.025800,0.011900,0.158900,0.803400
0.026650,0.010400,0.161650,0.801300
0.025450,0.010100,0.163300,0.801150
0.024600,0.009750,0.164250,0.801400
0.025100,0.009850,0.165100,0.799950
0.024200,0.010200,0.165600,0.800000
0.024850,0.009850,0.166550,0.798750
0.024550,0.010250,0.167800,0.797400
0.023750,0.010300,0.169600,0.796350
0.024350,0.010750,0.170700,0.794200
0.022950,0.011150,0.171600,0.794300
0.022000,0.011650,0.172950,0.793400
0.021950,0.011400,0.175350,0.791300
0.023000,0.010900,0.176550,0.789550
0.022400,0.011200,0.177700,0.788700
0.022050,0.011500,0.178400,0.788050
0.022800,0.011250,0.179450,0.786500
0.024800,0.010300,0.180650,0.784250
0.024600,0.010950,0.181200,0.783250
0.023950,0.011300,0.182050,0.782700
0.023450,0.011250,0.183200,0.782100
0.024250,0.011350,0.184500,0.779900
0.025400,0.009650,0.186050,0.778900
0.024900,0.010200,0.187150,0.777750
0.023700,0.011550,0.187500,0.777250
0.022850,0.013000,0.187900,0.776250
0.024000,0.012450,0.188350,0.775200
0.023900,0.012100,0.188900,0.775100
0.023800,0.012000,0.189450,0.774750
0.024150,0.012050,0.189700,0.774100
0.023950,0.011600,0.191500,0.772950
0.024400,0.012000,0.192950,0.770650
0.023900,0.012600,0.193950,0.769550
0.023550,0.012950,0.194500,0.769000
0.024150,0.012200,0.195350,0.768300
0.024350,0.013200,0.194600,0.767850
0.024750,0.013050,0.196150,0.766050
0.024500,0.012850,0.197300,0.765350
0.024450,0.013450,0.196850,0.765250
0.024300,0.013350,0.198250,0.764100
0.024500,0.013300,0.198700,0.763500
0.025450,0.012350,0.199550,0.762650
0.025650,0.012250,0.199750,0.762350
0.025850,0.013350,0.199450,0.761350
0.025800,0.013800,0.199050,0.761350
0.025650,0.014250,0.199050,0.761050
0.026350,0.014350,0.199950,0.759350
0.026650,0.014750,0.199900,0.758700
0.027000,0.015150,0.200850,0.757000
0.028350,0.013850,0.201800,0.756000
0.027750,0.014500,0.201850,0.755900
0.027900,0.014350,0.202350,0.755400
0.028100,0.014100,0.203350,0.754450
0.027100,0.014300,0.202650,0.755950
0.026900,0.014850,0.202750,0.755500
0.027850,0.014400,0.202700,0.755050
0.028250,0.014900,0.203250,0.753600
0.028600,0.014700,0.203350,0.753350
0.029050,0.014950,0.203750,0.752250
0.028900,0.014850,0.203900,0.752350
0.029050,0.015650,0.204150,0.751150
0.029750,0.015250,0.204650,0.750350
0.030000,0.015400,0.204150,0.750450
0.030400,0.015600,0.203700,0.750300
0.030450,0.016200,0.203750,0.749600
0.032000,0.016500,0.202700,0.748800
0.033000,0.016400,0.203050,0.747550
0.033350,0.017500,0.201800,0.747350
0.033950,0.018050,0.200450,0.747550
0.035100,0.017750,0.199700,0.747450
0.034750,0.017950,0.199250,0.748050
0.035300,0.017750,0.199650,0.747300
0.035500,0.018000,0.198350,0.748150
0.035800,0.017650,0.198350,0.748200
0.035950,0.018550,0.197450,0.748050
0.036350,0.018800,0.195900,0.748950
0.038350,0.019000,0.193700,0.748950
0.039400,0.020100,0.192150,0.748350
0.039150,0.020150,0.190350,0.750350
0.038750,0.020450,0.189000,0.751800
0.039250,0.020000,0.188550,0.752200
0.039850,0.020100,0.187500,0.752550
0.040250,0.020300,0.186200,0.753250
0.040000,0.020850,0.185700,0.753450
0.041450,0.020500,0.183600,0.754450
0.041150,0.019900,0.182950,0.756000
0.041900,0.019800,0.182550,0.755750
0.041300,0.019550,0.182400,0.756750
0.040600,0.019400,0.182000,0.758000
0.040100,0.020200,0.180850,0.758850
0.040400,0.019650,0.179150,0.760800
0.039950,0.019050,0.178950,0.762050
0.040300,0.020150,0.178450,0.761100
0.040200,0.020600,0.177250,0.761950
0.041150,0.019700,0.176300,0.762850
0.040300,0.020100,0.175950,0.763650
0.040700,0.018950,0.175950,0.764400
0.040450,0.018900,0.175450,0.765200
0.039600,0.018800,0.175450,0.766150
0.040100,0.018350,0.176150,0.765400
0.039200,0.020200,0.175000,0.765600
0.040200,0.019350,0.175550,0.764900
0.040650,0.018150,0.176250,0.764950
0.039300,0.019250,0.175150,0.766300
0.039850,0.017750,0.174800,0.767600
0.039900,0.017950,0.174000,0.768150
0.039000,0.018350,0.173050,0.769600
0.039050,0.018750,0.173150,0.769050
0.039000,0.019300,0.172100,0.769600
0.039000,0.018550,0.171650,0.770800
0.038750,0.016850,0.173500,0.770900
0.038500,0.016400,0.173900,0.771200
0.037700,0.016450,0.174750,0.771100
0.036550,0.017700,0.173100,0.772650
0.036300,0.017450,0.173150,0.773100
0.035600,0.018000,0.173050,0.773350
0.036150,0.017550,0.172200,0.774100
0.035000,0.018100,0.171200,0.775700
0.036050,0.017300,0.171200,0.775450
0.034250,0.017850,0.171250,0.776650
0.034300,0.016200,0.172050,0.777450
0.034500,0.016150,0.173250,0.776100
0.033900,0.016250,0.174650,0.775200
0.034250,0.015800,0.175700,0.774250
0.034200,0.015950,0.175400,0.774450
0.033650,0.016850,0.175250,0.774250
0.033600,0.017550,0.175100,0.773750
0.034550,0.017350,0.175250,0.772850
0.034400,0.017500,0.175450,0.772650
0.034750,0.016850,0.175300,0.773100
0.035100,0.016350,0.176650,0.771900
0.034150,0.017150,0.176250,0.772450
0.034900,0.016800,0.176650,0.771650
0.036850,0.015550,0.176500,0.771100
0.036000,0.016200,0.176050,0.771750
0.036350,0.016500,0.176550,0.770600
0.035950,0.015700,0.178600,0.769750
0.035750,0.015100,0.178250,0.770900
0.034250,0.016200,0.178250,0.771300
0.033350,0.017000,0.177700,0.771950
0.031950,0.018350,0.176300,0.773400
0.032900,0.017750,0.176100,0.773250
0.034350,0.017250,0.176200,0.772200
0.033800,0.017400,0.176500,0.772300
0.034950,0.017100,0.176800,0.771150
0.035900,0.015950,0.177500,0.770650
0.035000,0.016550,0.178350,0.770100
0.035250,0.016200,0.178550,0.770000
0.033950,0.017200,0.177900,0.770950
0.034650,0.015650,0.179150,0.770550
0.033300,0.016050,0.180400,0.770250
0.032200,0.017400,0.180750,0.769650
0.031200,0.017550,0.181200,0.770050
0.031550,0.016650,0.182500,0.769300
0.031550,0.015500,0.183000,0.769950
0.031850,0.016000,0.182400,0.769750
0.032000,0.016150,0.182100,0.769750
0.032200,0.015700,0.183350,0.768750
0.032050,0.015500,0.183500,0.768950
0.032550,0.014650,0.184450,0.768350
0.032500,0.014750,0.184250,0.768500
0.033250,0.015000,0.183950,0.767800
0.033600,0.014400,0.184750,0.767250
0.033600,0.014700,0.185050,0.766650
0.032750,0.015050,0.186400,0.765800
0.033150,0.015200,0.186650,0.765000
0.033500,0.015850,0.186400,0.764250
0.033800,0.016400,0.186200,0.763600
0.034750,0.016200,0.186250,0.762800
0.033850,0.017000,0.185750,0.763400
0.034200,0.016800,0.185350,0.763650
0.035050,0.016700,0.184500,0.763750
0.034600,0.017750,0.185250,0.762400
0.034350,0.017550,0.184350,0.763750
0.034350,0.017000,0.184550,0.764100
0.034500,0.017500,0.185650,0.762350
0.035300,0.017450,0.186100,0.761150
0.035100,0.017500,0.185300,0.762100
0.035550,0.017800,0.184150,0.762500
0.035100,0.018100,0.183050,0.763750
0.035250,0.016800,0.182300,0.765650
0.035600,0.017200,0.182000,0.765200
0.035250,0.019100,0.181000,0.764650
0.035250,0.017700,0.181200,0.765850
0.034900,0.017600,0.181600,0.765900
0.036150,0.017350,0.181350,0.765150
0.035650,0.017100,0.182100,0.765150
0.035850,0.016800,0.182150,0.765200
0.035250,0.015450,0.183000,0.766300
0.034200,0.016650,0.182950,0.766200
0.033400,0.017350,0.182950,0.766300
0.033200,0.016100,0.183700,0.767000
0.033450,0.015650,0.184450,0.766450
0.033300,0.015650,0.184800,0.766250
0.033800,0.015950,0.183650,0.766600
0.033350,0.016250,0.183250,0.767150
0.033450,0.016000,0.185000,0.765550
0.035150,0.016150,0.183550,0.765150
0.034550,0.015700,0.184350,0.765400
0.034750,0.015050,0.185150,0.765050
0.033500,0.016600,0.184600,0.765300
0.034950,0.015550,0.185150,0.764350
0.034150,0.016900,0.185150,0.763800
0.033350,0.017700,0.184550,0.764400
0.033800,0.017350,0.184450,0.764400
0.034200,0.016550,0.184650,0.764600
0.034700,0.015500,0.184500,0.765300
0.033850,0.015750,0.184500,0.765900
0.033700,0.015900,0.184400,0.766000
0.033300,0.015750,0.184500,0.766450
0.033150,0.015600,0.185150,0.766100
0.032850,0.015500,0.185850,0.765800
0.032050,0.017000,0.185150,0.765800
0.032800,0.017150,0.185750,0.764300
0.035050,0.016150,0.184950,0.763850
0.034500,0.017000,0.184500,0.764000
0.035000,0.016550,0.184750,0.763700
0.035400,0.016650,0.183600,0.764350
0.034850,0.017300,0.182000,0.765850
0.034850,0.017900,0.180800,0.766450
0.035100,0.017150,0.181050,0.766700
0.034600,0.016950,0.180950,0.767500
0.034550,0.017350,0.180600,0.767500
0.035950,0.016300,0.181050,0.766700
0.035750,0.015950,0.181300,0.767000
0.035000,0.016600,0.180750,0.767650
0.035150,0.016200,0.181000,0.767650
0.034900,0.015950,0.181400,0.767750
0.034050,0.015900,0.181550,0.768500
0.033500,0.015200,0.182150,0.769150
0.032600,0.015400,0.182700,0.769300
0.032850,0.015900,0.182150,0.769100
0.032600,0.016300,0.181100,0.770000
0.032700,0.016450,0.181050,0.769800
0.033150,0.016150,0.181150,0.769550
0.033050,0.016200,0.181400,0.769350
0.032450,0.016250,0.182500,0.768800
0.033100,0.016050,0.182900,0.767950
0.033600,0.015250,0.183700,0.767450
0.032500,0.015300,0.184400,0.767800
0.033050,0.014450,0.185700,0.766800
0.032250,0.015450,0.184800,0.767500
0.032050,0.014900,0.185600,0.767450
0.032500,0.015600,0.185450,0.766450
0.033100,0.015150,0.185900,0.765850
0.033600,0.015000,0.186650,0.764750
0.033600,0.016200,0.187100,0.763100
0.033100,0.016000,0.187300,0.763600
0.032400,0.016800,0.187300,0.763500
0.032000,0.016800,0.187350,0.763850
0.032700,0.016350,0.188550,0.762400
0.032400,0.016750,0.189250,0.761600
0.032300,0.018300,0.188250,0.761150
0.033550,0.017850,0.189650,0.758950
0.034150,0.017550,0.189900,0.758400
0.034800,0.017000,0.190400,0.757800
0.033950,0.017650,0.190600,0.757800
0.034050,0.017500,0.190800,0.757650
0.034600,0.015600,0.191850,0.757950
0.035250,0.016050,0.191600,0.757100
0.033950,0.017700,0.190050,0.758300
0.034800,0.016350,0.190000,0.758850
0.032650,0.016500,0.189900,0.760950
0.033750,0.016200,0.189300,0.760750
0.033600,0.016300,0.188750,0.761350
0.033650,0.017150,0.188600,0.760600
0.034000,0.017550,0.188550,0.759900
0.033900,0.017850,0.189000,0.759250
0.034150,0.016850,0.189700,0.759300
0.034100,0.016850,0.189700,0.759350
0.034050,0.016750,0.188900,0.760300
0.033800,0.017100,0.189550,0.759550
0.034400,0.017900,0.188600,0.759100
0.035000,0.017450,0.188250,0.759300
0.035800,0.017900,0.187800,0.758500
0.036000,0.017300,0.187650,0.759050
0.035950,0.017750,0.187100,0.759200
0.035500,0.018300,0.186450,0.759750
0.035200,0.018450,0.185850,0.760500
0.035400,0.018150,0.185950,0.760500
0.036150,0.016650,0.186950,0.760250
0.035650,0.017450,0.186300,0.760600
0.034750,0.018850,0.185300,0.761100
0.036300,0.018650,0.185550,0.759500
0.037950,0.018550,0.185850,0.757650
0.037000,0.017950,0.185900,0.759150
0.037050,0.017450,0.186750,0.758750
0.037250,0.017600,0.186450,0.758700
0.037650,0.017000,0.187750,0.757600
0.037600,0.018150,0.187200,0.757050
0.036650,0.019050,0.186800,0.757500
0.037000,0.018350,0.187350,0.757300
0.036800,0.017650,0.187350,0.758200
0.037000,0.018700,0.186650,0.757650
0.036950,0.018300,0.186500,0.758250
0.037650,0.018400,0.185150,0.758800
0.037600,0.018600,0.185500,0.758300
0.037750,0.018450,0.184700,0.759100
0.037150,0.019450,0.182850,0.760550
0.037100,0.019900,0.181650,0.761350
0.036750,0.020150,0.181750,0.761350
0.036750,0.019300,0.182650,0.761300
0.036800,0.018800,0.182950,0.761450
0.037350,0.019950,0.182400,0.760300
0.037550,0.019450,0.182950,0.760050
0.037600,0.019150,0.182950,0.760300
0.037850,0.019000,0.182800,0.760350
0.037900,0.018850,0.182600,0.760650
0.038350,0.017000,0.183650,0.761000
0.038300,0.016850,0.182900,0.761950
0.036800,0.017850,0.182600,0.762750
0.036900,0.018150,0.181800,0.763150
0.037000,0.017850,0.181750,0.763400
0.037050,0.018500,0.181700,0.762750
0.036800,0.018500,0.181250,0.763450
0.036250,0.018350,0.181000,0.764400
0.037350,0.018150,0.180500,0.764000
0.038600,0.018050,0.179650,0.763700
0.039700,0.017700,0.179100,0.763500
0.040350,0.017400,0.177950,0.764300
0.039800,0.018000,0.177550,0.764650
0.039200,0.018400,0.177050,0.765350
0.039600,0.017850,0.176500,0.766050
0.040250,0.018000,0.176650,0.765100
0.039750,0.018100,0.176550,0.765600
0.038900,0.019250,0.175650,0.766200
0.040150,0.018000,0.176350,0.765500
0.039350,0.017850,0.176750,0.766050
0.038650,0.018400,0.176250,0.766700
0.038850,0.018650,0.176050,0.766450
0.038350,0.018150,0.176300,0.767200
0.037750,0.018900,0.174750,0.768600
0.037400,0.019100,0.173950,0.769550
0.037900,0.018150,0.174400,0.769550
0.038550,0.018150,0.174400,0.768900
0.037500,0.017500,0.174750,0.770250
0.037300,0.016450,0.175550,0.770700
0.036500,0.016950,0.176300,0.770250
0.037200,0.016750,0.176800,0.769250
0.036950,0.016950,0.177350,0.768750
0.036200,0.017450,0.177450,0.768900
0.037600,0.016600,0.177550,0.768250
0.037200,0.016150,0.178150,0.768500
0.037650,0.015400,0.178600,0.768350
0.037150,0.015000,0.178950,0.768900
0.035200,0.015450,0.180100,0.769250
0.035850,0.016400,0.180000,0.767750
0.034750,0.016000,0.180700,0.768550
0.034100,0.016650,0.181150,0.768100
0.033950,0.016500,0.181400,0.768150
0.034500,0.017400,0.181650,0.766450
0.034150,0.016750,0.182750,0.766350
0.034150,0.016150,0.183900,0.765800
0.034150,0.016700,0.184000,0.765150
0.034050,0.016300,0.184550,0.765100
0.034700,0.015600,0.185150,0.764550
0.033850,0.015650,0.184800,0.765700
0.034350,0.015800,0.185050,0.764800
0.033900,0.014750,0.186250,0.765100
0.033600,0.015250,0.186500,0.764650
0.033100,0.016300,0.186950,0.763650
0.033100,0.015950,0.187700,0.763250
0.034350,0.015550,0.187500,0.762600
0.034050,0.016300,0.187250,0.762400
0.033300,0.017700,0.186150,0.762850
0.033750,0.017950,0.186050,0.762250
0.034850,0.018400,0.185350,0.761400
0.034900,0.017900,0.184850,0.762350
0.034700,0.018400,0.184050,0.762850
0.034700,0.018000,0.184700,0.762600
0.034650,0.017250,0.184600,0.763500
0.035700,0.017050,0.185100,0.762150
0.035450,0.016300,0.185800,0.762450
0.035450,0.015950,0.185900,0.762700
0.035400,0.016100,0.186650,0.761850
0.034900,0.016150,0.186800,0.762150
0.035450,0.016350,0.186700,0.761500
0.034650,0.016350,0.187300,0.761700
0.035200,0.015700,0.187750,0.761350
0.035300,0.015500,0.187900,0.761300
0.035400,0.015300,0.187800,0.761500
0.033900,0.017300,0.186350,0.762450
0.033300,0.017950,0.186700,0.762050
0.034350,0.017500,0.186900,0.761250
0.034900,0.017650,0.187250,0.760200
0.036000,0.016750,0.187000,0.760250
0.035900,0.016700,0.187650,0.759750
0.036050,0.018050,0.187250,0.758650
0.036800,0.016100,0.188500,0.758600
0.036600,0.016950,0.188350,0.758100
0.036550,0.018400,0.187400,0.757650
0.036950,0.017700,0.187400,0.757950
0.036100,0.018250,0.187000,0.758650
0.037350,0.017650,0.187100,0.757900
0.037300,0.016200,0.188150,0.758350
0.036300,0.016350,0.188700,0.758650
0.036100,0.016350,0.188650,0.758900
0.035800,0.016100,0.190250,0.757850
0.035300,0.016500,0.190250,0.757950
0.035150,0.016750,0.189950,0.758150
0.034400,0.018000,0.189150,0.758450
0.034250,0.018350,0.188900,0.758500
0.035700,0.018750,0.188700,0.756850
0.036150,0.019400,0.188000,0.756450
0.036800,0.019150,0.187800,0.756250
0.037850,0.018650,0.187300,0.756200
0.038350,0.019000,0.186200,0.756450
0.038350,0.019200,0.186150,0.756300
0.039500,0.019800,0.184200,0.756500
0.039750,0.020200,0.182850,0.757200
0.039700,0.019450,0.183850,0.757000
0.039300,0.019300,0.183850,0.757550
0.038350,0.020050,0.182500,0.759100
0.038700,0.019800,0.181300,0.760200
0.039800,0.018000,0.181800,0.760400
0.038100,0.019050,0.180300,0.762550
0.037500,0.018150,0.180600,0.763750
0.037700,0.017850,0.181050,0.763400
0.037000,0.018200,0.180950,0.763850
0.035950,0.018750,0.181200,0.764100
0.036000,0.018100,0.181200,0.764700
0.034850,0.017100,0.182550,0.765500
0.034950,0.017750,0.183200,0.764100
0.035450,0.017200,0.183250,0.764100
0.035000,0.018450,0.182700,0.763850
0.034650,0.019300,0.182550,0.763500
0.034300,0.019500,0.181750,0.764450
0.034200,0.019200,0.181300,0.765300
0.034700,0.019150,0.180750,0.765400
0.034400,0.018400,0.181900,0.765300
0.035350,0.017900,0.181500,0.765250
0.035500,0.017800,0.181400,0.765300
0.035100,0.017100,0.181700,0.766100
0.035250,0.017150,0.181800,0.765800
0.035450,0.017000,0.182050,0.765500
0.034350,0.016800,0.182650,0.766200
0.034300,0.016550,0.183500,0.765650
0.034250,0.017050,0.183600,0.765100
0.035000,0.016400,0.183800,0.764800
0.035300,0.017000,0.183900,0.763800
0.035200,0.017500,0.183600,0.763700
0.036450,0.016550,0.184350,0.762650
0.036050,0.017350,0.183950,0.762650
0.036950,0.017750,0.183750,0.761550
0.036700,0.017950,0.183550,0.761800
0.037000,0.018000,0.183400,0.761600
0.037250,0.017850,0.183700,0.761200
0.037200,0.018350,0.183450,0.761000
0.038100,0.018500,0.183250,0.760150
0.037850,0.018250,0.183250,0.760650
0.037750,0.017750,0.183200,0.761300
0.038050,0.016450,0.183750,0.761750
0.037900,0.016700,0.183250,0.762150
0.037450,0.016600,0.182900,0.763050
0.037350,0.016750,0.183150,0.762750
0.037200,0.016450,0.183150,0.763200
0.037500,0.016500,0.183550,0.762450
0.037000,0.017100,0.183050,0.762850
0.037200,0.017500,0.181900,0.763400
0.037100,0.016700,0.182000,0.764200
0.036800,0.017100,0.181900,0.764200
0.036850,0.017700,0.180650,0.764800
0.037500,0.017150,0.180150,0.765200
0.038100,0.017050,0.179900,0.764950
0.038200,0.017800,0.178950,0.765050
0.037750,0.017950,0.179100,0.765200
0.037550,0.017250,0.179450,0.765750
0.038600,0.016800,0.179200,0.765400
0.037650,0.016950,0.179450,0.765950
0.037050,0.016750,0.179350,0.766850
0.035500,0.017850,0.178150,0.768500
0.036000,0.017550,0.177850,0.768600
0.036500,0.017600,0.178350,0.767550
0.036750,0.018450,0.177200,0.767600
0.036950,0.018300,0.177150,0.767600
0.036650,0.018750,0.177500,0.767100
0.037550,0.017850,0.177400,0.767200
