I,E,S,R
0.001000,0.000600,0.998400,0.000000
0.001050,0.001150,0.997700,0.000100
0.001450,0.001350,0.997050,0.000150
0.001600,0.002250,0.995750,0.000400
0.001800,0.002650,0.994800,0.000750
0.002250,0.003600,0.993150,0.001000
0.002800,0.005400,0.990400,0.001400
0.004000,0.007300,0.986900,0.001800
0.005000,0.009950,0.982850,0.002200
0.007350,0.012450,0.977350,0.002850
0.009950,0.014900,0.971350,0.003800
0.012800,0.019850,0.962200,0.005150
0.016600,0.024550,0.952250,0.006600
0.021100,0.030800,0.939050,0.009050
0.026850,0.039800,0.921400,0.011950
0.034550,0.049550,0.900400,0.015500
0.043000,0.064500,0.872450,0.020050
0.054750,0.076400,0.843250,0.025600
0.069300,0.095950,0.801800,0.032950
0.088750,0.117300,0.752100,0.041850
0.110850,0.139550,0.696300,0.053300
0.134850,0.164700,0.632550,0.067900
0.164400,0.187850,0.563100,0.084650
0.196400,0.208600,0.489000,0.106000
0.231150,0.220600,0.416600,0.131650
0.261400,0.230450,0.345400,0.162750
0.294400,0.232900,0.277300,0.195400
0.318950,0.227900,0.218150,0.235000
0.340400,0.210650,0.171300,0.277650
0.360250,0.188200,0.131700,0.319850
0.365950,0.168200,0.099850,0.366000
0.363000,0.147100,0.074150,0.415750
0.356700,0.124850,0.055150,0.463300
0.345300,0.102500,0.042950,0.509250
0.327350,0.081400,0.036000,0.555250
0.307350,0.065900,0.030400,0.596350
0.286200,0.052050,0.026350,0.635400
0.263450,0.042000,0.023450,0.671100
0.242600,0.033300,0.022150,0.701950
0.218550,0.026850,0.021050,0.733550
0.196050,0.022550,0.020000,0.761400
0.175200,0.018200,0.020200,0.786400
0.156100,0.016950,0.018750,0.808200
0.139650,0.014350,0.018950,0.827050
0.123800,0.011800,0.020250,0.844150
0.109300,0.010350,0.020750,0.859600
0.096750,0.009600,0.022350,0.871300
0.085650,0.008850,0.023450,0.882050
0.077350,0.007400,0.025500,0.889750
0.069100,0.007300,0.027300,0.896300
0.062650,0.006700,0.028850,0.901800
0.055100,0.005500,0.031550,0.907850
0.047500,0.005050,0.033700,0.913750
0.041700,0.004800,0.036050,0.917450
0.037200,0.003850,0.039000,0.919950
0.032950,0.003850,0.041350,0.921850
0.028750,0.003650,0.043750,0.923850
0.025800,0.003350,0.047000,0.923850
0.022800,0.003000,0.050000,0.924200
0.020150,0.003000,0.053700,0.923150
0.017850,0.002900,0.056050,0.923200
0.015900,0.002900,0.058700,0.922500
0.014200,0.002400,0.061750,0.921650
0.012700,0.002150,0.063650,0.921500
0.011800,0.002150,0.066250,0.919800
0.010900,0.002050,0.069100,0.917950
0.010200,0.001700,0.071550,0.916550
0.009200,0.001700,0.074650,0.914450
0.008350,0.001800,0.077550,0.912300
0.007850,0.001650,0.079750,0.910750
0.006700,0.001450,0.082350,0.909500
0.006200,0.001500,0.085650,0.906650
0.006100,0.001400,0.088600,0.903900
0.005650,0.001500,0.091450,0.901400
0.005100,0.001200,0.094450,0.899250
0.004450,0.001150,0.097150,0.897250
0.004200,0.001000,0.099700,0.895100
0.004150,0.001100,0.103050,0.891700
0.003650,0.001150,0.105600,0.889600
0.003550,0.001150,0.107750,0.887550
0.003450,0.000750,0.109900,0.885900
0.002950,0.000850,0.112400,0.883800
0.003050,0.001050,0.114700,0.881200
0.002650,0.000900,0.117200,0.879250
0.002350,0.000750,0.119950,0.876950
0.002150,0.000900,0.122600,0.874350
0.002250,0.000700,0.126100,0.870950
0.002250,0.000800,0.127950,0.869000
0.002200,0.000600,0.130600,0.866600
0.002050,0.000700,0.133350,0.863900
0.001750,0.000600,0.136000,0.861650
0.001350,0.000600,0.139050,0.859000
0.001450,0.000500,0.141750,0.856300
0.001450,0.000450,0.144550,0.853550
0.001450,0.000350,0.147450,0.850750
0.001250,0.000350,0.150300,0.848100
0.001300,0.000500,0.152850,0.845350
0.001300,0.000500,0.155800,0.842400
0.001150,0.000650,0.158150,0.840050
0.001200,0.000550,0.160950,0.837300
0.001200,0.000550,0.163650,0.834600
0.001050,0.000550,0.166050,0.832350
0.001050,0.000450,0.168600,0.829900
0.000850,0.000600,0.170800,0.827750
0.000850,0.000500,0.173400,0.825250
0.000900,0.000350,0.175300,0.823450
0.001000,0.000350,0.177350,0.821300
0.001050,0.000450,0.179550,0.818950
0.000950,0.000550,0.182300,0.816200
0.001150,0.000650,0.184300,0.813900
0.001300,0.000400,0.186450,0.811850
0.001150,0.000500,0.189600,0.808750
0.001100,0.000650,0.191750,0.806500
0.000950,0.000650,0.194100,0.804300
0.000750,0.000750,0.196150,0.802350
0.001000,0.000450,0.197900,0.800650
0.001000,0.000550,0.200100,0.798350
0.000950,0.000700,0.201700,0.796650
0.001100,0.000550,0.203300,0.795050
0.001050,0.000500,0.205050,0.793400
0.001100,0.000450,0.207600,0.790850
0.001100,0.000600,0.209600,0.788700
0.001100,0.000550,0.212200,0.786150
0.001050,0.000600,0.214650,0.783700
0.001100,0.000700,0.215900,0.782300
0.001150,0.000550,0.218600,0.779700
0.001200,0.000700,0.220300,0.777800
0.001300,0.000850,0.221650,0.776200
0.001300,0.000750,0.223500,0.774450
0.001400,0.000650,0.226100,0.771850
0.001500,0.000650,0.227700,0.770150
0.001400,0.000950,0.229900,0.767750
0.001550,0.001150,0.232250,0.765050
0.001700,0.001050,0.234050,0.763200
0.001950,0.001100,0.235850,0.761100
0.002100,0.000750,0.238050,0.759100
0.002000,0.000850,0.240050,0.757100
0.001950,0.000900,0.241950,0.755200
0.001850,0.001000,0.243750,0.753400
0.001800,0.001150,0.245600,0.751450
0.001750,0.001250,0.247200,0.749800
0.001850,0.001300,0.248900,0.747950
0.002150,0.001000,0.250700,0.746150
0.002300,0.001200,0.252950,0.743550
0.002300,0.001000,0.254550,0.742150
0.002200,0.001250,0.255500,0.741050
0.002400,0.001100,0.257400,0.739100
0.002600,0.001200,0.258600,0.737600
0.002550,0.001500,0.259850,0.736100
0.002650,0.001600,0.260950,0.734800
0.002800,0.001600,0.262900,0.732700
0.002950,0.001550,0.264450,0.731050
0.003300,0.002000,0.265200,0.729500
0.003500,0.002050,0.266650,0.727800
0.003450,0.002750,0.267650,0.726150
0.003900,0.002700,0.268850,0.724550
0.003800,0.003050,0.270050,0.723100
0.003800,0.003300,0.271300,0.721600
0.004700,0.002900,0.272500,0.719900
0.004750,0.003200,0.273150,0.718900
0.005100,0.003550,0.274100,0.717250
0.005350,0.003550,0.274900,0.716200
0.005550,0.003750,0.275850,0.714850
0.005100,0.003950,0.276900,0.714050
0.005650,0.003850,0.278200,0.712300
0.006300,0.003950,0.279100,0.710650
0.006650,0.004150,0.280050,0.709150
0.006900,0.003950,0.281150,0.708000
0.007450,0.003750,0.281800,0.707000
0.008050,0.004100,0.282150,0.705700
0.008000,0.004950,0.281750,0.705300
0.008350,0.005350,0.281650,0.704650
0.009450,0.005150,0.282400,0.703000
0.010200,0.005050,0.283400,0.701350
0.009750,0.005450,0.283700,0.701100
0.010050,0.005450,0.283900,0.700600
0.009500,0.006150,0.284000,0.700350
0.010000,0.006400,0.283600,0.700000
0.010300,0.007000,0.283350,0.699350
0.011000,0.006800,0.283550,0.698650
0.010700,0.007200,0.283150,0.698950
0.011800,0.007200,0.282700,0.698300
0.012450,0.007500,0.282950,0.697100
0.012900,0.008700,0.281950,0.696450
0.013550,0.008800,0.281250,0.696400
0.014050,0.009900,0.280800,0.695250
0.014500,0.010150,0.280200,0.695150
0.016100,0.009700,0.280200,0.694000
0.016300,0.010250,0.279050,0.694400
0.017500,0.011000,0.277750,0.693750
0.018300,0.011600,0.276600,0.693500
0.019000,0.012100,0.274750,0.694150
0.019950,0.013100,0.272150,0.694800
0.020600,0.014700,0.269200,0.695500
0.021450,0.015000,0.266450,0.697100
0.022850,0.016100,0.263150,0.697900
0.024250,0.016650,0.260400,0.698700
0.026800,0.017900,0.256000,0.699300
0.027600,0.017300,0.253150,0.701950
0.029050,0.018100,0.249850,0.703000
0.029850,0.019550,0.246100,0.704500
0.030500,0.020450,0.242050,0.707000
0.031850,0.019800,0.239250,0.709100
0.032450,0.020200,0.235450,0.711900
0.033500,0.020450,0.231800,0.714250
0.034700,0.019750,0.228850,0.716700
0.034850,0.021200,0.224750,0.719200
0.036150,0.019550,0.222900,0.721400
0.036850,0.019300,0.219950,0.723900
0.037000,0.019700,0.216500,0.726800
0.037850,0.019450,0.213700,0.729000
0.038000,0.020350,0.210300,0.731350
0.039600,0.021550,0.206550,0.732300
0.039150,0.022450,0.202800,0.735600
0.040200,0.021950,0.199550,0.738300
0.041350,0.021750,0.195550,0.741350
0.041350,0.022700,0.191400,0.744550
0.041300,0.022000,0.188200,0.748500
0.041450,0.022050,0.185100,0.751400
0.042050,0.021600,0.182350,0.754000
0.043700,0.021550,0.178650,0.756100
0.044200,0.021200,0.176050,0.758550
0.043350,0.021450,0.173750,0.761450
0.044200,0.022000,0.170150,0.763650
0.045350,0.020050,0.168850,0.765750
0.044650,0.019700,0.166450,0.769200
0.046000,0.019600,0.163850,0.770550
0.045850,0.018900,0.162600,0.772650
0.044950,0.019650,0.160350,0.775050
0.044600,0.020150,0.158050,0.777200
0.043950,0.020250,0.156000,0.779800
0.044300,0.018750,0.154500,0.782450
0.042950,0.019000,0.152750,0.785300
0.042000,0.018700,0.151200,0.788100
0.041450,0.017850,0.150750,0.789950
0.040350,0.017150,0.150300,0.792200
0.040150,0.016600,0.150050,0.793200
0.039450,0.016350,0.149700,0.794500
0.039050,0.016000,0.148000,0.796950
0.038500,0.014500,0.148650,0.798350
0.037300,0.014400,0.149000,0.799300
0.036400,0.014750,0.148550,0.800300
0.034900,0.014750,0.148600,0.801750
0.034350,0.014750,0.148200,0.802700
0.034250,0.014350,0.148750,0.802650
0.033300,0.014250,0.149250,0.803200
0.033300,0.013000,0.149650,0.804050
0.033650,0.012050,0.150100,0.804200
0.031550,0.012650,0.151100,0.804700
0.031150,0.011750,0.152450,0.804650
0.029850,0.012550,0.153000,0.804600
0.029700,0.012250,0.153700,0.804350
0.029900,0.011950,0.153800,0.804350
0.029550,0.011800,0.154550,0.804100
0.029500,0.011700,0.154450,0.804350
0.028000,0.012300,0.154850,0.804850
0.027150,0.012550,0.155350,0.804950
0.026600,0.012050,0.156250,0.805100
0.025900,0.011600,0.158250,0.804250
0.025600,0.011200,0.158700,0.804500
0.025700,0.010400,0.160150,0.803750
0.025850,0.010100,0.160400,0.803650
0.024750,0.010650,0.161450,0.803150
0.024650,0.010200,0.162500,0.802650
0.024750,0.010400,0.163950,0.800900
0.023550,0.009550,0.166200,0.800700
0.022900,0.008950,0.167550,0.800600
0.022250,0.009350,0.167750,0.800650
0.022400,0.009500,0.169700,0.798400
0.021200,0.009600,0.171250,0.797950
0.021050,0.009450,0.173300,0.796200
0.020900,0.009200,0.174950,0.794950
0.020450,0.009650,0.176450,0.793450
0.020850,0.009050,0.178550,0.791550
0.020500,0.009550,0.179300,0.790650
0.019950,0.009500,0.181450,0.789100
0.019950,0.009000,0.183700,0.787350
0.019050,0.009150,0.185750,0.786050
0.019400,0.008650,0.187700,0.784250
0.019650,0.009050,0.189150,0.782150
0.018700,0.009950,0.190100,0.781250
0.018550,0.009500,0.192300,0.779650
0.018300,0.009100,0.194000,0.778600
0.018800,0.009200,0.195150,0.776850
0.018100,0.009750,0.196750,0.775400
0.019000,0.009400,0.197850,0.773750
0.019100,0.009000,0.199400,0.772500
0.018850,0.009100,0.200100,0.771950
0.017750,0.008700,0.201750,0.771800
0.017700,0.009250,0.203200,0.769850
0.017750,0.009250,0.205500,0.767500
0.017500,0.010400,0.206850,0.765250
0.018500,0.010450,0.207450,0.763600
0.019400,0.010750,0.208400,0.761450
0.019600,0.011100,0.209150,0.760150
0.018900,0.011650,0.210000,0.759450
0.019900,0.011000,0.212300,0.756800
0.020100,0.011150,0.213150,0.755600
0.020750,0.011350,0.214950,0.752950
0.021150,0.011600,0.216150,0.751100
0.021300,0.011700,0.217350,0.749650
0.022500,0.011550,0.218600,0.747350
0.022550,0.011250,0.219800,0.746400
0.023300,0.010800,0.221150,0.744750
0.023550,0.012150,0.220750,0.743550
0.023500,0.012950,0.221150,0.742400
0.023550,0.013550,0.222350,0.740550
0.023950,0.013500,0.223700,0.738850
0.023900,0.013400,0.224350,0.738350
0.024100,0.014400,0.224700,0.736800
0.024150,0.015350,0.224950,0.735550
0.025200,0.016100,0.224600,0.734100
0.027250,0.016300,0.223700,0.732750
0.027900,0.015750,0.224150,0.732200
0.029450,0.015750,0.224050,0.730750
0.029500,0.016450,0.223250,0.730800
0.029150,0.017800,0.221150,0.731900
0.029850,0.017300,0.220900,0.731950
0.029550,0.018550,0.219100,0.732800
0.030900,0.018600,0.218050,0.732450
0.031800,0.018100,0.216950,0.733150
0.033050,0.017900,0.214850,0.734200
0.034550,0.018050,0.212500,0.734900
0.034950,0.019400,0.210800,0.734850
0.035050,0.019650,0.210050,0.735250
0.037200,0.019500,0.208500,0.734800
0.037600,0.020650,0.207050,0.734700
0.038150,0.021100,0.205550,0.735200
0.039550,0.020800,0.203300,0.736350
0.039450,0.021200,0.201850,0.737500
0.040050,0.021300,0.199100,0.739550
0.039700,0.020300,0.198450,0.741550
0.040850,0.019800,0.197150,0.742200
0.041350,0.020200,0.195300,0.743150
0.040600,0.021950,0.193100,0.744350
0.041500,0.021350,0.191300,0.745850
0.041900,0.021100,0.189250,0.747750
0.041950,0.021200,0.187600,0.749250
0.041350,0.020900,0.187550,0.750200
0.041700,0.021100,0.186450,0.750750
0.042950,0.020700,0.184450,0.751900
0.042450,0.022200,0.181600,0.753750
0.043800,0.021550,0.180100,0.754550
0.043500,0.021650,0.178950,0.755900
0.044800,0.021350,0.176250,0.757600
0.044600,0.020550,0.175550,0.759300
0.044100,0.019650,0.174850,0.761400
0.044850,0.019750,0.174500,0.760900
0.044550,0.020400,0.173200,0.761850
0.044300,0.020500,0.171650,0.763550
0.044100,0.020300,0.171050,0.764550
0.043100,0.020650,0.168600,0.767650
0.042200,0.020100,0.167900,0.769800
0.042250,0.019550,0.167600,0.770600
0.042100,0.018950,0.168000,0.770950
0.041500,0.019400,0.168100,0.771000
0.040700,0.019650,0.167550,0.772100
0.040500,0.019800,0.167150,0.772550
0.040700,0.019550,0.166950,0.772800
0.041050,0.018700,0.166200,0.774050
0.040200,0.019100,0.165550,0.775150
0.039800,0.018650,0.166350,0.775200
0.039800,0.018200,0.166000,0.776000
0.039700,0.018150,0.165950,0.776200
0.039400,0.018050,0.166000,0.776550
0.039100,0.017000,0.166000,0.777900
0.038850,0.017300,0.165600,0.778250
0.037650,0.018100,0.165900,0.778350
0.038250,0.017750,0.166550,0.777450
0.038700,0.017200,0.167500,0.776600
0.038450,0.016800,0.168100,0.776650
0.037050,0.017550,0.168250,0.777150
0.038350,0.016700,0.168150,0.776800
0.037150,0.016550,0.167200,0.779100
0.036750,0.015200,0.167150,0.780900
0.036350,0.015400,0.168250,0.780000
0.036400,0.015350,0.169400,0.778850
0.036550,0.015750,0.169000,0.778700
0.036150,0.016550,0.169100,0.778200
0.035850,0.016200,0.169200,0.778750
0.036700,0.016300,0.167750,0.779250
0.035800,0.016150,0.168800,0.779250
0.035300,0.015300,0.170200,0.779200
0.036400,0.014450,0.171750,0.777400
0.034900,0.014250,0.173200,0.777650
0.034350,0.014450,0.174350,0.776850
0.034150,0.014650,0.175300,0.775900
0.032750,0.016050,0.174300,0.776900
0.031900,0.015500,0.175550,0.777050
0.032100,0.015950,0.176750,0.775200
0.032050,0.016300,0.177350,0.774300
0.032300,0.015550,0.177750,0.774400
0.032150,0.014800,0.178650,0.774400
0.031850,0.015450,0.179400,0.773300
0.030850,0.016100,0.180350,0.772700
0.031450,0.016050,0.181300,0.771200
0.031500,0.015550,0.182100,0.770850
0.031400,0.014850,0.182950,0.770800
0.031400,0.014750,0.183600,0.770250
0.031500,0.015000,0.183450,0.770050
0.030700,0.015200,0.183200,0.770900
0.031200,0.015550,0.183050,0.770200
0.031850,0.015900,0.183950,0.768300
0.032400,0.014850,0.184800,0.767950
0.032000,0.014600,0.186450,0.766950
0.031200,0.016450,0.185650,0.766700
0.031150,0.016550,0.185200,0.767100
0.031400,0.014550,0.186000,0.768050
0.032150,0.014950,0.186050,0.766850
0.030850,0.015950,0.186800,0.766400
0.031650,0.016200,0.186350,0.765800
0.031900,0.016550,0.186450,0.765100
0.032200,0.015750,0.188200,0.763850
0.031850,0.015700,0.188500,0.763950
0.031550,0.015600,0.189250,0.763600
0.031000,0.016750,0.189200,0.763050
0.031900,0.016200,0.189350,0.762550
0.033000,0.017050,0.188050,0.761900
0.034100,0.016350,0.187900,0.761650
0.034750,0.016750,0.187050,0.761450
0.033900,0.016750,0.186800,0.762550
0.034000,0.017350,0.186650,0.762000
0.032950,0.017700,0.186450,0.762900
0.033050,0.018000,0.186900,0.762050
0.033450,0.017600,0.186950,0.762000
0.033650,0.017400,0.186650,0.762300
0.034500,0.017100,0.186750,0.761650
0.033850,0.017350,0.187550,0.761250
0.033700,0.017350,0.187050,0.761900
0.033200,0.016850,0.189300,0.760650
0.033350,0.016400,0.189700,0.760550
0.033300,0.017350,0.189250,0.760100
0.032950,0.016850,0.189250,0.760950
0.033700,0.017600,0.187450,0.761250
0.034200,0.017800,0.186650,0.761350
0.034900,0.017150,0.186000,0.761950
0.035250,0.016400,0.186200,0.762150
0.035750,0.017600,0.184700,0.761950
0.035650,0.017150,0.185200,0.762000
0.035400,0.017100,0.185650,0.761850
0.034150,0.018400,0.186400,0.761050
0.034900,0.018250,0.185700,0.761150
0.035400,0.017850,0.185600,0.761150
0.036650,0.017400,0.184250,0.761700
0.037200,0.017550,0.183950,0.761300
0.037750,0.016500,0.184550,0.761200
0.036500,0.017300,0.183950,0.762250
0.036350,0.018300,0.183400,0.761950
0.037150,0.017250,0.183500,0.762100
0.036850,0.017900,0.183200,0.762050
0.036850,0.017500,0.183650,0.762000
0.036350,0.017550,0.183500,0.762600
0.037150,0.017100,0.182900,0.762850
0.038350,0.017300,0.182850,0.761500
0.036850,0.018550,0.181600,0.763000
0.036450,0.018300,0.181450,0.763800
0.037350,0.017750,0.180850,0.764050
0.036850,0.018050,0.179750,0.765350
0.036500,0.018200,0.178850,0.766450
0.036050,0.018850,0.177850,0.767250
0.037100,0.018650,0.177350,0.766900
0.036900,0.018100,0.177650,0.767350
0.037450,0.017400,0.177550,0.767600
0.037050,0.017400,0.177400,0.768150
0.037250,0.017500,0.176450,0.768800
0.038450,0.017050,0.175800,0.768700
0.037250,0.016950,0.176950,0.768850
0.037500,0.016400,0.177400,0.768700
0.037000,0.016650,0.177700,0.768650
0.036500,0.017000,0.178000,0.768500
0.036100,0.017800,0.176700,0.769400
0.037050,0.017450,0.176800,0.768700
0.035700,0.017450,0.176250,0.770600
0.036150,0.017800,0.176350,0.769700
0.035850,0.018250,0.175650,0.770250
0.036400,0.017500,0.175550,0.770550
0.037750,0.017150,0.175100,0.770000
0.037000,0.017550,0.174550,0.770900
0.036900,0.017250,0.173650,0.772200
0.037000,0.016350,0.173850,0.772800
0.035050,0.017850,0.173250,0.773850
0.035100,0.017550,0.172650,0.774700
0.035650,0.017200,0.173450,0.773700
0.034600,0.016450,0.174100,0.774850
0.034900,0.016450,0.173950,0.774700
0.035700,0.015550,0.174550,0.774200
0.034650,0.016250,0.175150,0.773950
0.034550,0.016500,0.174750,0.774200
0.034900,0.016250,0.174400,0.774450
0.034700,0.015550,0.174300,0.775450
0.034550,0.015200,0.175150,0.775100
0.034050,0.015500,0.174400,0.776050
0.034350,0.015300,0.174650,0.775700
0.034600,0.014200,0.175400,0.775800
0.033550,0.014400,0.175750,0.776300
0.032500,0.015200,0.175150,0.777150
0.031500,0.015500,0.176050,0.776950
0.033200,0.015400,0.175900,0.775500
0.033450,0.014900,0.175700,0.775950
0.033300,0.015200,0.176000,0.775500
0.033100,0.015100,0.175850,0.775950
0.032600,0.014250,0.176800,0.776350
0.032100,0.014100,0.178550,0.775250
0.032900,0.014550,0.177900,0.774650
0.032300,0.015050,0.179000,0.773650
0.032250,0.015900,0.178650,0.773200
0.032100,0.015550,0.179300,0.773050
0.031400,0.015900,0.180050,0.772650
0.032250,0.016650,0.178650,0.772450
0.032000,0.017000,0.178500,0.772500
0.033400,0.017250,0.177700,0.771650
0.033000,0.016950,0.176700,0.773350
0.032500,0.017850,0.176100,0.773550
0.033100,0.016950,0.176400,0.773550
0.032550,0.016400,0.178000,0.773050
0.033650,0.015900,0.178300,0.772150
0.034150,0.015600,0.178750,0.771500
0.034550,0.015850,0.178700,0.770900
0.035000,0.015150,0.178050,0.771800
0.034100,0.014750,0.179050,0.772100
0.033150,0.014700,0.180450,0.771700
0.031500,0.015100,0.181300,0.772100
0.031000,0.015800,0.181750,0.771450
0.030650,0.015500,0.182250,0.771600
0.030400,0.016000,0.182850,0.770750
0.031000,0.015900,0.183100,0.770000
0.029900,0.016700,0.183700,0.769700
0.031900,0.015350,0.184750,0.768000
0.031800,0.015800,0.185300,0.767100
0.032050,0.016600,0.184550,0.766800
0.033850,0.015250,0.185050,0.765850
0.033350,0.014700,0.185650,0.766300
0.032100,0.015100,0.186150,0.766650
0.031750,0.015800,0.185750,0.766700
0.032450,0.015100,0.185800,0.766650
0.031350,0.014450,0.186450,0.767750
0.031250,0.014250,0.188000,0.766500
0.030800,0.014700,0.187950,0.766550
0.031050,0.014150,0.189150,0.765650
0.030050,0.014200,0.189900,0.765850
0.030300,0.014550,0.189850,0.765300
0.029950,0.014850,0.190100,0.765100
0.030400,0.014800,0.190800,0.764000
0.031150,0.013900,0.191700,0.763250
0.031050,0.014500,0.191950,0.762500
0.031300,0.013500,0.193400,0.761800
0.031250,0.013950,0.193450,0.761350
0.031100,0.014850,0.193800,0.760250
0.031300,0.016250,0.192650,0.759800
0.031850,0.015100,0.193150,0.759900
0.032550,0.015250,0.192350,0.759850
0.032350,0.015250,0.192050,0.760350
0.032550,0.015950,0.191850,0.759650
0.032100,0.016750,0.191950,0.759200
0.033200,0.016250,0.191700,0.758850
0.032050,0.016350,0.191650,0.759950
0.032400,0.016650,0.192300,0.758650
0.031250,0.017100,0.191950,0.759700
0.030950,0.016350,0.193250,0.759450
0.031350,0.017000,0.193900,0.757750
0.031850,0.017150,0.193650,0.757350
0.033650,0.015250,0.193550,0.757550
0.033850,0.015750,0.193950,0.756450
0.033250,0.016250,0.193800,0.756700
0.033000,0.017000,0.194800,0.755200
0.032450,0.018250,0.194350,0.754950
0.034050,0.017050,0.193900,0.755000
0.034600,0.016650,0.193550,0.755200
0.035200,0.015350,0.194300,0.755150
0.034800,0.016450,0.192950,0.755800
0.033800,0.018250,0.192200,0.755750
0.033750,0.017550,0.193050,0.755650
0.033250,0.017000,0.193700,0.756050
0.035050,0.016400,0.194400,0.754150
0.034950,0.016150,0.194450,0.754450
0.034900,0.016950,0.193600,0.754550
0.036050,0.017200,0.193400,0.753350
0.037300,0.017250,0.192550,0.752900
0.036650,0.018400,0.191850,0.753100
0.036700,0.018800,0.192350,0.752150
0.036400,0.018750,0.192600,0.752250
0.037150,0.018450,0.191100,0.753300
0.038000,0.017850,0.191850,0.752300
0.036550,0.018400,0.192200,0.752850
0.035800,0.019800,0.192300,0.752100
0.035850,0.020000,0.191600,0.752550
0.037200,0.019700,0.190800,0.752300
0.037350,0.019250,0.189700,0.753700
0.037850,0.019200,0.188400,0.754550
0.036600,0.019900,0.188000,0.755500
0.038300,0.018600,0.188500,0.754600
0.039300,0.018300,0.188550,0.753850
0.039850,0.018750,0.187000,0.754400
0.039500,0.018950,0.186850,0.754700
0.040100,0.019800,0.185800,0.754300
0.040950,0.018800,0.184700,0.755550
0.041350,0.019150,0.184450,0.755050
0.040800,0.019350,0.184000,0.755850
0.040150,0.019750,0.183150,0.756950
0.039700,0.021250,0.179900,0.759150
0.039500,0.020350,0.179850,0.760300
0.039900,0.019450,0.180900,0.759750
0.039500,0.019750,0.180200,0.760550
0.040200,0.018550,0.180750,0.760500
0.038500,0.018650,0.180000,0.762850
0.038250,0.017750,0.180800,0.763200
0.037950,0.017750,0.180700,0.763600
0.038500,0.018250,0.179900,0.763350
0.038900,0.018800,0.179000,0.763300
0.038500,0.017550,0.180150,0.763800
0.038900,0.017950,0.180000,0.763150
0.038600,0.016400,0.181500,0.763500
0.038000,0.016550,0.182450,0.763000
0.038150,0.016500,0.182550,0.762800
0.038000,0.016850,0.183300,0.761850
0.038200,0.017550,0.182750,0.761500
0.036600,0.019050,0.181900,0.762450
0.035850,0.019200,0.182600,0.762350
0.036900,0.018500,0.182500,0.762100
0.037300,0.019650,0.181600,0.761450
0.037750,0.019450,0.181800,0.761000
0.037750,0.018950,0.181650,0.761650
0.038350,0.018600,0.181050,0.762000
0.038650,0.019450,0.179150,0.762750
0.038300,0.018700,0.178550,0.764450
0.037750,0.018750,0.178700,0.764800
0.037750,0.017750,0.179100,0.765400
0.038300,0.018100,0.178650,0.764950
0.037350,0.019050,0.177200,0.766400
0.037350,0.018550,0.177650,0.766450
0.038650,0.018200,0.176550,0.766600
0.038000,0.018300,0.176600,0.767100
0.037750,0.017750,0.176800,0.767700
0.039200,0.017600,0.175700,0.767500
0.040000,0.018000,0.175100,0.766900
0.040100,0.018850,0.174350,0.766700
0.039800,0.018000,0.173850,0.768350
0.040100,0.018450,0.173500,0.767950
0.037850,0.018250,0.174450,0.769450
0.037200,0.018500,0.173700,0.770600
0.037800,0.018650,0.174150,0.769400
0.037600,0.019650,0.174100,0.768650
0.037750,0.018800,0.174950,0.768500
0.037000,0.018750,0.174850,0.769400
0.036650,0.018650,0.174750,0.769950
0.036400,0.018750,0.174950,0.769900
0.036750,0.019350,0.174250,0.769650
0.037100,0.018850,0.174200,0.769850
0.038750,0.017150,0.175400,0.768700
0.038050,0.018000,0.174750,0.769200
0.037650,0.017400,0.175200,0.769750
0.037750,0.016850,0.175550,0.769850
0.038200,0.015800,0.176200,0.769800
0.036900,0.015250,0.177250,0.770600
0.036350,0.015650,0.177000,0.771000
0.035800,0.015150,0.177850,0.771200
0.036750,0.015500,0.178650,0.769100
0.035900,0.015900,0.178350,0.769850
0.036600,0.015950,0.178300,0.769150
0.035100,0.016700,0.178500,0.769700
0.034650,0.016600,0.179500,0.769250
0.035900,0.015850,0.180350,0.767900
0.036250,0.016350,0.179600,0.767800
0.036600,0.015900,0.179800,0.767700
0.036500,0.017400,0.178300,0.767800
0.036350,0.017450,0.178700,0.767500
0.036350,0.018050,0.178500,0.767100
0.037050,0.017050,0.179000,0.766900
0.036500,0.017400,0.178550,0.767550
0.036450,0.017350,0.179650,0.766550
0.035550,0.018350,0.178950,0.767150
0.036450,0.017650,0.179400,0.766500
0.036650,0.017750,0.179700,0.765900
0.035500,0.017900,0.180050,0.766550
0.034350,0.017150,0.180850,0.767650
0.034850,0.017250,0.180950,0.766950
0.034000,0.016900,0.181250,0.767850
0.035050,0.015950,0.182000,0.767000
0.035650,0.016350,0.181450,0.766550
0.034550,0.017400,0.181350,0.766700
0.035450,0.017650,0.180750,0.766150
0.036850,0.016300,0.181200,0.765650
0.037150,0.016700,0.180550,0.765600
0.036850,0.018250,0.179200,0.765700
0.035950,0.018650,0.178850,0.766550
0.035600,0.017800,0.178750,0.767850
0.036750,0.017800,0.177800,0.767650
0.036800,0.018150,0.176950,0.768100
0.037600,0.017500,0.176350,0.768550
0.035900,0.018850,0.176450,0.768800
0.035650,0.017950,0.176350,0.770050
0.034750,0.017000,0.178200,0.770050
0.035300,0.016750,0.178200,0.769750
0.034400,0.016850,0.178700,0.770050
0.034600,0.016550,0.178350,0.770500
0.034600,0.016200,0.178650,0.770550
0.034600,0.015750,0.178600,0.771050
0.034100,0.015100,0.179400,0.771400
0.033900,0.015750,0.179250,0.771100
0.033650,0.015900,0.180150,0.770300
0.033250,0.017050,0.179350,0.770350
0.034000,0.016200,0.179700,0.770100
0.033850,0.016500,0.179850,0.769800
0.033800,0.017050,0.180300,0.768850
0.034450,0.016250,0.180650,0.768650
0.033800,0.015850,0.182050,0.768300
0.033850,0.015550,0.181900,0.768700
0.033350,0.015950,0.182700,0.768000
0.033650,0.014800,0.182900,0.768650
0.033850,0.015050,0.183500,0.767600
0.033600,0.015900,0.183250,0.767250
0.033650,0.015500,0.183750,0.767100
0.033500,0.015100,0.184600,0.766800
0.033800,0.014350,0.184250,0.767600
0.033850,0.015200,0.184650,0.766300
0.034300,0.016100,0.183550,0.766050
0.034300,0.016200,0.184000,0.765500
0.033550,0.016150,0.185050,0.765250
0.033850,0.015650,0.186150,0.764350
0.034200,0.015950,0.185650,0.764200
0.034300,0.016100,0.185250,0.764350
0.033200,0.015650,0.185700,0.765450
0.033850,0.015250,0.186750,0.764150
0.033200,0.015850,0.186950,0.764000
0.033500,0.015700,0.187550,0.763250
0.033050,0.015550,0.188050,0.763350
0.033650,0.015550,0.187400,0.763400
0.033900,0.017300,0.186400,0.762400
0.034100,0.018300,0.185150,0.762450
0.035100,0.016900,0.185450,0.762550
