I,E,S,R
0.001000,0.000700,0.998300,0.000000
0.001100,0.001550,0.997250,0.000100
0.001200,0.002400,0.996150,0.000250
0.001950,0.002650,0.994950,0.000450
0.002450,0.003400,0.993550,0.000600
0.003250,0.005250,0.990750,0.000750
0.004400,0.006400,0.987900,0.001300
0.005400,0.008600,0.984200,0.001800
0.006900,0.010400,0.980100,0.002600
0.008900,0.013700,0.973950,0.003450
0.011900,0.017850,0.966050,0.004200
0.015500,0.022900,0.955550,0.006050
0.020450,0.029050,0.942500,0.008000
0.026500,0.039200,0.923750,0.010550
0.033150,0.049500,0.902550,0.014800
0.041650,0.063150,0.875950,0.019250
0.052900,0.080700,0.841700,0.024700
0.069150,0.096950,0.802550,0.031350
0.086300,0.120650,0.751850,0.041200
0.110000,0.142850,0.695350,0.051800
0.135400,0.165900,0.631950,0.066750
0.165750,0.192000,0.559550,0.082700
0.197250,0.212400,0.485600,0.104750
0.231400,0.226150,0.411900,0.130550
0.262900,0.235100,0.341250,0.160750
0.293200,0.235000,0.274400,0.197400
0.324300,0.223600,0.218150,0.233950
0.346250,0.213500,0.166800,0.273450
0.361050,0.193000,0.126900,0.319050
0.365750,0.174050,0.094550,0.365650
0.367100,0.148250,0.071550,0.413100
0.360850,0.122850,0.056100,0.460200
0.344900,0.099750,0.045600,0.509750
0.327750,0.081800,0.036850,0.553600
0.306050,0.067000,0.031250,0.595700
0.284450,0.053900,0.026350,0.635300
0.262550,0.044800,0.023250,0.669400
0.237550,0.036800,0.021350,0.704300
0.216200,0.029600,0.019300,0.734900
0.195800,0.023350,0.019300,0.761550
0.174200,0.018650,0.018900,0.788250
0.157300,0.014450,0.019550,0.808700
0.140550,0.012750,0.020700,0.826000
0.125650,0.010450,0.021000,0.842900
0.113100,0.009050,0.022000,0.855850
0.100800,0.007950,0.022950,0.868300
0.090050,0.006650,0.024600,0.878700
0.080000,0.006000,0.027150,0.886850
0.071350,0.005400,0.029350,0.893900
0.062300,0.004900,0.031650,0.901150
0.055150,0.005300,0.033750,0.905800
0.048700,0.004800,0.035900,0.910600
0.044350,0.004350,0.038200,0.913100
0.039800,0.004550,0.040100,0.915550
0.034650,0.004850,0.042100,0.918400
0.031050,0.004350,0.044250,0.920350
0.028000,0.004500,0.046700,0.920800
0.026750,0.003650,0.049200,0.920400
0.023800,0.003300,0.052000,0.920900
0.020400,0.003350,0.054600,0.921650
0.018350,0.002950,0.057250,0.921450
0.016450,0.002850,0.060300,0.920400
0.014850,0.002250,0.062800,0.920100
0.013600,0.002400,0.064800,0.919200
0.012200,0.002150,0.067550,0.918100
0.010900,0.001700,0.069600,0.917800
0.009550,0.001350,0.072850,0.916250
0.008550,0.001350,0.075550,0.914550
0.007500,0.001600,0.077900,0.913000
0.007000,0.001650,0.079350,0.912000
0.006150,0.001400,0.082850,0.909600
0.005450,0.001250,0.086250,0.907050
0.005050,0.001250,0.088200,0.905500
0.004700,0.001000,0.091200,0.903100
0.004350,0.001050,0.094100,0.900500
0.004050,0.000950,0.097300,0.897700
0.003550,0.001100,0.099650,0.895700
0.003100,0.001300,0.102650,0.892950
0.003050,0.001000,0.105400,0.890550
0.002750,0.001000,0.107950,0.888300
0.002700,0.001050,0.109850,0.886400
0.002700,0.001000,0.112150,0.884150
0.002350,0.000900,0.115400,0.881350
0.002300,0.000850,0.117500,0.879350
0.002350,0.000500,0.120250,0.876900
0.002000,0.000450,0.122500,0.875050
0.002000,0.000450,0.125300,0.872250
0.001700,0.000750,0.127400,0.870150
0.001650,0.000750,0.130450,0.867150
0.001750,0.000800,0.133200,0.864250
0.001750,0.000650,0.135800,0.861800
0.001750,0.000500,0.138700,0.859050
0.001650,0.000400,0.141300,0.856650
0.001450,0.000650,0.143400,0.854500
0.001450,0.000550,0.146300,0.851700
0.001350,0.000600,0.148800,0.849250
0.001200,0.000500,0.151500,0.846800
0.001300,0.000350,0.154900,0.843450
0.001150,0.000600,0.156900,0.841350
0.001150,0.000650,0.159950,0.838250
0.001100,0.000500,0.162700,0.835700
0.000950,0.000550,0.165050,0.833450
0.000950,0.000600,0.167250,0.831200
0.000900,0.000700,0.170050,0.828350
0.000900,0.000600,0.172700,0.825800
0.000950,0.000500,0.174900,0.823650
0.001000,0.000650,0.177500,0.820850
0.001300,0.000600,0.179250,0.818850
0.001300,0.000650,0.182000,0.816050
0.001350,0.000650,0.184000,0.814000
0.001250,0.000600,0.185950,0.812200
0.001050,0.000700,0.188300,0.809950
0.000950,0.000750,0.190800,0.807500
0.001200,0.000650,0.192650,0.805500
0.001300,0.000600,0.194750,0.803350
0.001300,0.000550,0.197450,0.800700
0.001200,0.000850,0.199450,0.798500
0.001250,0.000950,0.201250,0.796550
0.001200,0.001000,0.202750,0.795050
0.001250,0.000900,0.205200,0.792650
0.001400,0.000850,0.207300,0.790450
0.001400,0.000900,0.209350,0.788350
0.001550,0.000650,0.211200,0.786600
0.001400,0.000700,0.213550,0.784350
0.001500,0.000650,0.215900,0.781950
0.001700,0.000800,0.217650,0.779850
0.001650,0.000900,0.220000,0.777450
0.001750,0.001050,0.222150,0.775050
0.001900,0.001200,0.224100,0.772800
0.001850,0.001200,0.226400,0.770550
0.001750,0.001250,0.228000,0.769000
0.002000,0.001000,0.230700,0.766300
0.002200,0.001150,0.232850,0.763800
0.002200,0.001300,0.234750,0.761750
0.001700,0.001450,0.236300,0.760550
0.001800,0.001350,0.238350,0.758500
0.002250,0.001400,0.240000,0.756350
0.002400,0.001300,0.241650,0.754650
0.002550,0.001350,0.242750,0.753350
0.002500,0.001450,0.244700,0.751350
0.002550,0.001750,0.246150,0.749550
0.002700,0.001700,0.247750,0.747850
0.002950,0.001750,0.249600,0.745700
0.003050,0.001800,0.251350,0.743800
0.003300,0.002150,0.252750,0.741800
0.003250,0.002150,0.254650,0.739950
0.003550,0.002700,0.255200,0.738550
0.003750,0.002500,0.257100,0.736650
0.004100,0.002500,0.258750,0.734650
0.003900,0.002650,0.260550,0.732900
0.003700,0.002650,0.262200,0.731450
0.004100,0.002500,0.264150,0.729250
0.004450,0.002500,0.265800,0.727250
0.004550,0.002650,0.267100,0.725700
0.004750,0.003050,0.267800,0.724400
0.005250,0.002850,0.269600,0.722300
0.005350,0.003150,0.270050,0.721450
0.005850,0.003150,0.271000,0.720000
0.005750,0.003350,0.271800,0.719100
0.005900,0.003650,0.272550,0.717900
0.006450,0.003650,0.273500,0.716400
0.006700,0.003600,0.274500,0.715200
0.006950,0.004000,0.275300,0.713750
0.007100,0.004000,0.276100,0.712800
0.007300,0.004050,0.277100,0.711550
0.007150,0.005000,0.277500,0.710350
0.007800,0.004550,0.278400,0.709250
0.007450,0.005200,0.278800,0.708550
0.008000,0.005550,0.278750,0.707700
0.008500,0.005750,0.279800,0.705950
0.008850,0.006500,0.279750,0.704900
0.009650,0.006800,0.279400,0.704150
0.009700,0.007850,0.278800,0.703650
0.010450,0.007750,0.279500,0.702300
0.010850,0.008200,0.278900,0.702050
0.011350,0.008350,0.278900,0.701400
0.012900,0.007800,0.279450,0.699850
0.013450,0.009250,0.277600,0.699700
0.013800,0.009500,0.277200,0.699500
0.014400,0.010100,0.276800,0.698700
0.015650,0.010200,0.276100,0.698050
0.016250,0.010250,0.275850,0.697650
0.016200,0.010950,0.275250,0.697600
0.017450,0.012100,0.272600,0.697850
0.018200,0.012600,0.271750,0.697450
0.019500,0.012450,0.270750,0.697300
0.019350,0.013600,0.269200,0.697850
0.021550,0.013500,0.267400,0.697550
0.022450,0.013750,0.265300,0.698500
0.022950,0.014350,0.263550,0.699150
0.024600,0.014800,0.261050,0.699550
0.025000,0.016150,0.258200,0.700650
0.025650,0.017550,0.254650,0.702150
0.026400,0.018200,0.251600,0.703800
0.027650,0.019250,0.248650,0.704450
0.027450,0.019300,0.246550,0.706700
0.027800,0.019400,0.243800,0.709000
0.029750,0.019300,0.240550,0.710400
0.030050,0.018850,0.237800,0.713300
0.032600,0.017100,0.235950,0.714350
0.033500,0.018350,0.232900,0.715250
0.033300,0.020600,0.229350,0.716750
0.035350,0.019700,0.226800,0.718150
0.036600,0.020000,0.223550,0.719850
0.036900,0.021050,0.220200,0.721850
0.037650,0.020700,0.217100,0.724550
0.037150,0.021350,0.213300,0.728200
0.037950,0.021550,0.210950,0.729550
0.038850,0.021450,0.207400,0.732300
0.039250,0.022600,0.203200,0.734950
0.039700,0.023300,0.198750,0.738250
0.040650,0.023300,0.195850,0.740200
0.041700,0.023350,0.192300,0.742650
0.043350,0.022750,0.188750,0.745150
0.043400,0.024300,0.184550,0.747750
0.045350,0.023000,0.180900,0.750750
0.045400,0.022700,0.178800,0.753100
0.045350,0.021250,0.176400,0.757000
0.045150,0.020900,0.173400,0.760550
0.044200,0.022100,0.170800,0.762900
0.043550,0.021450,0.168850,0.766150
0.044300,0.020100,0.166900,0.768700
0.042800,0.020200,0.164950,0.772050
0.041900,0.019450,0.163550,0.775100
0.042150,0.018900,0.161550,0.777400
0.042000,0.018700,0.158950,0.780350
0.040900,0.018000,0.158850,0.782250
0.040300,0.018300,0.157050,0.784350
0.040200,0.018150,0.155250,0.786400
0.040200,0.017600,0.154500,0.787700
0.039500,0.017300,0.153650,0.789550
0.038900,0.018050,0.151650,0.791400
0.037650,0.018550,0.149600,0.794200
0.036950,0.018400,0.148700,0.795950
0.037900,0.015750,0.149450,0.796900
0.038300,0.015400,0.149200,0.797100
0.038450,0.014800,0.148400,0.798350
0.036700,0.014350,0.148500,0.800450
0.036050,0.014300,0.147400,0.802250
0.035350,0.014350,0.147450,0.802850
0.035650,0.013700,0.146800,0.803850
0.034400,0.013250,0.146550,0.805800
0.033600,0.013050,0.146500,0.806850
0.031650,0.014600,0.145800,0.807950
0.031050,0.013900,0.146650,0.808400
0.030050,0.012950,0.147900,0.809100
0.030550,0.011800,0.149650,0.808000
0.029650,0.012000,0.150250,0.808100
0.029150,0.012000,0.151350,0.807500
0.027250,0.013050,0.152250,0.807450
0.027800,0.011350,0.153250,0.807600
0.027400,0.011600,0.154200,0.806800
0.027350,0.010650,0.154650,0.807350
0.027050,0.010700,0.155300,0.806950
0.027200,0.010150,0.156450,0.806200
0.026750,0.010400,0.157800,0.805050
0.026500,0.010900,0.158650,0.803950
0.025200,0.010550,0.159750,0.804500
0.025600,0.009650,0.160950,0.803800
0.025000,0.009600,0.162000,0.803400
0.024100,0.009600,0.163500,0.802800
0.023050,0.009800,0.164700,0.802450
0.023000,0.009700,0.166000,0.801300
0.023050,0.009600,0.167950,0.799400
0.022650,0.009150,0.169350,0.798850
0.021700,0.009500,0.171800,0.797000
0.021300,0.010000,0.173400,0.795300
0.020800,0.010450,0.174700,0.794050
0.021050,0.009750,0.177000,0.792200
0.021400,0.010000,0.178550,0.790050
0.022000,0.009650,0.180050,0.788300
0.020650,0.011000,0.181000,0.787350
0.021650,0.011300,0.181500,0.785550
0.021800,0.011500,0.182350,0.784350
0.022400,0.010850,0.183650,0.783100
0.023250,0.010650,0.185600,0.780500
0.023600,0.010050,0.187650,0.778700
0.023250,0.010600,0.188950,0.777200
0.022800,0.011500,0.189150,0.776550
0.022650,0.011400,0.189750,0.776200
0.022400,0.011450,0.190950,0.775200
0.022550,0.012100,0.191850,0.773500
0.021200,0.012700,0.193200,0.772900
0.021450,0.011950,0.194500,0.772100
0.021900,0.011750,0.195550,0.770800
0.022850,0.012000,0.196750,0.768400
0.022950,0.011900,0.198100,0.767050
0.022450,0.012050,0.198550,0.766950
0.023100,0.012350,0.199600,0.764950
0.024300,0.011900,0.200000,0.763800
0.023800,0.012200,0.200600,0.763400
0.025050,0.012850,0.200450,0.761650
0.024750,0.014150,0.200900,0.760200
0.025250,0.013200,0.202100,0.759450
0.024200,0.013350,0.202850,0.759600
0.025000,0.012650,0.203750,0.758600
0.025000,0.012350,0.204800,0.757850
0.024600,0.013100,0.204850,0.757450
0.024850,0.013250,0.205200,0.756700
0.025100,0.013350,0.206450,0.755100
0.025500,0.014400,0.205750,0.754350
0.025800,0.014950,0.206600,0.752650
0.026300,0.016350,0.205500,0.751850
0.027200,0.015850,0.205250,0.751700
0.028650,0.015750,0.205350,0.750250
0.029250,0.014450,0.207050,0.749250
0.029650,0.015050,0.205500,0.749800
0.029450,0.015850,0.205450,0.749250
0.030500,0.016300,0.204050,0.749150
0.032200,0.016050,0.203300,0.748450
0.031400,0.017000,0.202600,0.749000
0.032450,0.016150,0.203050,0.748350
0.033150,0.016250,0.202500,0.748100
0.034000,0.015750,0.202600,0.747650
0.033400,0.016450,0.201650,0.748500
0.033850,0.016250,0.201650,0.748250
0.034100,0.015400,0.202500,0.748000
0.035700,0.015350,0.202850,0.746100
0.034600,0.017050,0.201000,0.747350
0.033850,0.017850,0.200400,0.747900
0.033900,0.018850,0.200300,0.746950
0.034050,0.019200,0.199200,0.747550
0.035150,0.018000,0.197950,0.748900
0.034650,0.018050,0.197200,0.750100
0.034550,0.018400,0.195750,0.751300
0.035800,0.018100,0.196100,0.750000
0.036600,0.019300,0.193950,0.750150
0.037350,0.019650,0.193650,0.749350
0.038000,0.019550,0.193300,0.749150
0.038500,0.019100,0.192300,0.750100
0.038550,0.020250,0.191000,0.750200
0.038150,0.021750,0.188650,0.751450
0.039550,0.021000,0.188700,0.750750
0.040500,0.020400,0.187150,0.751950
0.040400,0.020100,0.185300,0.754200
0.040350,0.019650,0.185700,0.754300
0.040350,0.019450,0.185200,0.755000
0.039800,0.020150,0.183750,0.756300
0.039600,0.021550,0.182600,0.756250
0.038950,0.020650,0.182400,0.758000
0.039650,0.019950,0.182200,0.758200
0.039500,0.019900,0.180800,0.759800
0.040000,0.020550,0.179200,0.760250
0.041350,0.019400,0.179250,0.760000
0.042000,0.019500,0.177500,0.761000
0.041200,0.019750,0.175800,0.763250
0.041750,0.018950,0.175400,0.763900
0.041750,0.019200,0.175100,0.763950
0.040550,0.019450,0.174800,0.765200
0.040050,0.019350,0.174700,0.765900
0.039700,0.018700,0.174050,0.767550
0.038550,0.019200,0.173250,0.769000
0.038850,0.018700,0.172700,0.769750
0.039750,0.018800,0.171150,0.770300
0.039150,0.018350,0.171300,0.771200
0.037400,0.019400,0.171400,0.771800
0.037050,0.018200,0.172850,0.771900
0.037000,0.018300,0.172000,0.772700
0.037500,0.017500,0.172350,0.772650
0.038150,0.017200,0.171700,0.772950
0.037600,0.016550,0.172500,0.773350
0.037400,0.017200,0.172000,0.773400
0.037450,0.017050,0.172000,0.773500
0.037650,0.017650,0.172200,0.772500
0.038300,0.017600,0.171750,0.772350
0.036650,0.017600,0.171850,0.773900
0.035500,0.018700,0.171650,0.774150
0.036800,0.017700,0.172500,0.773000
0.037350,0.016900,0.172200,0.773550
0.037000,0.018250,0.169900,0.774850
0.037800,0.018400,0.169750,0.774050
0.038000,0.018400,0.168700,0.774900
0.037950,0.018250,0.169650,0.774150
0.037000,0.019050,0.170400,0.773550
0.037100,0.018250,0.170600,0.774050
0.036900,0.018300,0.169700,0.775100
0.036950,0.018550,0.170400,0.774100
0.037100,0.017750,0.171050,0.774100
0.037650,0.018250,0.170450,0.773650
0.038250,0.017650,0.170300,0.773800
0.036900,0.017850,0.170850,0.774400
0.037600,0.017100,0.171850,0.773450
0.037000,0.016650,0.172050,0.774300
0.036300,0.016450,0.172050,0.775200
0.036700,0.016200,0.171750,0.775350
0.035350,0.017050,0.172400,0.775200
0.035000,0.016450,0.173300,0.775250
0.034050,0.016150,0.174000,0.775800
0.033500,0.016100,0.176150,0.774250
0.034150,0.015650,0.176700,0.773500
0.034550,0.015600,0.176750,0.773100
0.034300,0.016450,0.177950,0.771300
0.034000,0.017950,0.176850,0.771200
0.033900,0.017400,0.177300,0.771400
0.033850,0.016900,0.178750,0.770500
0.033650,0.017550,0.179450,0.769350
0.035500,0.016550,0.180000,0.767950
0.035800,0.016300,0.180200,0.767700
0.035550,0.016600,0.180050,0.767800
0.035500,0.016050,0.180750,0.767700
0.034750,0.016450,0.181900,0.766900
0.033700,0.016400,0.182450,0.767450
0.034700,0.016550,0.181900,0.766850
0.034200,0.017500,0.180850,0.767450
0.033550,0.017050,0.180750,0.768650
0.034050,0.017750,0.180800,0.767400
0.034300,0.017650,0.180400,0.767650
0.035200,0.017200,0.180250,0.767350
0.035200,0.016700,0.180650,0.767450
0.034850,0.017400,0.180550,0.767200
0.033700,0.017700,0.180400,0.768200
0.034800,0.017200,0.180500,0.767500
0.035200,0.018150,0.179750,0.766900
0.035500,0.018050,0.179000,0.767450
0.035300,0.017650,0.179450,0.767600
0.035600,0.017650,0.180600,0.766150
0.035200,0.018650,0.179000,0.767150
0.034800,0.018600,0.179100,0.767500
0.036000,0.017000,0.179400,0.767600
0.036350,0.016900,0.178500,0.768250
0.035550,0.016850,0.178600,0.769000
0.034500,0.018050,0.177100,0.770350
0.033600,0.018500,0.176500,0.771400
0.033500,0.017250,0.178150,0.771100
0.033150,0.016200,0.179550,0.771100
0.033550,0.015800,0.180200,0.770450
0.034450,0.015400,0.180150,0.770000
0.034300,0.015150,0.180650,0.769900
0.035050,0.014650,0.180450,0.769850
0.034800,0.015100,0.180550,0.769550
0.034150,0.015600,0.181550,0.768700
0.035000,0.015600,0.182100,0.767300
0.034400,0.015950,0.182900,0.766750
0.033750,0.016200,0.182700,0.767350
0.034150,0.016300,0.182750,0.766800
0.034950,0.015650,0.183250,0.766150
0.033500,0.015950,0.183350,0.767200
0.034100,0.016300,0.183350,0.766250
0.032850,0.017450,0.182200,0.767500
0.033000,0.017550,0.182350,0.767100
0.033950,0.017050,0.183550,0.765450
0.033200,0.017250,0.183550,0.766000
0.034250,0.017000,0.183550,0.765200
0.034600,0.016550,0.182650,0.766200
0.034350,0.016450,0.182900,0.766300
0.033900,0.016050,0.183400,0.766650
0.033500,0.016750,0.183450,0.766300
0.033350,0.015550,0.184300,0.766800
0.034150,0.016800,0.183400,0.765650
0.033100,0.016750,0.184600,0.765550
0.032100,0.017650,0.184050,0.766200
0.031150,0.018300,0.183800,0.766750
0.031450,0.018350,0.183900,0.766300
0.032050,0.017050,0.185050,0.765850
0.031400,0.016900,0.185600,0.766100
0.031700,0.015750,0.186250,0.766300
0.032250,0.016200,0.185850,0.765700
0.032350,0.015500,0.186250,0.765900
0.031850,0.015500,0.187000,0.765650
0.032500,0.015450,0.187050,0.765000
0.031950,0.016550,0.185850,0.765650
0.031900,0.016750,0.186050,0.765300
0.033450,0.015750,0.185650,0.765150
0.033100,0.015250,0.187000,0.764650
0.033050,0.015850,0.187000,0.764100
0.033450,0.016200,0.185950,0.764400
0.032700,0.016950,0.184850,0.765500
0.033400,0.016400,0.185150,0.765050
0.032500,0.017100,0.184700,0.765700
0.033700,0.016850,0.183850,0.765600
0.032350,0.016750,0.184500,0.766400
0.032700,0.016600,0.184900,0.765800
0.032900,0.016750,0.184850,0.765500
0.033300,0.016850,0.184400,0.765450
0.032950,0.017050,0.184600,0.765400
0.032600,0.017900,0.183900,0.765600
0.034000,0.016200,0.185300,0.764500
0.033350,0.016000,0.185650,0.765000
0.033250,0.017000,0.185750,0.764000
0.033400,0.017950,0.184250,0.764400
0.033600,0.018450,0.183400,0.764550
0.033500,0.017100,0.183750,0.765650
0.034400,0.016300,0.183750,0.765550
0.032650,0.017050,0.184600,0.765700
0.032900,0.017200,0.184250,0.765650
0.032900,0.016900,0.184450,0.765750
0.033300,0.017050,0.184450,0.765200
0.033750,0.016950,0.184450,0.764850
0.033150,0.016700,0.184350,0.765800
0.033400,0.016250,0.185400,0.764950
0.033400,0.016550,0.185350,0.764700
0.032750,0.016800,0.185800,0.764650
0.033300,0.015700,0.187200,0.763800
0.032350,0.015450,0.187800,0.764400
0.032150,0.015400,0.188400,0.764050
0.033200,0.015050,0.188600,0.763150
0.033250,0.015050,0.188350,0.763350
0.032650,0.015250,0.188750,0.763350
0.033000,0.016100,0.188750,0.762150
0.033200,0.015750,0.189500,0.761550
0.033000,0.015450,0.189500,0.762050
0.032750,0.016250,0.188350,0.762650
0.033300,0.017100,0.187700,0.761900
0.033200,0.017400,0.186950,0.762450
0.033350,0.018300,0.186450,0.761900
0.034250,0.017850,0.186150,0.761750
0.034350,0.018550,0.185300,0.761800
0.034650,0.017700,0.185250,0.762400
0.035950,0.017600,0.184800,0.761650
0.035550,0.017750,0.184700,0.762000
0.035000,0.018200,0.184400,0.762400
0.036150,0.017550,0.184000,0.762300
0.035800,0.018400,0.183600,0.762200
0.036050,0.018250,0.183050,0.762650
0.035450,0.018050,0.182750,0.763750
0.036250,0.017200,0.183000,0.763550
0.036300,0.017550,0.182500,0.763650
0.034850,0.018350,0.182000,0.764800
0.035150,0.018450,0.182800,0.763600
0.034600,0.018150,0.182600,0.764650
0.034950,0.018200,0.182050,0.764800
0.035000,0.018750,0.181750,0.764500
0.034800,0.018650,0.181500,0.765050
0.035750,0.018700,0.180450,0.765100
0.036200,0.018600,0.180300,0.764900
0.036300,0.018300,0.180400,0.765000
0.036550,0.017950,0.179800,0.765700
0.036200,0.017900,0.179750,0.766150
0.035750,0.018400,0.180900,0.764950
0.037000,0.018000,0.180450,0.764550
0.036400,0.017800,0.180450,0.765350
0.036150,0.019050,0.180100,0.764700
0.036800,0.018450,0.179200,0.765550
0.036600,0.018750,0.178150,0.766500
0.036450,0.018550,0.178750,0.766250
0.035950,0.018300,0.178450,0.767300
0.036100,0.018800,0.177750,0.767350
0.036050,0.017400,0.179400,0.767150
0.034800,0.017100,0.179300,0.768800
0.034650,0.017450,0.179300,0.768600
0.034900,0.016400,0.180500,0.768200
0.035000,0.015850,0.180600,0.768550
0.033850,0.017250,0.179600,0.769300
0.034150,0.017900,0.178750,0.769200
0.034500,0.017700,0.178650,0.769150
0.034300,0.017450,0.179550,0.768700
0.035750,0.016650,0.179450,0.768150
0.035000,0.016800,0.179800,0.768400
0.035350,0.017200,0.178850,0.768600
0.035500,0.017350,0.179100,0.768050
0.035150,0.017750,0.178800,0.768300
0.034450,0.017950,0.179200,0.768400
0.035150,0.017000,0.180800,0.767050
0.033950,0.016950,0.181900,0.767200
0.034600,0.017750,0.181000,0.766650
0.034750,0.017950,0.180550,0.766750
0.035150,0.017000,0.181100,0.766750
0.035050,0.016700,0.181700,0.766550
0.035600,0.016750,0.181950,0.765700
0.034950,0.017400,0.181700,0.765950
0.035250,0.018150,0.181800,0.764800
0.036200,0.016550,0.182350,0.764900
0.036450,0.017000,0.182400,0.764150
0.035650,0.017200,0.181900,0.765250
0.036100,0.017150,0.181550,0.765200
0.035000,0.017350,0.181600,0.766050
0.034050,0.017250,0.182050,0.766650
0.034450,0.017250,0.183250,0.765050
0.035150,0.018150,0.182150,0.764550
0.035100,0.017300,0.183450,0.764150
0.034950,0.017450,0.182650,0.764950
0.034500,0.017700,0.182500,0.765300
0.034150,0.017200,0.183350,0.765300
0.034700,0.017200,0.183850,0.764250
0.034850,0.017100,0.184350,0.763700
0.035350,0.017900,0.183100,0.763650
0.035700,0.017450,0.182950,0.763900
0.035100,0.017750,0.182750,0.764400
0.034750,0.018400,0.182850,0.764000
0.035650,0.017900,0.183750,0.762700
0.035650,0.017400,0.184100,0.762850
0.036050,0.017850,0.185350,0.760750
0.036400,0.017550,0.185400,0.760650
0.036150,0.017400,0.185500,0.760950
0.036450,0.016600,0.186050,0.760900
0.035200,0.016850,0.186050,0.761900
0.035550,0.016350,0.187550,0.760550
0.036250,0.017250,0.186750,0.759750
0.036050,0.016600,0.187650,0.759700
0.034850,0.017250,0.187650,0.760250
0.034300,0.018150,0.186350,0.761200
0.035300,0.018500,0.185750,0.760450
0.035100,0.019450,0.184850,0.760600
0.035150,0.018550,0.184750,0.761550
0.035700,0.018800,0.184500,0.761000
0.036300,0.019750,0.184150,0.759800
0.035000,0.020850,0.184400,0.759750
0.035350,0.019250,0.184500,0.760900
0.034750,0.019400,0.183550,0.762300
0.035200,0.017900,0.184900,0.762000
0.034700,0.018200,0.185500,0.761600
0.035100,0.016350,0.186100,0.762450
0.034600,0.017150,0.186150,0.762100
0.034900,0.017050,0.186400,0.761650
0.034000,0.018200,0.185800,0.762000
0.033900,0.017950,0.185900,0.762250
0.035550,0.018150,0.185850,0.760450
0.035600,0.018000,0.186550,0.759850
0.035700,0.017850,0.186900,0.759550
0.035500,0.017400,0.188200,0.758900
0.034850,0.018000,0.188300,0.758850
0.034600,0.018500,0.188150,0.758750
0.035450,0.018650,0.188250,0.757650
0.036250,0.018150,0.188400,0.757200
0.037600,0.018250,0.187500,0.756650
0.036750,0.018150,0.187500,0.757600
0.036250,0.018100,0.188650,0.757000
0.037700,0.018050,0.188500,0.755750
0.038250,0.018050,0.187950,0.755750
0.038450,0.017950,0.188000,0.755600
0.038000,0.018650,0.186500,0.756850
0.039000,0.018800,0.185150,0.757050
0.039100,0.019950,0.183550,0.757400
0.040250,0.020000,0.183200,0.756550
0.041600,0.019350,0.183400,0.755650
0.041900,0.019500,0.183350,0.755250
0.042100,0.018500,0.183200,0.756200
0.040500,0.020600,0.181300,0.757600
0.040200,0.020550,0.180250,0.759000
0.039500,0.020350,0.180200,0.759950
0.040500,0.019650,0.179300,0.760550
0.040550,0.020400,0.178500,0.760550
0.040650,0.020050,0.179050,0.760250
0.040800,0.019600,0.177900,0.761700
0.040050,0.020000,0.177050,0.762900
0.040550,0.019750,0.176250,0.763450
0.040450,0.020000,0.175150,0.764400
0.039500,0.019750,0.175600,0.765150
0.039950,0.019650,0.175400,0.765000
0.040300,0.018450,0.175250,0.766000
0.039650,0.018200,0.175800,0.766350
0.038600,0.020250,0.174050,0.767100
0.038350,0.020100,0.173600,0.767950
0.038800,0.019150,0.172850,0.769200
0.038700,0.018550,0.173500,0.769250
0.038350,0.018900,0.173050,0.769700
0.037000,0.020100,0.172400,0.770500
0.038700,0.018100,0.173300,0.769900
0.039350,0.018250,0.173000,0.769400
0.039250,0.017800,0.174000,0.768950
0.039500,0.017900,0.173250,0.769350
0.039350,0.017850,0.173350,0.769450
0.038450,0.017800,0.173300,0.770450
0.036900,0.016850,0.173750,0.772500
0.036550,0.016700,0.173750,0.773000
0.036400,0.017600,0.174000,0.772000
0.036350,0.018500,0.173850,0.771300
0.036350,0.018500,0.174450,0.770700
0.035200,0.019150,0.173850,0.771800
0.035100,0.019150,0.173350,0.772400
0.036200,0.017700,0.174100,0.772000
0.036550,0.017100,0.174050,0.772300
0.036200,0.017600,0.172800,0.773400
0.036350,0.018100,0.173350,0.772200
0.036800,0.018350,0.172600,0.772250
0.037100,0.017950,0.173300,0.771650
0.036550,0.018300,0.173050,0.772100
0.036000,0.019550,0.172450,0.772000
0.035400,0.018300,0.172750,0.773550
0.035200,0.017700,0.173300,0.773800
0.034700,0.018250,0.173050,0.774000
0.034650,0.017150,0.173800,0.774400
0.034650,0.017100,0.173950,0.774300
0.035400,0.016900,0.174700,0.773000
0.035650,0.017450,0.175200,0.771700
0.035650,0.017250,0.175750,0.771350
0.035450,0.017300,0.175450,0.771800
0.035900,0.016750,0.175650,0.771700
0.035750,0.016750,0.176000,0.771500
0.035700,0.016900,0.177400,0.770000
0.036350,0.017600,0.176950,0.769100
0.037400,0.017050,0.176550,0.769000
0.036900,0.017800,0.175200,0.770100
0.037950,0.016250,0.175900,0.769900
0.037150,0.016600,0.175150,0.771100
0.036100,0.015950,0.176550,0.771400
0.036150,0.015750,0.176950,0.771150
0.035400,0.016350,0.176000,0.772250
0.035450,0.017200,0.176300,0.771050
0.034600,0.017500,0.176650,0.771250
0.034600,0.016800,0.177100,0.771500
0.035800,0.016450,0.176700,0.771050
0.036050,0.017300,0.176650,0.770000
0.036100,0.017300,0.175300,0.771300
0.036350,0.016400,0.176250,0.771000
0.035300,0.017350,0.175950,0.771400
0.035400,0.016100,0.178200,0.770300
0.034000,0.017100,0.178000,0.770900
0.033950,0.017600,0.178300,0.770150
0.034650,0.017800,0.178850,0.768700
0.034550,0.016600,0.179500,0.769350
0.034850,0.016900,0.179550,0.768700
0.035350,0.017300,0.180150,0.767200
0.035900,0.017850,0.179450,0.766800
0.035500,0.018200,0.178950,0.767350
0.036200,0.017550,0.178800,0.767450
0.035500,0.018600,0.178400,0.767500
0.035350,0.019000,0.178750,0.766900
0.036500,0.018150,0.179300,0.766050
0.036000,0.017900,0.179300,0.766800
0.036150,0.018300,0.179800,0.765750
0.036050,0.018100,0.179000,0.766850
0.035650,0.017750,0.178700,0.767900
0.035650,0.017750,0.179600,0.767000
0.036250,0.017650,0.179300,0.766800
0.036000,0.017950,0.179200,0.766850
0.036200,0.018400,0.179700,0.765700
0.036500,0.018800,0.178450,0.766250
0.037850,0.019550,0.177650,0.764950
0.037550,0.018800,0.177750,0.765900
0.038100,0.018200,0.176550,0.767150
0.037400,0.018400,0.176100,0.768100
0.036800,0.018750,0.176600,0.767850
0.036800,0.017650,0.176650,0.768900
0.036450,0.016850,0.177200,0.769500
0.036250,0.017400,0.176600,0.769750
0.035350,0.017400,0.176700,0.770550
0.035200,0.017250,0.177300,0.770250
0.034900,0.016600,0.177800,0.770700
0.034300,0.017800,0.177750,0.770150
