time_results/time_results_java.txt:
real: 0.49139999999999995, user: 0.4754, sys: 0.2874666666666667

time_results/time_results_ruby.txt:
real: 11.439833333333333, user: 11.359800000000002, sys: 0.0772

time_results/time_results_python.txt:
real: 3542.007, user: 3489.533, sys: 51.986

time_results/time_results_cppO3.txt:
real: 2322.7236666666668, user: 2317.0653333333335, sys: 5.381333333333334

time_results/time_results_cO2.txt:
real: 262.8543333333334, user: 169.04166666666666, sys: 93.78066666666666

time_results/time_results_cpp.txt:
real: 2328.429, user: 2319.123, sys: 9.032

time_results/time_results_cO3.txt:
real: 262.5723333333333, user: 168.80666666666664, sys: 93.73

time_results/time_results_c.txt:
real: 265.54733333333337, user: 168.8853333333333, sys: 96.63833333333332

