I,E,S,R
0.001000,0.000650,0.998350,0.000000
0.001050,0.001600,0.997250,0.000100
0.001200,0.002350,0.996250,0.000200
0.001750,0.003200,0.994750,0.000300
0.002500,0.004150,0.992850,0.000500
0.003550,0.005800,0.989950,0.000700
0.004250,0.007500,0.986750,0.001500
0.005150,0.009350,0.983250,0.002250
0.007200,0.010900,0.979000,0.002900
0.009300,0.013750,0.973150,0.003800
0.011900,0.017250,0.965650,0.005200
0.015600,0.022500,0.955200,0.006700
0.020350,0.029700,0.941550,0.008400
0.025200,0.037300,0.926500,0.011000
0.031750,0.047650,0.905900,0.014700
0.040400,0.058550,0.881900,0.019150
0.050550,0.077800,0.846900,0.024750
0.064250,0.094750,0.809300,0.031700
0.080000,0.115200,0.763950,0.040850
0.103100,0.136100,0.710950,0.049850
0.130600,0.156400,0.650400,0.062600
0.156400,0.179300,0.583750,0.080550
0.186200,0.205500,0.506150,0.102150
0.221650,0.219300,0.432600,0.126450
0.255050,0.229050,0.362050,0.153850
0.287250,0.232950,0.293100,0.186700
0.318150,0.227150,0.232050,0.222650
0.343550,0.215600,0.177550,0.263300
0.363650,0.196400,0.133100,0.306850
0.368050,0.174500,0.101400,0.356050
0.368500,0.152100,0.075900,0.403500
0.362450,0.127650,0.058950,0.450950
0.351150,0.106000,0.045050,0.497800
0.332000,0.088250,0.035950,0.543800
0.313200,0.070700,0.030400,0.585700
0.291850,0.055800,0.026600,0.625750
0.267200,0.044850,0.023450,0.664500
0.245300,0.036200,0.021900,0.696600
0.223150,0.030650,0.019800,0.726400
0.202800,0.024100,0.019750,0.753350
0.182400,0.020450,0.019250,0.777900
0.162800,0.016700,0.019500,0.801000
0.145000,0.013050,0.020100,0.821850
0.129050,0.010750,0.020900,0.839300
0.113950,0.008200,0.022350,0.855500
0.100600,0.007400,0.023800,0.868200
0.089650,0.006700,0.025200,0.878450
0.078850,0.006200,0.027550,0.887400
0.069650,0.006200,0.028550,0.895600
0.060050,0.005750,0.030500,0.903700
0.052500,0.005050,0.033600,0.908850
0.046350,0.004750,0.035100,0.913800
0.041550,0.003950,0.037050,0.917450
0.037050,0.004000,0.038700,0.920250
0.033750,0.004000,0.041850,0.920400
0.030800,0.003600,0.043500,0.922100
0.027850,0.003600,0.046050,0.922500
0.025000,0.003150,0.048900,0.922950
0.022200,0.002800,0.052250,0.922750
0.020250,0.002400,0.054900,0.922450
0.018600,0.002750,0.057000,0.921650
0.016500,0.002750,0.059150,0.921600
0.014900,0.002850,0.060950,0.921300
0.013550,0.002550,0.063950,0.919950
0.012300,0.002450,0.066300,0.918950
0.011150,0.002300,0.069000,0.917550
0.010050,0.002050,0.072350,0.915550
0.009150,0.001900,0.075100,0.913850
0.008550,0.002000,0.078150,0.911300
0.008000,0.001600,0.080800,0.909600
0.007150,0.001500,0.083850,0.907500
0.007050,0.001500,0.086050,0.905400
0.006650,0.001350,0.089600,0.902400
0.006400,0.001450,0.092400,0.899750
0.005900,0.001700,0.094650,0.897750
0.005400,0.001900,0.096450,0.896250
0.005150,0.001650,0.099000,0.894200
0.005000,0.001600,0.101550,0.891850
0.004950,0.001500,0.104350,0.889200
0.004900,0.001250,0.107550,0.886300
0.004450,0.001300,0.110750,0.883500
0.004150,0.001400,0.113150,0.881300
0.004000,0.001300,0.115900,0.878800
0.003550,0.001300,0.118550,0.876600
0.003400,0.001150,0.121650,0.873800
0.003200,0.001150,0.123950,0.871700
0.002800,0.001100,0.126250,0.869850
0.002350,0.001150,0.129600,0.866900
0.002250,0.001100,0.131800,0.864850
0.002100,0.000900,0.134600,0.862400
0.002050,0.000750,0.137200,0.860000
0.002000,0.000950,0.139200,0.857850
0.001900,0.000700,0.141700,0.855700
0.001800,0.000750,0.144400,0.853050
0.001750,0.000700,0.147100,0.850450
0.001550,0.000850,0.149300,0.848300
0.001550,0.000750,0.151250,0.846450
0.001500,0.000600,0.153750,0.844150
0.001450,0.000600,0.156450,0.841500
0.001450,0.000550,0.159050,0.838950
0.001350,0.000600,0.161350,0.836700
0.001250,0.000650,0.163400,0.834700
0.001100,0.000500,0.165850,0.832550
0.001150,0.000750,0.168150,0.829950
0.001050,0.000600,0.170600,0.827750
0.000950,0.000600,0.172650,0.825800
0.001150,0.000600,0.175600,0.822650
0.001050,0.000550,0.177750,0.820650
0.001200,0.000600,0.180150,0.818050
0.001050,0.000600,0.182500,0.815850
0.001100,0.000600,0.184850,0.813450
0.001050,0.000600,0.187350,0.811000
0.000950,0.000550,0.189700,0.808800
0.001000,0.000700,0.191750,0.806550
0.001100,0.000750,0.194050,0.804100
0.001250,0.000750,0.196350,0.801650
0.001250,0.000800,0.198450,0.799500
0.001300,0.000850,0.200000,0.797850
0.001350,0.000800,0.202400,0.795450
0.001150,0.000650,0.204550,0.793650
0.001250,0.000550,0.206500,0.791700
0.001150,0.000650,0.208150,0.790050
0.001250,0.000500,0.210600,0.787650
0.001050,0.000500,0.212500,0.785950
0.001050,0.000500,0.214350,0.784100
0.001100,0.000500,0.216350,0.782050
0.000850,0.000800,0.218100,0.780250
0.001050,0.000700,0.220400,0.777850
0.001100,0.000650,0.222850,0.775400
0.001050,0.000850,0.225000,0.773100
0.001050,0.001000,0.227250,0.770700
0.001250,0.000750,0.228750,0.769250
0.001250,0.001000,0.230650,0.767100
0.001450,0.000950,0.233100,0.764500
0.001350,0.001050,0.234800,0.762800
0.001550,0.000900,0.236500,0.761050
0.001600,0.001000,0.237700,0.759700
0.001400,0.001050,0.239000,0.758550
0.001350,0.000850,0.240800,0.757000
0.001200,0.000850,0.242750,0.755200
0.001250,0.000750,0.245250,0.752750
0.001300,0.000850,0.246850,0.751000
0.001500,0.000700,0.249250,0.748550
0.001550,0.001000,0.250800,0.746650
0.001800,0.000950,0.252650,0.744600
0.001850,0.001200,0.254300,0.742650
0.002250,0.001500,0.255250,0.741000
0.002650,0.001500,0.256850,0.739000
0.002650,0.001550,0.258450,0.737350
0.002950,0.001400,0.260000,0.735650
0.002850,0.001600,0.261350,0.734200
0.002650,0.001950,0.263100,0.732300
0.002800,0.002100,0.264450,0.730650
0.002800,0.002450,0.265750,0.729000
0.003400,0.002150,0.267150,0.727300
0.003950,0.001900,0.268200,0.725950
0.003750,0.002450,0.270200,0.723600
0.003900,0.002950,0.271400,0.721750
0.004200,0.003450,0.272150,0.720200
0.004600,0.003150,0.273800,0.718450
0.005050,0.003300,0.274800,0.716850
0.005700,0.003300,0.275450,0.715550
0.005650,0.003300,0.276650,0.714400
0.006250,0.003300,0.277500,0.712950
0.006400,0.004300,0.277650,0.711650
0.006800,0.004700,0.277750,0.710750
0.007550,0.004850,0.278300,0.709300
0.007800,0.005000,0.278500,0.708700
0.007900,0.005750,0.278500,0.707850
0.008700,0.006400,0.278700,0.706200
0.009950,0.006250,0.278550,0.705250
0.010650,0.006200,0.278050,0.705100
0.011100,0.006600,0.278200,0.704100
0.011500,0.007150,0.277600,0.703750
0.011500,0.006700,0.277750,0.704050
0.012450,0.006700,0.277450,0.703400
0.012700,0.007650,0.277750,0.701900
0.012650,0.008350,0.276850,0.702150
0.013250,0.009300,0.275550,0.701900
0.014300,0.009000,0.274800,0.701900
0.015650,0.009550,0.273700,0.701100
0.017300,0.009750,0.272200,0.700750
0.018000,0.011000,0.270500,0.700500
0.018350,0.011750,0.269150,0.700750
0.019300,0.010800,0.268650,0.701250
0.020350,0.012500,0.265750,0.701400
0.021150,0.013900,0.263450,0.701500
0.022450,0.014550,0.260800,0.702200
0.023100,0.015250,0.258550,0.703100
0.024250,0.015550,0.256400,0.703800
0.025300,0.015800,0.253700,0.705200
0.026050,0.016750,0.251200,0.706000
0.027350,0.017550,0.247850,0.707250
0.028750,0.018450,0.243350,0.709450
0.029800,0.018550,0.241550,0.710100
0.031300,0.019150,0.237700,0.711850
0.033350,0.019300,0.234050,0.713300
0.033600,0.019900,0.229750,0.716750
0.034500,0.020200,0.226050,0.719250
0.035500,0.020950,0.221950,0.721600
0.037100,0.021200,0.218650,0.723050
0.038100,0.021050,0.214600,0.726250
0.038700,0.022150,0.211350,0.727800
0.039700,0.022900,0.207500,0.729900
0.040750,0.022950,0.203650,0.732650
0.042050,0.022150,0.200200,0.735600
0.043100,0.023000,0.195550,0.738350
0.043950,0.023350,0.191350,0.741350
0.045000,0.024100,0.187200,0.743700
0.044050,0.025700,0.182050,0.748200
0.046050,0.025250,0.177800,0.750900
0.046600,0.025000,0.174650,0.753750
0.046100,0.024450,0.170750,0.758700
0.047050,0.023400,0.167850,0.761700
0.047050,0.022550,0.165950,0.764450
0.046100,0.022800,0.162700,0.768400
0.045250,0.022850,0.160250,0.771650
0.046500,0.021050,0.159050,0.773400
0.045500,0.021300,0.156300,0.776900
0.045600,0.020400,0.154150,0.779850
0.045050,0.018800,0.152600,0.783550
0.044850,0.018500,0.150800,0.785850
0.044700,0.017650,0.149150,0.788500
0.043900,0.017350,0.147450,0.791300
0.044150,0.016350,0.145950,0.793550
0.043200,0.016750,0.144050,0.796000
0.042600,0.016450,0.142650,0.798300
0.042650,0.016250,0.141850,0.799250
0.041200,0.016400,0.141400,0.801000
0.040650,0.016900,0.139850,0.802600
0.039950,0.015950,0.139450,0.804650
0.039200,0.015650,0.139500,0.805650
0.039150,0.015100,0.139350,0.806400
0.037700,0.015700,0.139100,0.807500
0.038050,0.014750,0.138200,0.809000
0.037350,0.014300,0.138300,0.810050
0.035450,0.014550,0.138700,0.811300
0.035200,0.014600,0.138550,0.811650
0.033950,0.014550,0.138550,0.812950
0.033350,0.013150,0.139600,0.813900
0.032400,0.012350,0.140550,0.814700
0.031400,0.011900,0.141950,0.814750
0.029700,0.011800,0.142250,0.816250
0.029800,0.011300,0.143050,0.815850
0.027750,0.011500,0.144000,0.816750
0.027850,0.011000,0.145300,0.815850
0.027350,0.010400,0.146550,0.815700
0.027550,0.010500,0.147700,0.814250
0.026850,0.010250,0.149350,0.813550
0.025950,0.010650,0.150250,0.813150
0.024700,0.011150,0.152100,0.812050
0.024550,0.010750,0.153650,0.811050
0.024450,0.010150,0.155300,0.810100
0.023550,0.009700,0.157650,0.809100
0.022850,0.009600,0.159200,0.808350
0.021600,0.009250,0.160600,0.808550
0.021750,0.008300,0.163200,0.806750
0.021200,0.008500,0.163850,0.806450
0.021350,0.007950,0.165850,0.804850
0.020200,0.009200,0.166850,0.803750
0.019750,0.009200,0.168350,0.802700
0.020500,0.008450,0.170650,0.800400
0.019900,0.009200,0.171700,0.799200
0.020400,0.009400,0.173300,0.796900
0.020800,0.008400,0.174900,0.795900
0.020400,0.008850,0.177350,0.793400
0.020700,0.010100,0.178350,0.790850
0.020500,0.009900,0.180050,0.789550
0.020450,0.009550,0.182900,0.787100
0.019150,0.010450,0.184050,0.786350
0.020800,0.010350,0.184400,0.784450
0.019900,0.010600,0.186100,0.783400
0.019750,0.010200,0.187700,0.782350
0.019750,0.010150,0.189800,0.780300
0.020450,0.009450,0.191400,0.778700
0.020350,0.008850,0.193800,0.777000
0.020050,0.009600,0.195650,0.774700
0.020400,0.010350,0.196850,0.772400
0.020300,0.010950,0.197900,0.770850
0.020550,0.011050,0.199400,0.769000
0.020400,0.011150,0.199650,0.768800
0.020400,0.011250,0.200800,0.767550
0.020950,0.011600,0.201300,0.766150
0.021850,0.011600,0.201700,0.764850
0.022900,0.010900,0.203050,0.763150
0.022700,0.011550,0.204050,0.761700
0.021450,0.012350,0.204400,0.761800
0.022100,0.011700,0.206100,0.760100
0.022300,0.011500,0.207400,0.758800
0.022800,0.011900,0.207050,0.758250
0.024450,0.011400,0.207050,0.757100
0.024800,0.012250,0.207100,0.755850
0.025400,0.012400,0.207250,0.754950
0.025650,0.013300,0.206400,0.754650
0.026450,0.012950,0.206950,0.753650
0.026600,0.014650,0.205300,0.753450
0.027000,0.015600,0.204500,0.752900
0.027600,0.015300,0.204750,0.752350
0.028550,0.015300,0.204400,0.751750
0.029350,0.015300,0.203950,0.751400
0.030350,0.015100,0.203600,0.750950
0.030050,0.015250,0.203400,0.751300
0.031050,0.015550,0.203050,0.750350
0.029650,0.016700,0.202150,0.751500
0.030300,0.016400,0.201950,0.751350
0.031150,0.015400,0.201850,0.751600
0.031300,0.015650,0.201150,0.751900
0.032550,0.015250,0.201350,0.750850
0.032100,0.015600,0.200450,0.751850
0.032500,0.016800,0.199350,0.751350
0.033200,0.016450,0.198500,0.751850
0.034000,0.016300,0.198400,0.751300
0.033450,0.018000,0.196300,0.752250
0.034600,0.018000,0.194650,0.752750
0.034800,0.018400,0.193900,0.752900
0.036200,0.018350,0.192400,0.753050
0.035350,0.018650,0.192550,0.753450
0.035350,0.018950,0.191550,0.754150
0.037600,0.018200,0.190450,0.753750
0.036800,0.019450,0.189700,0.754050
0.037700,0.018600,0.188800,0.754900
0.037200,0.019150,0.188400,0.755250
0.036400,0.019150,0.188550,0.755900
0.037700,0.019500,0.187300,0.755500
0.039500,0.017400,0.187700,0.755400
0.039050,0.017700,0.187100,0.756150
0.038200,0.019750,0.185850,0.756200
0.039400,0.018350,0.185600,0.756650
0.040200,0.017450,0.185700,0.756650
0.039850,0.018000,0.184300,0.757850
0.040200,0.018700,0.182950,0.758150
0.039700,0.018700,0.182050,0.759550
0.039900,0.018800,0.181150,0.760150
0.040050,0.018800,0.180800,0.760350
0.041150,0.018950,0.178800,0.761100
0.039850,0.019850,0.177550,0.762750
0.039250,0.020350,0.176300,0.764100
0.038450,0.019750,0.177250,0.764550
0.038100,0.020000,0.176950,0.764950
0.038100,0.020050,0.176100,0.765750
0.037850,0.018500,0.175800,0.767850
0.038400,0.018750,0.174800,0.768050
0.039700,0.018550,0.174200,0.767550
0.040750,0.017350,0.174100,0.767800
0.040150,0.017350,0.174150,0.768350
0.039100,0.018500,0.173300,0.769100
0.039000,0.017650,0.173100,0.770250
0.038850,0.017950,0.172050,0.771150
0.038800,0.017400,0.172400,0.771400
0.038900,0.017500,0.172200,0.771400
0.038700,0.017150,0.171300,0.772850
0.038850,0.016950,0.172050,0.772150
0.037850,0.018350,0.170850,0.772950
0.037500,0.017850,0.171350,0.773300
0.037400,0.017600,0.171550,0.773450
0.036800,0.017200,0.173000,0.773000
0.036900,0.018000,0.172400,0.772700
0.036950,0.017550,0.171950,0.773550
0.035800,0.018300,0.171400,0.774500
0.035550,0.017200,0.172550,0.774700
0.035650,0.017250,0.172550,0.774550
0.035450,0.018950,0.172200,0.773400
0.035750,0.019500,0.171300,0.773450
0.036300,0.018700,0.170350,0.774650
0.036450,0.019050,0.170900,0.773600
0.036100,0.019000,0.170100,0.774800
0.036850,0.018550,0.170000,0.774600
0.037000,0.018150,0.169700,0.775150
0.037200,0.018050,0.169500,0.775250
0.036700,0.019200,0.168050,0.776050
0.036800,0.019000,0.168100,0.776100
0.037350,0.017650,0.169200,0.775800
0.037600,0.017600,0.169500,0.775300
0.037650,0.016350,0.171300,0.774700
0.037500,0.016350,0.171500,0.774650
0.037400,0.015900,0.171400,0.775300
0.037100,0.015800,0.171700,0.775400
0.036100,0.016200,0.171500,0.776200
0.034850,0.017550,0.170400,0.777200
0.035000,0.016500,0.170950,0.777550
0.034650,0.016250,0.171000,0.778100
0.033650,0.016500,0.171900,0.777950
0.033900,0.016400,0.172500,0.777200
0.034150,0.016000,0.172500,0.777350
0.033750,0.016250,0.173400,0.776600
0.034150,0.015650,0.173300,0.776900
0.034900,0.015800,0.173650,0.775650
0.035550,0.015250,0.174600,0.774600
0.035100,0.015650,0.175050,0.774200
0.034950,0.016150,0.175050,0.773850
0.035350,0.015950,0.174800,0.773900
0.034400,0.016900,0.174350,0.774350
0.034900,0.015400,0.175100,0.774600
0.032900,0.015400,0.176550,0.775150
0.033750,0.014700,0.177000,0.774550
0.033450,0.014800,0.177700,0.774050
0.033400,0.014250,0.178400,0.773950
0.033350,0.014500,0.178950,0.773200
0.033000,0.014700,0.179650,0.772650
0.033350,0.014650,0.179000,0.773000
0.033850,0.013850,0.180000,0.772300
0.033400,0.013950,0.180000,0.772650
0.031650,0.015100,0.180400,0.772850
0.030150,0.016000,0.180500,0.773350
0.030100,0.016450,0.182000,0.771450
0.030050,0.016200,0.183300,0.770450
0.031000,0.015500,0.183750,0.769750
0.031100,0.015400,0.184350,0.769150
0.030350,0.015850,0.185000,0.768800
0.030800,0.015950,0.185150,0.768100
0.031450,0.015400,0.185050,0.768100
0.030950,0.015150,0.185650,0.768250
0.031550,0.015250,0.185200,0.768000
0.030800,0.016650,0.184600,0.767950
0.032350,0.015450,0.185050,0.767150
0.031950,0.016000,0.185000,0.767050
0.031400,0.016450,0.185450,0.766700
0.032550,0.017050,0.185150,0.765250
0.032350,0.016900,0.185650,0.765100
0.031950,0.016450,0.186100,0.765500
0.033200,0.016350,0.186300,0.764150
0.032600,0.016750,0.186500,0.764150
0.031850,0.017600,0.186350,0.764200
0.032500,0.016600,0.186450,0.764450
0.032550,0.017050,0.186150,0.764250
0.032450,0.017250,0.186200,0.764100
0.033900,0.017200,0.186350,0.762550
0.035000,0.016100,0.187500,0.761400
0.034700,0.016650,0.187350,0.761300
0.034550,0.016650,0.187300,0.761500
0.034350,0.017200,0.187500,0.760950
0.034850,0.017550,0.187500,0.760100
0.035250,0.017750,0.188100,0.758900
0.036200,0.017400,0.187450,0.758950
0.035850,0.018200,0.185950,0.760000
0.035650,0.017850,0.185400,0.761100
0.036400,0.018500,0.184250,0.760850
0.037350,0.018700,0.183300,0.760650
0.037550,0.017750,0.184250,0.760450
0.038000,0.017500,0.183550,0.760950
0.037450,0.018150,0.182600,0.761800
0.037450,0.017600,0.182250,0.762700
0.037300,0.017900,0.181050,0.763750
0.038000,0.017800,0.181150,0.763050
0.037700,0.018050,0.181850,0.762400
0.038150,0.018750,0.180500,0.762600
0.038700,0.019400,0.178650,0.763250
0.038850,0.019500,0.178850,0.762800
0.039000,0.018750,0.178400,0.763850
0.038100,0.018400,0.179300,0.764200
0.038700,0.017800,0.179600,0.763900
0.038350,0.017550,0.178700,0.765400
0.038650,0.017600,0.179200,0.764550
0.039850,0.016600,0.178250,0.765300
0.038550,0.016900,0.178750,0.765800
0.037550,0.017000,0.177800,0.767650
0.038350,0.017200,0.176300,0.768150
0.038050,0.017450,0.176650,0.767850
0.038900,0.017150,0.176000,0.767950
0.039300,0.017050,0.175300,0.768350
0.039400,0.017800,0.174150,0.768650
0.039650,0.018150,0.173350,0.768850
0.039600,0.017650,0.171350,0.771400
0.038550,0.018000,0.170800,0.772650
0.038700,0.018050,0.170500,0.772750
0.038750,0.017250,0.170200,0.773800
0.038700,0.017750,0.169750,0.773800
0.038750,0.018250,0.168100,0.774900
0.038850,0.018500,0.168100,0.774550
0.039400,0.017950,0.167200,0.775450
0.037950,0.018600,0.167400,0.776050
0.038150,0.018150,0.167550,0.776150
0.038400,0.017200,0.167500,0.776900
0.037900,0.017450,0.167700,0.776950
0.038200,0.016450,0.167350,0.778000
0.038300,0.016800,0.167200,0.777700
0.037650,0.017500,0.166300,0.778550
0.037000,0.017100,0.166450,0.779450
0.037000,0.016450,0.166550,0.780000
0.036550,0.015750,0.166450,0.781250
0.036700,0.015100,0.167550,0.780650
0.035550,0.015650,0.168650,0.780150
0.035300,0.015800,0.169300,0.779600
0.034650,0.015750,0.169900,0.779700
0.034450,0.014950,0.170700,0.779900
0.034750,0.014650,0.171300,0.779300
0.033450,0.015850,0.171200,0.779500
0.032400,0.016750,0.169200,0.781650
0.032400,0.016050,0.171150,0.780400
0.032550,0.015800,0.170950,0.780700
0.033150,0.015850,0.171350,0.779650
0.032750,0.016300,0.170000,0.780950
0.031700,0.016600,0.170550,0.781150
0.032300,0.015900,0.170700,0.781100
0.031950,0.016300,0.171950,0.779800
0.032350,0.015500,0.171600,0.780550
0.031350,0.015400,0.173150,0.780100
0.030550,0.015350,0.174450,0.779650
0.030550,0.015600,0.174800,0.779050
0.030250,0.015150,0.176450,0.778150
0.030200,0.014100,0.178200,0.777500
0.030300,0.013750,0.179200,0.776750
0.030700,0.012750,0.181300,0.775250
0.030100,0.013000,0.181950,0.774950
0.029650,0.013300,0.183200,0.773850
0.029500,0.013800,0.183250,0.773450
0.028650,0.015050,0.184100,0.772200
0.028850,0.014800,0.185500,0.770850
0.029300,0.014550,0.186450,0.769700
0.029750,0.014900,0.186500,0.768850
0.030050,0.014600,0.187950,0.767400
0.030000,0.016400,0.187400,0.766200
0.030800,0.015650,0.188350,0.765200
0.031000,0.016050,0.189150,0.763800
0.031000,0.016350,0.188800,0.763850
0.030800,0.016800,0.187650,0.764750
0.031300,0.016250,0.189000,0.763450
0.031200,0.016700,0.188500,0.763600
0.031600,0.015100,0.190450,0.762850
0.032450,0.015350,0.190050,0.762150
0.032200,0.015500,0.191200,0.761100
0.031300,0.016100,0.191800,0.760800
0.031250,0.016400,0.191950,0.760400
0.032150,0.016450,0.192000,0.759400
0.032650,0.016000,0.191900,0.759450
0.032750,0.015450,0.192150,0.759650
0.033400,0.015450,0.193100,0.758050
0.032650,0.015550,0.194050,0.757750
0.032300,0.016100,0.194350,0.757250
0.032300,0.016200,0.194650,0.756850
0.031500,0.015950,0.195700,0.756850
0.031000,0.015850,0.195250,0.757900
0.031300,0.015600,0.196200,0.756900
0.031700,0.016800,0.195700,0.755800
0.032200,0.016500,0.195350,0.755950
0.033200,0.015650,0.195900,0.755250
0.034000,0.015250,0.196850,0.753900
0.034250,0.015900,0.196100,0.753750
0.033350,0.017250,0.195950,0.753450
0.034250,0.016900,0.195300,0.753550
0.035300,0.017100,0.195200,0.752400
0.034700,0.017750,0.195050,0.752500
0.034850,0.017250,0.196700,0.751200
0.035250,0.018250,0.195850,0.750650
0.035350,0.018200,0.196050,0.750400
0.035900,0.018100,0.195650,0.750350
0.037550,0.016900,0.195900,0.749650
0.036900,0.017250,0.195100,0.750750
0.036450,0.017750,0.194050,0.751750
0.035450,0.018450,0.193250,0.752850
0.036600,0.017350,0.193250,0.752800
0.036550,0.018100,0.192250,0.753100
0.037100,0.018300,0.191450,0.753150
0.038050,0.018400,0.190550,0.753000
0.038500,0.017300,0.191300,0.752900
0.038900,0.017650,0.191400,0.752050
0.040000,0.018000,0.190450,0.751550
0.039400,0.018950,0.188900,0.752750
0.039700,0.018800,0.188200,0.753300
0.040050,0.019650,0.186850,0.753450
0.040600,0.019250,0.186050,0.754100
0.040550,0.019750,0.184750,0.754950
0.040050,0.019250,0.184350,0.756350
0.040900,0.019000,0.182650,0.757450
0.041450,0.018400,0.181550,0.758600
0.041200,0.018700,0.181300,0.758800
0.041200,0.018250,0.181200,0.759350
0.040700,0.019000,0.180650,0.759650
0.040350,0.020150,0.179150,0.760350
0.040900,0.019250,0.178700,0.761150
0.040900,0.019300,0.178050,0.761750
0.041350,0.019900,0.176150,0.762600
0.041350,0.020250,0.175050,0.763350
0.041350,0.020450,0.174950,0.763250
0.040850,0.020600,0.174300,0.764250
0.041050,0.020450,0.172600,0.765900
0.040000,0.020250,0.172350,0.767400
0.040050,0.020050,0.171500,0.768400
0.040950,0.020350,0.170350,0.768350
0.041800,0.018450,0.170400,0.769350
0.040500,0.019000,0.170200,0.770300
0.039800,0.018050,0.170750,0.771400
0.040050,0.018350,0.170600,0.771000
0.038800,0.019800,0.168350,0.773050
0.039550,0.019950,0.167800,0.772700
0.040450,0.018350,0.168550,0.772650
0.039450,0.018050,0.168300,0.774200
0.039250,0.017850,0.168200,0.774700
0.040400,0.016500,0.169250,0.773850
0.040000,0.016350,0.169400,0.774250
0.040000,0.016400,0.170000,0.773600
0.038550,0.017300,0.169800,0.774350
0.036750,0.017050,0.169450,0.776750
0.036350,0.016650,0.170500,0.776500
0.035600,0.017250,0.170500,0.776650
0.035650,0.017900,0.170300,0.776150
0.035500,0.017300,0.170850,0.776350
0.035950,0.017100,0.171550,0.775400
0.035500,0.017300,0.171500,0.775700
0.035550,0.016650,0.172650,0.775150
0.034750,0.016150,0.173050,0.776050
0.034700,0.017100,0.173600,0.774600
0.035200,0.016900,0.173650,0.774250
0.036000,0.017050,0.173200,0.773750
0.037150,0.016950,0.173000,0.772900
0.034900,0.017400,0.174500,0.773200
0.034600,0.017600,0.174050,0.773750
0.033950,0.017300,0.176300,0.772450
0.033700,0.017600,0.176400,0.772300
0.035150,0.016950,0.177500,0.770400
0.035450,0.017650,0.177600,0.769300
0.036100,0.016800,0.177800,0.769300
0.035950,0.017450,0.177100,0.769500
0.035500,0.017400,0.178300,0.768800
0.035800,0.016150,0.179000,0.769050
0.036100,0.016500,0.179200,0.768200
0.036350,0.016650,0.179200,0.767800
0.036050,0.016350,0.178750,0.768850
0.036700,0.015700,0.180350,0.767250
0.036450,0.015900,0.179950,0.767700
0.036200,0.016150,0.179200,0.768450
0.036000,0.016450,0.178900,0.768650
0.035350,0.016600,0.179500,0.768550
0.034850,0.017200,0.179250,0.768700
0.034800,0.017350,0.178850,0.769000
0.035250,0.017200,0.178250,0.769300
0.035200,0.016500,0.178850,0.769450
0.035200,0.015700,0.179450,0.769650
0.035200,0.014850,0.181300,0.768650
0.035550,0.014550,0.181850,0.768050
0.034300,0.014550,0.182000,0.769150
0.035000,0.014400,0.184000,0.766600
0.033800,0.015900,0.182900,0.767400
0.033100,0.016350,0.184250,0.766300
0.032750,0.017050,0.183850,0.766350
0.033100,0.016900,0.184400,0.765600
0.033800,0.016750,0.183700,0.765750
0.034050,0.017800,0.183250,0.764900
0.034050,0.017800,0.183400,0.764750
0.034950,0.017900,0.184100,0.763050
0.035200,0.018350,0.183800,0.762650
0.035450,0.017300,0.185250,0.762000
0.035700,0.018000,0.185200,0.761100
0.035750,0.019500,0.184550,0.760200
0.036400,0.019150,0.183900,0.760550
0.036550,0.019850,0.182550,0.761050
0.038000,0.019300,0.182550,0.760150
0.038050,0.018700,0.182150,0.761100
0.038200,0.018950,0.181000,0.761850
0.038600,0.018550,0.180450,0.762400
0.038250,0.018250,0.181300,0.762200
0.038300,0.018600,0.181400,0.761700
0.038450,0.018800,0.179900,0.762850
0.037950,0.019100,0.178500,0.764450
0.038550,0.018350,0.178150,0.764950
0.038850,0.019050,0.177400,0.764700
0.038700,0.018550,0.177550,0.765200
0.039450,0.017700,0.177050,0.765800
0.039100,0.018850,0.175150,0.766900
0.038900,0.019750,0.174550,0.766800
0.040950,0.017850,0.174500,0.766700
0.041450,0.017550,0.173600,0.767400
0.041850,0.016750,0.173600,0.767800
0.041200,0.017150,0.172500,0.769150
0.040150,0.017950,0.171850,0.770050
0.039900,0.017350,0.171500,0.771250
0.039000,0.018400,0.171500,0.771100
0.038800,0.018850,0.172200,0.770150
0.039550,0.017450,0.172100,0.770900
0.040050,0.017000,0.173350,0.769600
0.039250,0.017400,0.172850,0.770500
0.038300,0.017350,0.172950,0.771400
0.039050,0.016950,0.172600,0.771400
0.039400,0.016850,0.171750,0.772000
0.038150,0.016600,0.171650,0.773600
0.037800,0.017750,0.170700,0.773750
0.037950,0.018000,0.170900,0.773150
0.038200,0.017500,0.170900,0.773400
0.037750,0.017600,0.171150,0.773500
0.037200,0.017300,0.171750,0.773750
0.036350,0.017750,0.170150,0.775750
0.035800,0.016350,0.172250,0.775600
0.036050,0.017500,0.171250,0.775200
0.037050,0.016900,0.171200,0.774850
0.036800,0.017050,0.172700,0.773450
0.037100,0.016900,0.172150,0.773850
0.037400,0.017750,0.171700,0.773150
0.037400,0.017100,0.171700,0.773800
0.036600,0.017450,0.171450,0.774500
0.036050,0.017900,0.171350,0.774700
0.035800,0.017400,0.172100,0.774700
0.036950,0.016400,0.173050,0.773600
0.036750,0.016400,0.173200,0.773650
0.036250,0.016600,0.173700,0.773450
0.035700,0.016750,0.174850,0.772700
0.035000,0.016650,0.176550,0.771800
0.035050,0.017350,0.175550,0.772050
0.034050,0.018400,0.174950,0.772600
0.034450,0.017850,0.176050,0.771650
0.034950,0.016900,0.176450,0.771700
0.035150,0.015850,0.177650,0.771350
0.034250,0.016750,0.178450,0.770550
0.033150,0.016350,0.178200,0.772300
0.033200,0.016950,0.177450,0.772400
0.033400,0.016450,0.178100,0.772050
0.034200,0.015850,0.178850,0.771100
0.034350,0.015250,0.179000,0.771400
0.035600,0.014850,0.179650,0.769900
0.034750,0.014700,0.179450,0.771100
0.034850,0.014150,0.180050,0.770950
0.034950,0.014750,0.180250,0.770050
0.034350,0.014450,0.181000,0.770200
0.033350,0.015200,0.181300,0.770150
0.032850,0.015250,0.181600,0.770300
0.033450,0.015350,0.181600,0.769600
0.032900,0.016350,0.181200,0.769550
0.033500,0.015450,0.181950,0.769100
0.032950,0.015150,0.182150,0.769750
0.032850,0.014400,0.182350,0.770400
0.032250,0.014950,0.183000,0.769800
0.032050,0.014900,0.184800,0.768250
0.030450,0.015800,0.185450,0.768300
0.030950,0.015500,0.186500,0.767050
0.030400,0.016200,0.185900,0.767500
0.030700,0.016100,0.186200,0.767000
0.031700,0.015550,0.186400,0.766350
0.031650,0.015800,0.187100,0.765450
0.032100,0.015450,0.187450,0.765000
0.031500,0.015000,0.188250,0.765250
0.031750,0.015050,0.188100,0.765100
