I,E,S,R
0.001000,0.001200,0.997800,0.000000
0.001150,0.002100,0.996650,0.000100
0.001550,0.002600,0.995600,0.000250
0.002050,0.003500,0.993950,0.000500
0.002700,0.004150,0.992250,0.000900
0.003850,0.005400,0.989600,0.001150
0.004800,0.007750,0.985800,0.001650
0.006950,0.010050,0.980950,0.002050
0.008600,0.013650,0.974850,0.002900
0.011600,0.016900,0.967400,0.004100
0.015300,0.022950,0.956550,0.005200
0.019300,0.030800,0.942650,0.007250
0.025950,0.037700,0.926800,0.009550
0.032750,0.047900,0.906300,0.013050
0.040900,0.062000,0.879600,0.017500
0.052500,0.077700,0.846750,0.023050
0.069000,0.092800,0.808800,0.029400
0.086050,0.112650,0.762200,0.039100
0.105900,0.138600,0.705500,0.050000
0.131650,0.164450,0.640100,0.063800
0.160450,0.187900,0.569050,0.082600
0.194450,0.203350,0.498650,0.103550
0.225950,0.223050,0.422550,0.128450
0.260300,0.234350,0.348200,0.157150
0.290300,0.237400,0.278150,0.194150
0.316700,0.232150,0.218100,0.233050
0.342650,0.216350,0.169150,0.271850
0.362200,0.195300,0.129450,0.313050
0.371650,0.170950,0.100150,0.357250
0.370250,0.146750,0.076250,0.406750
0.363450,0.123600,0.058100,0.454850
0.350400,0.102650,0.043900,0.503050
0.334300,0.082300,0.036000,0.547400
0.312650,0.068100,0.028950,0.590300
0.289250,0.054550,0.024450,0.631750
0.267500,0.042300,0.022100,0.668100
0.243250,0.033750,0.019650,0.703350
0.221050,0.026900,0.019250,0.732800
0.198750,0.023050,0.018550,0.759650
0.178900,0.017850,0.018200,0.785050
0.160400,0.015100,0.019300,0.805200
0.143450,0.012550,0.020550,0.823450
0.128650,0.010600,0.020650,0.840100
0.112950,0.009300,0.021550,0.856200
0.101450,0.007950,0.022200,0.868400
0.090700,0.006800,0.024450,0.878050
0.081350,0.006300,0.025300,0.887050
0.070800,0.005900,0.027400,0.895900
0.062900,0.005550,0.029550,0.902000
0.055700,0.005250,0.030950,0.908100
0.049400,0.005000,0.032750,0.912850
0.043450,0.004700,0.035550,0.916300
0.038250,0.004100,0.037200,0.920450
0.033600,0.004250,0.039400,0.922750
0.030300,0.003950,0.041850,0.923900
0.027350,0.004200,0.044550,0.923900
0.024500,0.003800,0.046700,0.925000
0.022400,0.003500,0.048450,0.925650
0.019700,0.003450,0.050950,0.925900
0.018350,0.002550,0.053750,0.925350
0.016900,0.002400,0.056200,0.924500
0.015100,0.002550,0.058600,0.923750
0.013800,0.002550,0.062050,0.921600
0.012350,0.002500,0.065000,0.920150
0.011550,0.002150,0.068050,0.918250
0.010200,0.001700,0.071050,0.917050
0.009250,0.001850,0.073650,0.915250
0.008350,0.001800,0.076200,0.913650
0.008000,0.001750,0.077950,0.912300
0.007200,0.001650,0.080600,0.910550
0.006700,0.001500,0.083150,0.908650
0.006350,0.001350,0.086300,0.906000
0.005800,0.001250,0.088950,0.904000
0.005300,0.000900,0.091450,0.902350
0.004300,0.001000,0.094300,0.900400
0.003700,0.001300,0.096250,0.898750
0.003550,0.001100,0.098400,0.896950
0.003300,0.001100,0.101300,0.894300
0.002950,0.001150,0.104300,0.891600
0.002900,0.001250,0.106750,0.889100
0.003150,0.000950,0.109350,0.886550
0.002850,0.001000,0.113100,0.883050
0.002550,0.001000,0.114850,0.881600
0.002500,0.000800,0.117650,0.879050
0.002350,0.000950,0.119450,0.877250
0.002100,0.000700,0.122850,0.874350
0.002200,0.000400,0.126150,0.871250
0.001850,0.000400,0.129350,0.868400
0.001650,0.000500,0.131250,0.866600
0.001700,0.000450,0.133650,0.864200
0.001550,0.000450,0.135700,0.862300
0.001400,0.000400,0.138100,0.860100
0.001400,0.000400,0.140700,0.857500
0.001300,0.000300,0.143600,0.854800
0.001300,0.000200,0.146050,0.852450
0.001200,0.000350,0.148350,0.850100
0.001250,0.000400,0.150950,0.847400
0.001200,0.000450,0.153200,0.845150
0.001100,0.000400,0.156350,0.842150
0.001000,0.000450,0.158950,0.839600
0.001000,0.000500,0.161150,0.837350
0.001050,0.000450,0.164000,0.834500
0.001050,0.000450,0.166800,0.831700
0.001200,0.000450,0.168500,0.829850
0.001000,0.000400,0.170800,0.827800
0.001050,0.000400,0.173350,0.825200
0.001150,0.000450,0.175300,0.823100
0.001050,0.000450,0.177550,0.820950
0.000950,0.000500,0.180100,0.818450
0.000950,0.000450,0.182750,0.815850
0.001050,0.000350,0.184500,0.814100
0.001000,0.000300,0.186800,0.811900
0.000950,0.000350,0.189100,0.809600
0.000900,0.000350,0.191400,0.807350
0.000800,0.000400,0.192950,0.805850
0.000950,0.000400,0.194650,0.804000
0.000950,0.000400,0.196800,0.801850
0.000950,0.000550,0.198600,0.799900
0.000750,0.000550,0.200800,0.797900
0.001000,0.000350,0.202950,0.795700
0.001050,0.000450,0.205700,0.792800
0.001100,0.000500,0.208150,0.790250
0.001100,0.000550,0.209850,0.788500
0.001000,0.000600,0.212200,0.786200
0.001150,0.000600,0.214750,0.783500
0.001200,0.000750,0.216500,0.781550
0.001300,0.000650,0.218700,0.779350
0.001500,0.000550,0.220950,0.777000
0.001500,0.000550,0.222650,0.775300
0.001350,0.000450,0.224900,0.773300
0.001350,0.000550,0.227300,0.770800
0.001350,0.000550,0.229000,0.769100
0.001350,0.000500,0.230450,0.767700
0.001350,0.000500,0.232150,0.766000
0.001450,0.000450,0.234250,0.763850
0.001250,0.000650,0.236450,0.761650
0.001250,0.000600,0.238500,0.759650
0.001100,0.000500,0.240350,0.758050
0.001100,0.000500,0.242050,0.756350
0.001000,0.000650,0.245050,0.753300
0.001150,0.000650,0.247250,0.750950
0.001250,0.000650,0.248650,0.749450
0.001150,0.000700,0.250350,0.747800
0.001150,0.000800,0.252300,0.745750
0.001050,0.000750,0.254300,0.743900
0.000850,0.000800,0.256650,0.741700
0.000650,0.000800,0.258500,0.740050
0.000800,0.000850,0.260550,0.737800
0.001050,0.000750,0.262350,0.735850
0.001150,0.000950,0.264100,0.733800
0.001200,0.000900,0.265800,0.732100
0.001350,0.000950,0.267450,0.730250
0.001550,0.000900,0.269050,0.728500
0.001600,0.001150,0.271000,0.726250
0.001750,0.001150,0.272350,0.724750
0.001800,0.001200,0.273600,0.723400
0.001650,0.001550,0.275200,0.721600
0.001700,0.001600,0.276300,0.720400
0.002100,0.001650,0.278050,0.718200
0.002350,0.001800,0.279500,0.716350
0.002500,0.001500,0.281050,0.714950
0.002650,0.001950,0.282450,0.712950
0.002950,0.001850,0.283550,0.711650
0.002950,0.002250,0.285350,0.709450
0.003350,0.002200,0.285950,0.708500
0.003750,0.001950,0.287450,0.706850
0.003900,0.002250,0.288900,0.704950
0.003700,0.002700,0.290250,0.703350
0.004300,0.002200,0.291650,0.701850
0.004500,0.002900,0.292900,0.699700
0.004500,0.003000,0.293950,0.698550
0.004750,0.003150,0.295200,0.696900
0.004900,0.003900,0.296150,0.695050
0.004950,0.003750,0.297750,0.693550
0.005100,0.004200,0.298600,0.692100
0.005500,0.004100,0.299700,0.690700
0.006150,0.004450,0.300400,0.689000
0.007000,0.004250,0.301400,0.687350
0.007500,0.004850,0.301700,0.685950
0.007600,0.004900,0.302300,0.685200
0.008050,0.006350,0.301500,0.684100
0.008450,0.006800,0.301200,0.683550
0.008650,0.007200,0.300950,0.683200
0.009500,0.007400,0.300800,0.682300
0.010600,0.007950,0.300050,0.681400
0.011650,0.008000,0.299600,0.680750
0.012150,0.008900,0.298650,0.680300
0.012800,0.008750,0.298050,0.680400
0.013500,0.008500,0.297400,0.680600
0.014200,0.009200,0.296500,0.680100
0.015250,0.010850,0.294100,0.679800
0.016550,0.011450,0.291850,0.680150
0.018200,0.011600,0.290300,0.679900
0.018700,0.012550,0.289000,0.679750
0.019250,0.013100,0.287350,0.680300
0.021100,0.013750,0.284350,0.680800
0.022550,0.014750,0.280550,0.682150
0.023950,0.014000,0.278150,0.683900
0.024500,0.015400,0.275350,0.684750
0.024950,0.016550,0.271700,0.686800
0.026400,0.017700,0.268050,0.687850
0.027200,0.019050,0.263800,0.689950
0.028600,0.020500,0.259850,0.691050
0.030200,0.020350,0.256500,0.692950
0.031650,0.019500,0.254200,0.694650
0.032250,0.020400,0.250700,0.696650
0.034200,0.020600,0.247500,0.697700
0.036050,0.020800,0.243550,0.699600
0.036750,0.021900,0.238600,0.702750
0.038450,0.022500,0.233600,0.705450
0.039600,0.023150,0.228850,0.708400
0.040950,0.023550,0.224550,0.710950
0.040550,0.025600,0.219850,0.714000
0.040500,0.026100,0.215300,0.718100
0.042350,0.026050,0.210500,0.721100
0.043700,0.026600,0.206100,0.723600
0.045550,0.026000,0.202250,0.726200
0.045300,0.026150,0.197700,0.730850
0.045400,0.027250,0.192050,0.735300
0.045750,0.026750,0.188400,0.739100
0.047300,0.025200,0.184300,0.743200
0.048600,0.024500,0.180250,0.746650
0.050350,0.023350,0.176450,0.749850
0.049650,0.024450,0.171900,0.754000
0.051200,0.024500,0.168100,0.756200
0.050300,0.024950,0.164100,0.760650
0.050100,0.024000,0.161050,0.764850
0.050250,0.024900,0.156800,0.768050
0.051600,0.022450,0.154700,0.771250
0.051650,0.021250,0.151650,0.775450
0.051400,0.019900,0.149900,0.778800
0.050050,0.020500,0.147150,0.782300
0.048600,0.020700,0.145900,0.784800
0.046250,0.020300,0.144150,0.789300
0.046150,0.018750,0.143300,0.791800
0.046400,0.018400,0.141150,0.794050
0.045700,0.018500,0.139650,0.796150
0.044400,0.017450,0.138300,0.799850
0.042750,0.017950,0.137100,0.802200
0.041850,0.017950,0.135400,0.804800
0.041400,0.018150,0.134450,0.806000
0.041500,0.017300,0.133300,0.807900
0.040950,0.016050,0.132950,0.810050
0.040500,0.016650,0.132950,0.809900
0.040600,0.015650,0.132750,0.811000
0.039000,0.016000,0.131900,0.813100
0.038050,0.015700,0.131500,0.814750
0.038100,0.014600,0.131950,0.815350
0.037500,0.013900,0.131400,0.817200
0.036050,0.013150,0.131850,0.818950
0.036250,0.012950,0.130750,0.820050
0.034550,0.013100,0.131050,0.821300
0.033350,0.013300,0.132100,0.821250
0.033050,0.011650,0.133900,0.821400
0.031900,0.012200,0.134300,0.821600
0.030650,0.012900,0.135100,0.821350
0.029750,0.012100,0.136150,0.822000
0.028800,0.011900,0.136350,0.822950
0.028050,0.011950,0.137150,0.822850
0.027800,0.011750,0.138650,0.821800
0.027550,0.011050,0.140250,0.821150
0.027050,0.010900,0.141600,0.820450
0.026900,0.010250,0.142900,0.819950
0.025450,0.011200,0.144600,0.818750
0.025600,0.010750,0.145600,0.818050
0.025000,0.009200,0.148100,0.817700
0.025200,0.009150,0.149600,0.816050
0.024800,0.009850,0.150850,0.814500
0.023950,0.010350,0.151900,0.813800
0.024100,0.009600,0.153750,0.812550
0.023300,0.009900,0.156000,0.810800
0.022250,0.010250,0.157850,0.809650
0.022050,0.009900,0.159500,0.808550
0.022150,0.009300,0.160750,0.807800
0.021250,0.009550,0.162250,0.806950
0.020600,0.009800,0.163450,0.806150
0.021650,0.009500,0.164750,0.804100
0.021550,0.009800,0.166350,0.802300
0.020950,0.009900,0.168100,0.801050
0.020050,0.011000,0.169050,0.799900
0.020550,0.010100,0.170950,0.798400
0.020450,0.009550,0.172400,0.797600
0.020550,0.009900,0.173400,0.796150
0.020800,0.009450,0.174850,0.794900
0.021000,0.009200,0.177000,0.792800
0.020900,0.009650,0.178900,0.790550
0.020900,0.009250,0.181200,0.788650
0.021600,0.009700,0.182000,0.786700
0.021250,0.010100,0.184300,0.784350
0.021650,0.010300,0.185200,0.782850
0.021350,0.011000,0.185900,0.781750
0.021700,0.010800,0.187050,0.780450
0.021650,0.009750,0.190100,0.778500
0.021200,0.011250,0.190100,0.777450
0.021900,0.011100,0.191300,0.775700
0.022450,0.011200,0.192850,0.773500
0.022250,0.011500,0.193750,0.772500
0.022700,0.011000,0.195400,0.770900
0.023050,0.011800,0.196350,0.768800
0.022650,0.012150,0.196550,0.768650
0.022600,0.012150,0.197900,0.767350
0.022550,0.012700,0.198650,0.766100
0.022900,0.012550,0.199300,0.765250
0.023700,0.011850,0.200250,0.764200
0.023800,0.012400,0.200500,0.763300
0.024300,0.012700,0.201150,0.761850
0.023800,0.012150,0.202150,0.761900
0.024550,0.012600,0.202550,0.760300
0.025050,0.013150,0.203200,0.758600
0.024800,0.013300,0.203550,0.758350
0.026000,0.012500,0.204850,0.756650
0.026100,0.013450,0.204550,0.755900
0.025850,0.014150,0.205300,0.754700
0.026350,0.014050,0.205900,0.753700
0.026400,0.013900,0.204950,0.754750
0.026650,0.014100,0.205950,0.753300
0.027650,0.012950,0.206400,0.753000
0.028050,0.013400,0.206750,0.751800
0.028950,0.013650,0.206200,0.751200
0.028950,0.013650,0.206950,0.750450
0.027800,0.014850,0.206750,0.750600
0.028000,0.015600,0.206550,0.749850
0.028150,0.015850,0.206450,0.749550
0.028000,0.016100,0.205350,0.750550
0.027950,0.016600,0.205750,0.749700
0.030000,0.015000,0.206150,0.748850
0.030050,0.015700,0.205900,0.748350
0.029800,0.015850,0.206400,0.747950
0.030550,0.014850,0.207050,0.747550
0.030200,0.016250,0.205550,0.748000
0.031750,0.017050,0.204950,0.746250
0.031000,0.018100,0.203750,0.747150
0.031100,0.019300,0.202300,0.747300
0.033100,0.017650,0.202900,0.746350
0.033550,0.017800,0.203450,0.745200
0.034450,0.017000,0.204000,0.744550
0.035000,0.017100,0.203800,0.744100
0.034250,0.019500,0.201800,0.744450
0.035050,0.019200,0.200650,0.745100
0.036050,0.019550,0.199550,0.744850
0.036000,0.020200,0.198300,0.745500
0.037200,0.020200,0.197250,0.745350
0.037000,0.019800,0.196100,0.747100
0.037900,0.019300,0.194000,0.748800
0.038850,0.019000,0.193450,0.748700
0.039000,0.019100,0.191950,0.749950
0.037500,0.020500,0.190500,0.751500
0.038050,0.020450,0.189500,0.752000
0.038550,0.021200,0.188300,0.751950
0.038800,0.021450,0.187100,0.752650
0.038900,0.020550,0.186950,0.753600
0.039200,0.021300,0.184500,0.755000
0.040000,0.019750,0.183100,0.757150
0.039900,0.020000,0.183100,0.757000
0.041450,0.019700,0.180800,0.758050
0.042000,0.020150,0.179550,0.758300
0.040800,0.021550,0.178850,0.758800
0.040900,0.020800,0.177900,0.760400
0.040850,0.021300,0.175400,0.762450
0.041700,0.021100,0.174450,0.762750
0.042000,0.020450,0.173350,0.764200
0.041600,0.020650,0.172550,0.765200
0.041650,0.019550,0.171750,0.767050
0.041950,0.019600,0.170750,0.767700
0.042600,0.018900,0.170600,0.767900
0.041150,0.019050,0.169700,0.770100
0.040850,0.018650,0.168800,0.771700
0.039650,0.020150,0.167800,0.772400
0.039900,0.019600,0.166700,0.773800
0.040000,0.019300,0.165950,0.774750
0.039350,0.018200,0.166250,0.776200
0.039250,0.018550,0.166100,0.776100
0.038400,0.019400,0.165350,0.776850
0.039150,0.018850,0.165000,0.777000
0.039600,0.018150,0.165300,0.776950
0.040000,0.019050,0.164300,0.776650
0.038600,0.017650,0.165500,0.778250
0.038650,0.016950,0.165200,0.779200
0.038500,0.017150,0.165500,0.778850
0.038450,0.017600,0.163950,0.780000
0.038300,0.017000,0.163350,0.781350
0.038350,0.017000,0.162850,0.781800
0.037000,0.017050,0.162750,0.783200
0.035850,0.017000,0.164000,0.783150
0.035350,0.017100,0.164950,0.782600
0.035600,0.016450,0.166100,0.781850
0.034700,0.017200,0.165550,0.782550
0.035050,0.018200,0.165250,0.781500
0.035550,0.016950,0.165550,0.781950
0.035350,0.016550,0.166300,0.781800
0.034350,0.015950,0.167600,0.782100
0.034400,0.016100,0.167900,0.781600
0.033900,0.015350,0.168750,0.782000
0.033350,0.014950,0.169850,0.781850
0.032700,0.015050,0.171800,0.780450
0.031950,0.015250,0.172600,0.780200
0.029950,0.015450,0.173550,0.781050
0.031100,0.014300,0.174400,0.780200
0.030100,0.015400,0.175450,0.779050
0.030500,0.014400,0.176400,0.778700
0.030650,0.015250,0.176050,0.778050
0.030350,0.016100,0.176450,0.777100
0.030300,0.015900,0.176900,0.776900
0.031050,0.015550,0.178650,0.774750
0.031700,0.015500,0.178850,0.773950
0.030900,0.014900,0.179650,0.774550
0.031400,0.014500,0.181250,0.772850
0.031100,0.015100,0.181450,0.772350
0.030800,0.014750,0.183050,0.771400
0.031050,0.015050,0.183750,0.770150
0.031650,0.013850,0.185500,0.769000
0.030450,0.014450,0.186650,0.768450
0.030350,0.015000,0.186300,0.768350
0.029950,0.014750,0.187750,0.767550
0.030100,0.014500,0.189700,0.765700
0.029600,0.015350,0.189900,0.765150
0.029250,0.014650,0.191400,0.764700
0.029250,0.015450,0.190400,0.764900
0.030150,0.015400,0.190150,0.764300
0.030950,0.014700,0.190300,0.764050
0.031350,0.014800,0.190900,0.762950
0.031650,0.014650,0.191300,0.762400
0.030950,0.015000,0.192350,0.761700
0.030600,0.016150,0.191350,0.761900
0.031900,0.014600,0.193100,0.760400
0.031350,0.014250,0.194150,0.760250
0.031900,0.015150,0.192950,0.760000
0.032250,0.014450,0.193750,0.759550
0.031700,0.014850,0.193400,0.760050
0.030950,0.015250,0.194300,0.759500
0.031550,0.016000,0.193450,0.759000
0.032050,0.015950,0.193050,0.758950
0.032400,0.016350,0.192950,0.758300
0.034150,0.015200,0.193150,0.757500
0.033950,0.015600,0.192700,0.757750
0.034050,0.015700,0.191900,0.758350
0.034050,0.015850,0.191950,0.758150
0.033450,0.016100,0.192150,0.758300
0.032950,0.017600,0.191400,0.758050
0.032800,0.018050,0.190200,0.758950
0.034150,0.017400,0.189100,0.759350
0.033400,0.017800,0.188650,0.760150
0.033450,0.018600,0.189050,0.758900
0.033150,0.019000,0.187950,0.759900
0.034100,0.019800,0.187000,0.759100
0.034850,0.019400,0.187000,0.758750
0.035300,0.019150,0.186600,0.758950
0.036050,0.018450,0.186600,0.758900
0.036500,0.019100,0.185450,0.758950
0.037550,0.019050,0.184150,0.759250
0.037550,0.018700,0.183250,0.760500
0.036800,0.018600,0.182300,0.762300
0.037050,0.017550,0.182150,0.763250
0.037650,0.018100,0.181950,0.762300
0.038000,0.017800,0.181800,0.762400
0.038900,0.016850,0.182400,0.761850
0.038650,0.018000,0.181000,0.762350
0.039150,0.016850,0.181250,0.762750
0.038400,0.017300,0.181200,0.763100
0.038150,0.017150,0.180950,0.763750
0.038150,0.017700,0.179700,0.764450
0.037150,0.017550,0.179100,0.766200
0.036950,0.018200,0.179600,0.765250
0.037200,0.018250,0.177550,0.767000
0.036950,0.018650,0.176250,0.768150
0.036050,0.019350,0.175250,0.769350
0.038050,0.017900,0.174950,0.769100
0.037900,0.019000,0.173050,0.770050
0.038250,0.019350,0.172250,0.770150
0.038250,0.020250,0.171850,0.769650
0.037900,0.020550,0.171500,0.770050
0.038900,0.020600,0.170100,0.770400
0.039650,0.020350,0.169550,0.770450
0.041400,0.017800,0.171050,0.769750
0.039400,0.017600,0.170650,0.772350
0.039800,0.018350,0.169700,0.772150
0.040700,0.017700,0.169600,0.772000
0.039950,0.018150,0.168650,0.773250
0.040250,0.017300,0.169500,0.772950
0.040100,0.017700,0.167600,0.774600
0.038950,0.017050,0.167500,0.776500
0.039350,0.016550,0.168250,0.775850
0.038600,0.016100,0.168450,0.776850
0.037400,0.016600,0.168200,0.777800
0.036650,0.016950,0.167450,0.778950
0.036400,0.017050,0.167350,0.779200
0.036600,0.017450,0.165950,0.780000
0.036200,0.017050,0.165750,0.781000
0.036800,0.016900,0.166100,0.780200
0.035400,0.017300,0.165750,0.781550
0.035850,0.017400,0.167000,0.779750
0.035350,0.016750,0.167250,0.780650
0.034500,0.016750,0.167500,0.781250
0.034100,0.017100,0.167400,0.781400
0.033950,0.018000,0.167000,0.781050
0.034550,0.016950,0.167100,0.781400
0.033950,0.017000,0.167100,0.781950
0.033750,0.016600,0.166450,0.783200
0.033600,0.016700,0.167550,0.782150
0.034500,0.016600,0.168300,0.780600
0.035200,0.016400,0.168700,0.779700
0.035250,0.014700,0.169700,0.780350
0.034200,0.015400,0.169400,0.781000
0.034300,0.015450,0.169500,0.780750
0.033750,0.014450,0.169950,0.781850
0.033150,0.015300,0.169700,0.781850
0.033250,0.016000,0.169550,0.781200
0.032650,0.016300,0.169400,0.781650
0.034450,0.015600,0.170700,0.779250
0.033500,0.015800,0.171950,0.778750
0.032150,0.015550,0.172500,0.779800
0.032650,0.015350,0.173350,0.778650
0.032250,0.015100,0.173900,0.778750
0.032200,0.015250,0.174400,0.778150
0.031900,0.015300,0.175400,0.777400
0.032100,0.014850,0.175850,0.777200
0.032950,0.014750,0.176200,0.776100
0.032200,0.014650,0.177400,0.775750
0.032800,0.014300,0.177500,0.775400
0.033350,0.014850,0.177350,0.774450
0.033800,0.015050,0.176450,0.774700
0.034000,0.015400,0.176150,0.774450
0.032500,0.016000,0.177100,0.774400
0.031200,0.017200,0.176700,0.774900
0.031250,0.017000,0.177500,0.774250
0.032400,0.016500,0.176750,0.774350
0.032200,0.016650,0.177300,0.773850
0.032950,0.016550,0.177550,0.772950
0.032300,0.017400,0.178100,0.772200
0.032600,0.016000,0.178150,0.773250
0.032300,0.015900,0.178950,0.772850
0.031650,0.016050,0.179750,0.772550
0.031950,0.015750,0.180550,0.771750
0.032400,0.015750,0.180450,0.771400
0.032000,0.015650,0.181150,0.771200
0.032450,0.014850,0.183300,0.769400
0.032600,0.015000,0.182650,0.769750
0.032600,0.014850,0.183650,0.768900
0.032350,0.014800,0.183950,0.768900
0.032400,0.015350,0.183450,0.768800
0.032550,0.014900,0.184150,0.768400
0.031850,0.015400,0.183650,0.769100
0.031750,0.015700,0.183200,0.769350
0.031500,0.016050,0.183500,0.768950
0.032850,0.015300,0.183850,0.768000
0.032200,0.015550,0.183750,0.768500
0.032100,0.016050,0.183300,0.768550
0.032000,0.015200,0.184100,0.768700
0.031850,0.016450,0.184100,0.767600
0.031750,0.016500,0.184400,0.767350
0.031950,0.016850,0.184850,0.766350
0.033050,0.016050,0.185000,0.765900
0.033000,0.016550,0.184900,0.765550
0.033900,0.016250,0.185100,0.764750
0.033650,0.016900,0.184450,0.765000
0.033900,0.015650,0.184500,0.765950
0.033850,0.015050,0.184950,0.766150
0.032900,0.015450,0.186150,0.765500
0.032150,0.016050,0.186850,0.764950
0.032950,0.015900,0.186450,0.764700
0.032450,0.015850,0.187350,0.764350
0.032100,0.015850,0.188650,0.763400
0.032200,0.017400,0.187900,0.762500
0.032450,0.016800,0.186950,0.763800
0.033750,0.017050,0.185650,0.763550
0.033700,0.017350,0.184800,0.764150
0.034550,0.015850,0.186250,0.763350
0.034700,0.015700,0.186350,0.763250
0.033900,0.016850,0.185550,0.763700
0.033400,0.017050,0.185950,0.763600
0.034300,0.016700,0.185100,0.763900
0.034400,0.017250,0.185100,0.763250
0.034400,0.016900,0.185050,0.763650
0.034500,0.017900,0.184600,0.763000
0.034900,0.017100,0.184700,0.763300
0.034250,0.017600,0.185450,0.762700
0.034900,0.018100,0.185400,0.761600
0.035800,0.017700,0.185550,0.760950
0.036200,0.016500,0.186700,0.760600
0.035900,0.016950,0.186100,0.761050
0.035600,0.016900,0.185550,0.761950
0.034850,0.016750,0.185450,0.762950
0.035150,0.017000,0.184100,0.763750
0.035400,0.017550,0.184150,0.762900
0.035750,0.017650,0.183350,0.763250
0.036200,0.017300,0.184650,0.761850
0.037700,0.016600,0.183950,0.761750
0.038150,0.016300,0.183600,0.761950
0.038000,0.016550,0.183500,0.761950
0.037300,0.016600,0.184000,0.762100
0.036300,0.017000,0.183450,0.763250
0.036450,0.016650,0.182800,0.764100
0.037250,0.016250,0.182650,0.763850
0.037400,0.016650,0.183150,0.762800
0.036950,0.018050,0.181500,0.763500
0.037050,0.018400,0.181650,0.762900
0.037200,0.018450,0.181450,0.762900
0.036000,0.019350,0.182000,0.762650
0.037850,0.018150,0.182300,0.761700
0.036200,0.018800,0.180900,0.764100
0.035900,0.019000,0.180450,0.764650
0.035950,0.018900,0.180900,0.764250
0.036450,0.018550,0.180250,0.764750
0.035800,0.018200,0.181100,0.764900
0.036300,0.017500,0.181450,0.764750
0.036850,0.016850,0.182250,0.764050
0.037200,0.016900,0.182700,0.763200
0.036600,0.018200,0.181150,0.764050
0.037300,0.017850,0.180600,0.764250
0.037600,0.017700,0.180300,0.764400
0.036500,0.018650,0.180200,0.764650
0.037850,0.017450,0.180450,0.764250
0.038350,0.017200,0.180900,0.763550
0.038800,0.015650,0.180600,0.764950
0.038150,0.016400,0.180450,0.765000
0.038850,0.017150,0.179500,0.764500
0.038450,0.017800,0.179750,0.764000
0.037100,0.018100,0.178950,0.765850
0.036050,0.019400,0.178300,0.766250
0.037350,0.019200,0.177950,0.765500
0.037450,0.019400,0.176600,0.766550
0.038000,0.019400,0.176950,0.765650
0.037750,0.018850,0.177150,0.766250
0.039100,0.018300,0.177350,0.765250
0.039900,0.018500,0.175850,0.765750
0.039000,0.018900,0.176100,0.766000
0.038650,0.019100,0.175550,0.766700
0.038800,0.019050,0.175350,0.766800
0.039150,0.017850,0.175800,0.767200
0.039350,0.018350,0.175600,0.766700
0.038100,0.018950,0.176050,0.766900
0.037900,0.019000,0.176850,0.766250
0.038350,0.018400,0.176350,0.766900
0.037800,0.017900,0.176350,0.767950
0.036650,0.019300,0.174700,0.769350
0.036850,0.020050,0.174650,0.768450
0.037600,0.018700,0.175500,0.768200
0.037000,0.018250,0.175150,0.769600
0.036900,0.018200,0.175350,0.769550
0.038100,0.018100,0.175750,0.768050
0.037000,0.018650,0.175850,0.768500
0.038800,0.018300,0.175450,0.767450
0.038650,0.017450,0.175800,0.768100
0.037300,0.017900,0.175600,0.769200
0.037150,0.018000,0.175050,0.769800
0.036500,0.017650,0.175850,0.770000
0.037250,0.017350,0.175850,0.769550
0.037600,0.017650,0.176350,0.768400
0.037400,0.016250,0.177050,0.769300
0.036450,0.017350,0.176750,0.769450
0.035600,0.018550,0.176350,0.769500
0.035850,0.018400,0.176300,0.769450
0.037250,0.017100,0.176400,0.769250
0.037100,0.016850,0.176200,0.769850
0.038000,0.015750,0.176500,0.769750
0.036700,0.017250,0.176100,0.769950
0.036850,0.016950,0.177150,0.769050
0.035750,0.016750,0.177500,0.770000
0.036300,0.016300,0.178050,0.769350
0.036200,0.017500,0.178200,0.768100
0.035600,0.018150,0.178400,0.767850
0.034600,0.018600,0.179650,0.767150
0.035000,0.018950,0.178600,0.767450
0.036500,0.017150,0.180450,0.765900
0.036450,0.017400,0.180500,0.765650
0.036450,0.018000,0.179700,0.765850
0.035550,0.018100,0.180100,0.766250
0.036300,0.017000,0.180700,0.766000
0.037000,0.017100,0.179700,0.766200
0.037100,0.017350,0.179550,0.766000
0.037650,0.017750,0.179350,0.765250
0.036700,0.017100,0.179350,0.766850
0.035550,0.018200,0.179300,0.766950
0.035650,0.019150,0.179200,0.766000
0.036200,0.018000,0.179050,0.766750
0.036350,0.019200,0.177800,0.766650
0.036550,0.019700,0.177400,0.766350
0.037900,0.018300,0.177450,0.766350
0.038350,0.017800,0.177700,0.766150
0.038800,0.017300,0.177500,0.766400
0.038000,0.017900,0.178400,0.765700
0.038300,0.016650,0.179100,0.765950
0.037600,0.016700,0.179550,0.766150
0.035400,0.017450,0.180650,0.766500
0.036450,0.017250,0.180900,0.765400
0.036200,0.017150,0.180450,0.766200
0.035900,0.017250,0.179900,0.766950
0.035000,0.017150,0.180100,0.767750
0.035400,0.016700,0.180100,0.767800
0.036400,0.017400,0.179350,0.766850
0.036950,0.016800,0.179150,0.767100
0.037100,0.016700,0.179000,0.767200
0.035900,0.017450,0.177900,0.768750
0.036700,0.017950,0.176600,0.768750
0.036100,0.017750,0.176750,0.769400
0.036200,0.016250,0.177950,0.769600
0.036900,0.016200,0.176900,0.770000
0.037100,0.016300,0.176450,0.770150
0.037000,0.016700,0.176650,0.769650
0.036250,0.016350,0.176900,0.770500
0.035400,0.016500,0.176750,0.771350
0.036500,0.015500,0.176700,0.771300
0.036300,0.015950,0.176250,0.771500
0.036200,0.015250,0.176600,0.771950
0.034600,0.016300,0.177100,0.772000
0.034800,0.016700,0.176800,0.771700
0.034550,0.015650,0.177650,0.772150
0.034200,0.016400,0.178400,0.771000
0.033050,0.017100,0.178500,0.771350
0.033450,0.016300,0.179350,0.770900
0.033500,0.017050,0.178900,0.770550
0.033300,0.016600,0.179450,0.770650
0.034200,0.016350,0.180300,0.769150
0.034050,0.016700,0.180650,0.768600
0.033600,0.017950,0.179750,0.768700
0.034350,0.017350,0.179300,0.769000
0.033200,0.017900,0.180000,0.768900
0.032500,0.018000,0.180850,0.768650
0.032250,0.017750,0.181200,0.768800
0.033800,0.016650,0.181000,0.768550
0.033850,0.015650,0.182550,0.767950
0.034450,0.015000,0.182750,0.767800
0.033700,0.016650,0.181250,0.768400
0.033850,0.016800,0.181100,0.768250
0.034950,0.016400,0.181600,0.767050
0.035250,0.017100,0.180450,0.767200
0.034950,0.017450,0.181000,0.766600
0.034300,0.018150,0.180650,0.766900
0.034800,0.017400,0.180650,0.767150
0.033850,0.017800,0.181250,0.767100
