I,E,S,R
0.001000,0.000750,0.998250,0.000000
0.001000,0.001200,0.997550,0.000250
0.000900,0.001650,0.996950,0.000500
0.001000,0.002250,0.996000,0.000750
0.001450,0.002600,0.995000,0.000950
0.001900,0.003400,0.993450,0.001250
0.002500,0.003900,0.992150,0.001450
0.003150,0.004800,0.990150,0.001900
0.003700,0.006800,0.987200,0.002300
0.005050,0.008550,0.983600,0.002800
0.007200,0.010150,0.979250,0.003400
0.009100,0.014000,0.972700,0.004200
0.011650,0.019000,0.963950,0.005400
0.015100,0.024450,0.953600,0.006850
0.019400,0.030250,0.941500,0.008850
0.025450,0.037150,0.925900,0.011500
0.031650,0.047650,0.905200,0.015500
0.040950,0.059550,0.880050,0.019450
0.053650,0.072550,0.849450,0.024350
0.067350,0.091550,0.810050,0.031050
0.085850,0.111850,0.763050,0.039250
0.106950,0.136450,0.706650,0.049950
0.129400,0.162050,0.643850,0.064700
0.160350,0.186050,0.573350,0.080250
0.191400,0.211100,0.495950,0.101550
0.224700,0.225750,0.422450,0.127100
0.256150,0.231350,0.354450,0.158050
0.288300,0.232400,0.288300,0.191000
0.316900,0.226150,0.227650,0.229300
0.341250,0.214300,0.176200,0.268250
0.356950,0.193650,0.134800,0.314600
0.364700,0.169300,0.104450,0.361550
0.366000,0.147200,0.079700,0.407100
0.359050,0.123850,0.061650,0.455450
0.344250,0.104450,0.049300,0.502000
0.325900,0.085850,0.040250,0.548000
0.307400,0.069250,0.033100,0.590250
0.285800,0.056550,0.028000,0.629650
0.265700,0.044000,0.025200,0.665100
0.245850,0.035450,0.022900,0.695800
0.222600,0.028100,0.022400,0.726900
0.200750,0.024150,0.020950,0.754150
0.178650,0.020850,0.020450,0.780050
0.160050,0.017100,0.021350,0.801500
0.142400,0.014750,0.021300,0.821550
0.129300,0.012200,0.021900,0.836600
0.115550,0.010300,0.022800,0.851350
0.104000,0.008700,0.024550,0.862750
0.089950,0.008800,0.025350,0.875900
0.080400,0.007600,0.026400,0.885600
0.072100,0.006850,0.027750,0.893300
0.064250,0.006200,0.028900,0.900650
0.057000,0.006150,0.030900,0.905950
0.051100,0.005150,0.033650,0.910100
0.046100,0.004350,0.036350,0.913200
0.040050,0.003950,0.038350,0.917650
0.035500,0.004000,0.040750,0.919750
0.030750,0.003750,0.043350,0.922150
0.027600,0.003200,0.045800,0.923400
0.024150,0.002800,0.047850,0.925200
0.021200,0.002950,0.050000,0.925850
0.018850,0.003400,0.052350,0.925400
0.017700,0.002800,0.054800,0.924700
0.016750,0.002300,0.057850,0.923100
0.015200,0.001900,0.060700,0.922200
0.013550,0.001950,0.063000,0.921500
0.012300,0.001800,0.065550,0.920350
0.010900,0.001950,0.068150,0.919000
0.009850,0.001600,0.070950,0.917600
0.008700,0.001450,0.074500,0.915350
0.008150,0.001350,0.077650,0.912850
0.007100,0.001350,0.080850,0.910700
0.006400,0.001100,0.083800,0.908700
0.005450,0.001300,0.086900,0.906350
0.004900,0.001300,0.089700,0.904100
0.004750,0.001250,0.092450,0.901550
0.003800,0.001150,0.095800,0.899250
0.003500,0.001250,0.099200,0.896050
0.003300,0.001000,0.102050,0.893650
0.002850,0.001100,0.104700,0.891350
0.002650,0.000850,0.107850,0.888650
0.002400,0.000850,0.110300,0.886450
0.002400,0.000550,0.113450,0.883600
0.002150,0.000450,0.116200,0.881200
0.001800,0.000550,0.119000,0.878650
0.001850,0.000300,0.121750,0.876100
0.001650,0.000250,0.124000,0.874100
0.001450,0.000350,0.127150,0.871050
0.001450,0.000200,0.130100,0.868250
0.001250,0.000300,0.133200,0.865250
0.001200,0.000200,0.135950,0.862650
0.001050,0.000350,0.138350,0.860250
0.001000,0.000550,0.141200,0.857250
0.000950,0.000450,0.144550,0.854050
0.000900,0.000450,0.146600,0.852050
0.000900,0.000400,0.149100,0.849600
0.000950,0.000300,0.151650,0.847100
0.000850,0.000250,0.154500,0.844400
0.000750,0.000300,0.157100,0.841850
0.000850,0.000250,0.158850,0.840050
0.000850,0.000250,0.161550,0.837350
0.000850,0.000250,0.163800,0.835100
0.000850,0.000200,0.166050,0.832900
0.000850,0.000250,0.168300,0.830600
0.000900,0.000400,0.170750,0.827950
0.000900,0.000300,0.173400,0.825400
0.000900,0.000300,0.175850,0.822950
0.000900,0.000150,0.178600,0.820350
0.000900,0.000400,0.180950,0.817750
0.000850,0.000600,0.183200,0.815350
0.000750,0.000650,0.186250,0.812350
0.000650,0.000750,0.188300,0.810300
0.000800,0.000650,0.190350,0.808200
0.001050,0.000450,0.192550,0.805950
0.001100,0.000350,0.194300,0.804250
0.001150,0.000350,0.197000,0.801500
0.001150,0.000700,0.199150,0.799000
0.001200,0.000900,0.200750,0.797150
0.001250,0.000500,0.202850,0.795400
0.001200,0.000500,0.205450,0.792850
0.001250,0.000500,0.207800,0.790450
0.001250,0.000500,0.209950,0.788300
0.000950,0.000600,0.211850,0.786600
0.000950,0.000700,0.214400,0.783950
0.001150,0.000850,0.216100,0.781900
0.001150,0.000800,0.218050,0.780000
0.001150,0.000800,0.219700,0.778350
0.001300,0.000500,0.221600,0.776600
0.001300,0.000400,0.223700,0.774600
0.001250,0.000350,0.226000,0.772400
0.001350,0.000350,0.228200,0.770100
0.001200,0.000300,0.230350,0.768150
0.001000,0.000450,0.233050,0.765500
0.001050,0.000400,0.234950,0.763600
0.001100,0.000350,0.236900,0.761650
0.001100,0.000500,0.239500,0.758900
0.000950,0.000600,0.241050,0.757400
0.001000,0.000650,0.242850,0.755500
0.000950,0.000800,0.244900,0.753350
0.001200,0.000950,0.246100,0.751750
0.001500,0.000850,0.248350,0.749300
0.001550,0.000850,0.249550,0.748050
0.001800,0.000600,0.251300,0.746300
0.001500,0.000650,0.252900,0.744950
0.001650,0.000650,0.254700,0.743000
0.001650,0.000600,0.256200,0.741550
0.001750,0.000800,0.258000,0.739450
0.001850,0.001150,0.260150,0.736850
0.002000,0.000950,0.262150,0.734900
0.002150,0.001100,0.263800,0.732950
0.002200,0.001200,0.265500,0.731100
0.002250,0.001450,0.267200,0.729100
0.002450,0.001650,0.268500,0.727400
0.002300,0.001750,0.270200,0.725750
0.002250,0.001650,0.272450,0.723650
0.002450,0.001350,0.274200,0.722000
0.002600,0.001350,0.275900,0.720150
0.002800,0.001250,0.277250,0.718700
0.002650,0.001350,0.278800,0.717200
0.003050,0.001250,0.280450,0.715250
0.003050,0.001750,0.281450,0.713750
0.003050,0.002000,0.282850,0.712100
0.003400,0.001800,0.284600,0.710200
0.003550,0.002100,0.285550,0.708800
0.003700,0.002250,0.286750,0.707300
0.003900,0.002550,0.288050,0.705500
0.003550,0.003150,0.288900,0.704400
0.003800,0.003300,0.289700,0.703200
0.004100,0.003250,0.290650,0.702000
0.004700,0.003450,0.291150,0.700700
0.005400,0.003500,0.292150,0.698950
0.005550,0.003500,0.292850,0.698100
0.005550,0.003700,0.293400,0.697350
0.006000,0.003900,0.294650,0.695450
0.006350,0.003850,0.295750,0.694050
0.006350,0.004400,0.296950,0.692300
0.006350,0.004450,0.297700,0.691500
0.007000,0.004500,0.298400,0.690100
0.006850,0.005500,0.298400,0.689250
0.007150,0.005850,0.298800,0.688200
0.007700,0.006200,0.298550,0.687550
0.008650,0.006550,0.297450,0.687350
0.009450,0.007300,0.297050,0.686200
0.010650,0.007700,0.296650,0.685000
0.012100,0.007900,0.295550,0.684450
0.012950,0.007100,0.295700,0.684250
0.014000,0.007450,0.294450,0.684100
0.014500,0.008000,0.293450,0.684050
0.014700,0.009400,0.291550,0.684350
0.016450,0.009950,0.290050,0.683550
0.017300,0.011050,0.287850,0.683800
0.017300,0.012300,0.285450,0.684950
0.017900,0.012400,0.283750,0.685950
0.018150,0.013400,0.281200,0.687250
0.018500,0.013200,0.279700,0.688600
0.020550,0.012000,0.278900,0.688550
0.021450,0.013350,0.276100,0.689100
0.022250,0.014950,0.273300,0.689500
0.023500,0.016450,0.269700,0.690350
0.024900,0.017250,0.266350,0.691500
0.026150,0.018150,0.262750,0.692950
0.027200,0.019300,0.259250,0.694250
0.029800,0.018850,0.255750,0.695600
0.031900,0.019700,0.251050,0.697350
0.033200,0.020000,0.246900,0.699900
0.035250,0.021000,0.242900,0.700850
0.036050,0.020700,0.239200,0.704050
0.037150,0.021550,0.234650,0.706650
0.037250,0.022200,0.231200,0.709350
0.038000,0.022400,0.226600,0.713000
0.038800,0.023900,0.221750,0.715550
0.041100,0.023700,0.217050,0.718150
0.042750,0.023700,0.213350,0.720200
0.042600,0.024250,0.209850,0.723300
0.044600,0.023850,0.205750,0.725800
0.045400,0.023700,0.201950,0.728950
0.045050,0.024400,0.197700,0.732850
0.044750,0.024400,0.193650,0.737200
0.045950,0.024950,0.188550,0.740550
0.046900,0.024900,0.184500,0.743700
0.048000,0.023100,0.181950,0.746950
0.047650,0.023350,0.177600,0.751400
0.047150,0.023700,0.174000,0.755150
0.048600,0.023200,0.170850,0.757350
0.048750,0.024100,0.166100,0.761050
0.048000,0.022850,0.164100,0.765050
0.048050,0.022600,0.161300,0.768050
0.048500,0.021200,0.160050,0.770250
0.048100,0.019450,0.159600,0.772850
0.046850,0.018650,0.158500,0.776000
0.044900,0.019900,0.155550,0.779650
0.044250,0.019800,0.153600,0.782350
0.042850,0.020250,0.152350,0.784550
0.042150,0.019650,0.150700,0.787500
0.041900,0.018700,0.149700,0.789700
0.041350,0.018500,0.148200,0.791950
0.040500,0.018750,0.146500,0.794250
0.039500,0.017850,0.146300,0.796350
0.037800,0.017150,0.145950,0.799100
0.036700,0.016750,0.145800,0.800750
0.037200,0.015750,0.145250,0.801800
0.035850,0.015050,0.146000,0.803100
0.035050,0.014900,0.145950,0.804100
0.034350,0.014700,0.145300,0.805650
0.033550,0.014350,0.145400,0.806700
0.032000,0.014150,0.146150,0.807700
0.032550,0.014150,0.146200,0.807100
0.031450,0.013700,0.147150,0.807700
0.030000,0.013150,0.147100,0.809750
0.029900,0.011800,0.147850,0.810450
0.028900,0.011500,0.149000,0.810600
0.027350,0.012050,0.149850,0.810750
0.027400,0.011800,0.150300,0.810500
0.027500,0.011100,0.151850,0.809550
0.027250,0.011300,0.152600,0.808850
0.027350,0.010450,0.153950,0.808250
0.026150,0.010350,0.154450,0.809050
0.025500,0.010200,0.155950,0.808350
0.024400,0.010650,0.156600,0.808350
0.024200,0.010800,0.158200,0.806800
0.023950,0.010700,0.159100,0.806250
0.023950,0.010150,0.160850,0.805050
0.024300,0.009450,0.162100,0.804150
0.023100,0.010200,0.162300,0.804400
0.022600,0.010750,0.163850,0.802800
0.023850,0.010800,0.165250,0.800100
0.024350,0.009650,0.166250,0.799750
0.024250,0.010200,0.168200,0.797350
0.023800,0.009550,0.170200,0.796450
0.023650,0.009750,0.172100,0.794500
0.023100,0.009750,0.173000,0.794150
0.022300,0.011000,0.172150,0.794550
0.022500,0.010750,0.173500,0.793250
0.023050,0.010350,0.173650,0.792950
0.023250,0.010500,0.174850,0.791400
0.023400,0.010600,0.176000,0.790000
0.022800,0.011050,0.177300,0.788850
0.022150,0.011250,0.179750,0.786850
0.021300,0.012200,0.180500,0.786000
0.022350,0.011300,0.181950,0.784400
0.022050,0.011700,0.182850,0.783400
0.022350,0.010300,0.185200,0.782150
0.021650,0.010800,0.186800,0.780750
0.021250,0.010900,0.187750,0.780100
0.021800,0.010700,0.188750,0.778750
0.021250,0.011150,0.189450,0.778150
0.021100,0.012200,0.189950,0.776750
0.022400,0.011450,0.190350,0.775800
0.022900,0.011550,0.191250,0.774300
0.023250,0.010350,0.192550,0.773850
0.023100,0.010950,0.191700,0.774250
0.023450,0.011200,0.192650,0.772700
0.023750,0.011650,0.193050,0.771550
0.024200,0.011050,0.194250,0.770500
0.022950,0.012400,0.194900,0.769750
0.022900,0.011950,0.196400,0.768750
0.023150,0.011750,0.196650,0.768450
0.023150,0.012550,0.197000,0.767300
0.023600,0.011350,0.199650,0.765400
0.023200,0.012600,0.200800,0.763400
0.024400,0.011900,0.201850,0.761850
0.024450,0.012250,0.202350,0.760950
0.024700,0.012050,0.202850,0.760400
0.024650,0.011600,0.203250,0.760500
0.024600,0.012000,0.203600,0.759800
0.024900,0.011350,0.204150,0.759600
0.024300,0.012050,0.204400,0.759250
0.024050,0.012850,0.205100,0.758000
0.023200,0.012650,0.207000,0.757150
0.023550,0.013350,0.207300,0.755800
0.022700,0.013600,0.207450,0.756250
0.023100,0.013900,0.208200,0.754800
0.024100,0.013850,0.208700,0.753350
0.024550,0.015500,0.207450,0.752500
0.025250,0.014350,0.208450,0.751950
0.025150,0.014900,0.208400,0.751550
0.025750,0.014850,0.208500,0.750900
0.026550,0.015200,0.208200,0.750050
0.027200,0.016600,0.206700,0.749500
0.028250,0.016250,0.207000,0.748500
0.028800,0.016650,0.206900,0.747650
0.029900,0.016450,0.207100,0.746550
0.030700,0.016650,0.206400,0.746250
0.031850,0.016450,0.205750,0.745950
0.031650,0.018700,0.203450,0.746200
0.033600,0.017850,0.202100,0.746450
0.035250,0.017250,0.202200,0.745300
0.034500,0.017850,0.201700,0.745950
0.033350,0.018500,0.200900,0.747250
0.035100,0.018200,0.200500,0.746200
0.034150,0.019900,0.199700,0.746250
0.034950,0.019950,0.198500,0.746600
0.035000,0.020350,0.198000,0.746650
0.035300,0.020600,0.196650,0.747450
0.036000,0.020650,0.195000,0.748350
0.037600,0.019600,0.194250,0.748550
0.037700,0.020050,0.193250,0.749000
0.037000,0.020700,0.192250,0.750050
0.038850,0.020650,0.189000,0.751500
0.039850,0.021600,0.186500,0.752050
0.040000,0.020150,0.186850,0.753000
0.040850,0.019300,0.186850,0.753000
0.040600,0.018550,0.186200,0.754650
0.041200,0.019300,0.183800,0.755700
0.041100,0.019750,0.182250,0.756900
0.040300,0.020400,0.181200,0.758100
0.040600,0.019700,0.181750,0.757950
0.040650,0.020600,0.179650,0.759100
0.040850,0.019450,0.179350,0.760350
0.040650,0.018550,0.178800,0.762000
0.040800,0.018700,0.178400,0.762100
0.040650,0.017750,0.178800,0.762800
0.039400,0.017950,0.178250,0.764400
0.039650,0.018450,0.176400,0.765500
0.039650,0.018650,0.174450,0.767250
0.040700,0.018200,0.174450,0.766650
0.039950,0.017850,0.174200,0.768000
0.038850,0.017550,0.174850,0.768750
0.038500,0.016950,0.174850,0.769700
0.038550,0.016700,0.175500,0.769250
0.038650,0.016350,0.175550,0.769450
0.038700,0.015800,0.176650,0.768850
0.038800,0.015750,0.176150,0.769300
0.038300,0.016850,0.175850,0.769000
0.038150,0.017200,0.175450,0.769200
0.037400,0.017050,0.175450,0.770100
0.036150,0.017750,0.175150,0.770950
0.035450,0.017850,0.174950,0.771750
0.035450,0.017700,0.175100,0.771750
0.036350,0.017050,0.175750,0.770850
0.036850,0.016300,0.176300,0.770550
0.036400,0.016350,0.176150,0.771100
0.036050,0.015650,0.176700,0.771600
0.034600,0.016300,0.176700,0.772400
0.035300,0.015650,0.177650,0.771400
0.034700,0.016150,0.176800,0.772350
0.034550,0.016300,0.176350,0.772800
0.034700,0.016650,0.176100,0.772550
0.035200,0.015900,0.177350,0.771550
0.034600,0.015000,0.179650,0.770750
0.033900,0.016450,0.179750,0.769900
0.033700,0.017500,0.179300,0.769500
0.033050,0.017900,0.179500,0.769550
0.033200,0.017150,0.180450,0.769200
0.033750,0.016450,0.180600,0.769200
0.033100,0.015550,0.182950,0.768400
0.032000,0.015300,0.184050,0.768650
0.032550,0.015200,0.184150,0.768100
0.033500,0.014950,0.185350,0.766200
0.032750,0.015050,0.185850,0.766350
0.031950,0.016050,0.185550,0.766450
0.031750,0.015900,0.185450,0.766900
0.031900,0.015550,0.186050,0.766500
0.032450,0.016000,0.185900,0.765650
0.033300,0.015100,0.186800,0.764800
0.032950,0.015600,0.186650,0.764800
0.033400,0.014400,0.188050,0.764150
0.032950,0.015050,0.189500,0.762500
0.032700,0.016500,0.188800,0.762000
0.033350,0.016900,0.188750,0.761000
0.034100,0.017150,0.188250,0.760500
0.034200,0.016950,0.187850,0.761000
0.033350,0.016650,0.188550,0.761450
0.034500,0.015350,0.188150,0.762000
0.034400,0.016950,0.188100,0.760550
0.033700,0.017000,0.188300,0.761000
0.033800,0.017050,0.189150,0.760000
0.033900,0.017150,0.189650,0.759300
0.033700,0.016750,0.189500,0.760050
0.033100,0.017450,0.188900,0.760550
0.033500,0.017850,0.188800,0.759850
0.034350,0.016850,0.189550,0.759250
0.035400,0.016900,0.188400,0.759300
0.035450,0.017450,0.187900,0.759200
0.035850,0.017200,0.187300,0.759650
0.035000,0.017450,0.188450,0.759100
0.035900,0.017600,0.187300,0.759200
0.034900,0.017650,0.186850,0.760600
0.035200,0.017650,0.186900,0.760250
0.034200,0.017050,0.187950,0.760800
0.034000,0.017550,0.187550,0.760900
0.034600,0.016350,0.186900,0.762150
0.034650,0.016800,0.185550,0.763000
0.034100,0.016950,0.186250,0.762700
0.034450,0.016800,0.186500,0.762250
0.034700,0.016300,0.187550,0.761450
0.034200,0.016650,0.188350,0.760800
0.033850,0.017150,0.188100,0.760900
0.034450,0.016800,0.187950,0.760800
0.033900,0.016700,0.188850,0.760550
0.033700,0.016100,0.189750,0.760450
0.033900,0.017000,0.189650,0.759450
0.033850,0.017850,0.188750,0.759550
0.034100,0.017700,0.188250,0.759950
0.035250,0.017400,0.187600,0.759750
0.035950,0.016650,0.187750,0.759650
0.036600,0.016800,0.186900,0.759700
0.036350,0.016750,0.186850,0.760050
0.035450,0.016450,0.185750,0.762350
0.033800,0.016950,0.185200,0.764050
0.033450,0.016800,0.185650,0.764100
0.033950,0.017350,0.185550,0.763150
0.034050,0.016850,0.185550,0.763550
0.034400,0.017350,0.185000,0.763250
0.035300,0.016550,0.185150,0.763000
0.035050,0.016750,0.184150,0.764050
0.035850,0.016050,0.184800,0.763300
0.035650,0.017000,0.184500,0.762850
0.035050,0.016500,0.183700,0.764750
0.035300,0.016950,0.183300,0.764450
0.034900,0.017450,0.181600,0.766050
0.034950,0.018300,0.181250,0.765500
0.034750,0.017450,0.181300,0.766500
0.035100,0.016750,0.181050,0.767100
0.034900,0.017250,0.180700,0.767150
0.034350,0.017600,0.179800,0.768250
0.035100,0.017550,0.180050,0.767300
0.034400,0.017550,0.180700,0.767350
0.034400,0.017300,0.181150,0.767150
0.035250,0.017400,0.180300,0.767050
0.034700,0.018250,0.179150,0.767900
0.035300,0.017450,0.178900,0.768350
0.036050,0.017950,0.179100,0.766900
0.035850,0.018700,0.177450,0.768000
0.035100,0.019850,0.176350,0.768700
0.035800,0.019700,0.174950,0.769550
0.035700,0.020300,0.174000,0.770000
0.036750,0.019350,0.173450,0.770450
0.038250,0.017500,0.173550,0.770700
0.039150,0.016500,0.174650,0.769700
0.037450,0.017950,0.174200,0.770400
0.038000,0.017950,0.174300,0.769750
0.037850,0.017350,0.174000,0.770800
0.036600,0.017150,0.173700,0.772550
0.036750,0.017650,0.173300,0.772300
0.037300,0.016600,0.173450,0.772650
0.037050,0.015700,0.174450,0.772800
0.036300,0.015950,0.174800,0.772950
0.035450,0.016650,0.174600,0.773300
0.034750,0.016650,0.175500,0.773100
0.035250,0.015900,0.175900,0.772950
0.034500,0.015200,0.176800,0.773500
0.033350,0.017050,0.176350,0.773250
0.033700,0.016900,0.175750,0.773650
0.032700,0.016800,0.177400,0.773100
0.032800,0.016550,0.177850,0.772800
0.033000,0.016600,0.178300,0.772100
0.032850,0.016500,0.178050,0.772600
0.032950,0.016750,0.178000,0.772300
0.033250,0.016850,0.177550,0.772350
0.033850,0.016350,0.178300,0.771500
0.034400,0.016050,0.179050,0.770500
0.034600,0.016100,0.178500,0.770800
0.034950,0.015500,0.177600,0.771950
0.034250,0.016100,0.177100,0.772550
0.035450,0.015350,0.178400,0.770800
0.035800,0.016100,0.178250,0.769850
0.036550,0.015650,0.178300,0.769500
0.036150,0.017250,0.176900,0.769700
0.035450,0.016650,0.177300,0.770600
0.035250,0.016850,0.176600,0.771300
0.035650,0.016400,0.177300,0.770650
0.034000,0.016950,0.177200,0.771850
0.033950,0.016750,0.178200,0.771100
0.033450,0.017250,0.177700,0.771600
0.033900,0.017000,0.177200,0.771900
0.035000,0.015650,0.177700,0.771650
0.034400,0.016550,0.177100,0.771950
0.035300,0.016600,0.177450,0.770650
0.034800,0.015900,0.178750,0.770550
0.035250,0.015200,0.180100,0.769450
0.033850,0.015850,0.179600,0.770700
0.033050,0.017250,0.179700,0.770000
0.033800,0.016400,0.180450,0.769350
0.033650,0.016500,0.178750,0.771100
0.032850,0.016200,0.180000,0.770950
0.032500,0.015750,0.180350,0.771400
0.034450,0.014050,0.180750,0.770750
0.034800,0.014350,0.181000,0.769850
0.034400,0.015150,0.181050,0.769400
0.033600,0.015350,0.181600,0.769450
0.034850,0.015200,0.182050,0.767900
0.035350,0.015100,0.182450,0.767100
0.034750,0.015400,0.182800,0.767050
0.033350,0.016300,0.182200,0.768150
0.033950,0.015250,0.182900,0.767900
0.032600,0.015600,0.183900,0.767900
0.033250,0.014100,0.186000,0.766650
0.033050,0.013950,0.186300,0.766700
0.032750,0.014750,0.186550,0.765950
0.031700,0.014700,0.187150,0.766450
0.031050,0.015350,0.187700,0.765900
0.031450,0.015300,0.188500,0.764750
0.031750,0.015950,0.188150,0.764150
0.031750,0.015900,0.188750,0.763600
0.031250,0.016450,0.188550,0.763750
0.032250,0.015900,0.189200,0.762650
0.031700,0.015800,0.189700,0.762800
0.031550,0.015050,0.189850,0.763550
0.031800,0.015350,0.189650,0.763200
0.031800,0.014550,0.191000,0.762650
0.032050,0.015650,0.190800,0.761500
0.031950,0.016250,0.190500,0.761300
0.031550,0.016750,0.189100,0.762600
0.031200,0.016800,0.188900,0.763100
0.032050,0.016950,0.189300,0.761700
0.032100,0.017050,0.188900,0.761950
0.033200,0.016350,0.188800,0.761650
0.033050,0.017550,0.189200,0.760200
0.034050,0.016700,0.189650,0.759600
0.034150,0.017050,0.190050,0.758750
0.034850,0.016650,0.190800,0.757700
0.034450,0.017000,0.190700,0.757850
0.034250,0.017000,0.190150,0.758600
0.033450,0.017250,0.190300,0.759000
0.032900,0.017100,0.191450,0.758550
0.034050,0.016750,0.191400,0.757800
0.033200,0.017900,0.191900,0.757000
0.034500,0.017400,0.192500,0.755600
0.035700,0.017500,0.191150,0.755650
0.035650,0.017000,0.191500,0.755850
0.035800,0.017600,0.190650,0.755950
0.036050,0.017500,0.190150,0.756300
0.035650,0.017150,0.190400,0.756800
0.035600,0.017050,0.189900,0.757450
0.035650,0.018450,0.188000,0.757900
0.035400,0.018100,0.189250,0.757250
0.035800,0.018950,0.188450,0.756800
0.036500,0.018250,0.187400,0.757850
0.036050,0.017300,0.188150,0.758500
0.035600,0.017050,0.188150,0.759200
0.036200,0.017600,0.187550,0.758650
0.036700,0.017550,0.187600,0.758150
0.037400,0.017600,0.185800,0.759200
0.037550,0.018900,0.184350,0.759200
0.036650,0.019400,0.184350,0.759600
0.035900,0.020300,0.182800,0.761000
0.035700,0.020900,0.182000,0.761400
0.036750,0.019250,0.181050,0.762950
0.037200,0.018100,0.181800,0.762900
0.037300,0.018250,0.181100,0.763350
0.038150,0.017900,0.180750,0.763200
0.037150,0.018450,0.180000,0.764400
0.037800,0.018500,0.179350,0.764350
0.037350,0.018500,0.178950,0.765200
0.037500,0.017900,0.179450,0.765150
0.037550,0.017700,0.179800,0.764950
0.036700,0.018750,0.179600,0.764950
0.037900,0.018050,0.179200,0.764850
0.038000,0.018800,0.178150,0.765050
0.038500,0.018550,0.177700,0.765250
0.039250,0.018750,0.177200,0.764800
0.039800,0.018950,0.177150,0.764100
0.039900,0.018400,0.176350,0.765350
0.039300,0.018400,0.176450,0.765850
0.040100,0.017900,0.175800,0.766200
0.038850,0.018550,0.175550,0.767050
0.038200,0.018850,0.175450,0.767500
0.037800,0.018250,0.175700,0.768250
0.037100,0.018850,0.174600,0.769450
0.037550,0.018100,0.173950,0.770400
0.036900,0.019400,0.173550,0.770150
0.035950,0.019150,0.173300,0.771600
0.036200,0.018400,0.174200,0.771200
0.035850,0.019000,0.174150,0.771000
0.036200,0.018850,0.175150,0.769800
0.036150,0.017250,0.176600,0.770000
0.035200,0.017550,0.177250,0.770000
0.035200,0.017700,0.178350,0.768750
0.035150,0.017650,0.179850,0.767350
0.035950,0.017650,0.179150,0.767250
0.036550,0.016500,0.180450,0.766500
0.036400,0.017000,0.180100,0.766500
0.037100,0.016500,0.180300,0.766100
0.037000,0.017700,0.179150,0.766150
0.037350,0.018450,0.179450,0.764750
0.038250,0.018050,0.179550,0.764150
0.038000,0.017950,0.179500,0.764550
0.037900,0.017750,0.179050,0.765300
0.038900,0.017800,0.179450,0.763850
0.037700,0.019300,0.178850,0.764150
0.038550,0.018500,0.179500,0.763450
0.038850,0.018800,0.178600,0.763750
0.039650,0.017600,0.178950,0.763800
0.037750,0.018900,0.179100,0.764250
0.037700,0.019150,0.178550,0.764600
0.036600,0.018800,0.177750,0.766850
0.037350,0.017250,0.177900,0.767500
0.037150,0.017150,0.178350,0.767350
0.036850,0.017450,0.178000,0.767700
0.035650,0.016950,0.178150,0.769250
0.035400,0.016950,0.179150,0.768500
0.034850,0.017050,0.179150,0.768950
0.035000,0.017350,0.179300,0.768350
0.034650,0.017400,0.179850,0.768100
0.035000,0.017250,0.180150,0.767600
0.035800,0.017000,0.180100,0.767100
0.035200,0.017200,0.179900,0.767700
0.034700,0.016550,0.180600,0.768150
0.032850,0.016950,0.181700,0.768500
0.033800,0.016500,0.182200,0.767500
0.033250,0.017000,0.182350,0.767400
0.033100,0.016700,0.182550,0.767650
0.034250,0.016250,0.182800,0.766700
0.033750,0.016800,0.182450,0.767000
0.033850,0.017600,0.182100,0.766450
0.034450,0.016650,0.182600,0.766300
0.035200,0.016900,0.182750,0.765150
0.035450,0.017100,0.182500,0.764950
0.036000,0.016850,0.182850,0.764300
0.036050,0.016300,0.183000,0.764650
0.036750,0.015750,0.184400,0.763100
0.036150,0.016900,0.183550,0.763400
0.036550,0.016850,0.184000,0.762600
0.036850,0.017150,0.183550,0.762450
0.036350,0.017900,0.182150,0.763600
0.035750,0.018400,0.181050,0.764800
0.037150,0.017750,0.180300,0.764800
0.037350,0.017050,0.180700,0.764900
0.035850,0.018250,0.180550,0.765350
0.037300,0.017450,0.179800,0.765450
0.037050,0.017600,0.180700,0.764650
0.037050,0.016400,0.181450,0.765100
0.037050,0.016150,0.180550,0.766250
0.036200,0.017400,0.180300,0.766100
0.036550,0.017450,0.180150,0.765850
0.036100,0.018650,0.180400,0.764850
0.037250,0.018650,0.179500,0.764600
0.037450,0.018050,0.179100,0.765400
0.037650,0.017650,0.178950,0.765750
0.037100,0.017850,0.178500,0.766550
0.036050,0.019600,0.177700,0.766650
0.036800,0.018900,0.177600,0.766700
0.037000,0.017700,0.178850,0.766450
0.037400,0.017350,0.178350,0.766900
0.036000,0.017850,0.178200,0.767950
0.035100,0.018500,0.178300,0.768100
0.034350,0.018600,0.178700,0.768350
0.034550,0.016950,0.179750,0.768750
0.034400,0.017350,0.179500,0.768750
0.033950,0.017350,0.179150,0.769550
0.034050,0.016950,0.179450,0.769550
0.034600,0.017450,0.179050,0.768900
0.034300,0.018550,0.178100,0.769050
0.033400,0.018950,0.177800,0.769850
0.034100,0.017650,0.177400,0.770850
0.034100,0.018650,0.176800,0.770450
0.035400,0.018800,0.176050,0.769750
0.035800,0.018700,0.176650,0.768850
0.035900,0.018950,0.176750,0.768400
0.036350,0.017400,0.176700,0.769550
0.036700,0.016550,0.177250,0.769500
0.037700,0.014950,0.178200,0.769150
0.036200,0.016250,0.178000,0.769550
0.035650,0.016800,0.177400,0.770150
0.035700,0.015650,0.178400,0.770250
0.035450,0.014600,0.179150,0.770800
0.034550,0.016050,0.178150,0.771250
0.034350,0.016100,0.178200,0.771350
0.035850,0.014600,0.177800,0.771750
0.034350,0.015450,0.177550,0.772650
0.033900,0.015700,0.178400,0.772000
0.033200,0.016350,0.178650,0.771800
0.033550,0.016750,0.179350,0.770350
0.034050,0.016750,0.178800,0.770400
0.033950,0.017300,0.179000,0.769750
0.035050,0.017000,0.177950,0.770000
0.035300,0.016300,0.178250,0.770150
0.035100,0.016250,0.178500,0.770150
0.034500,0.016450,0.177900,0.771150
0.033750,0.016400,0.178750,0.771100
0.033550,0.016100,0.179950,0.770400
0.034300,0.016350,0.180550,0.768800
0.034350,0.016600,0.179550,0.769500
0.033550,0.016350,0.180050,0.770050
0.033200,0.017250,0.179550,0.770000
0.033750,0.017250,0.179650,0.769350
0.033900,0.017950,0.179400,0.768750
0.034550,0.017800,0.179650,0.768000
0.035200,0.018400,0.178600,0.767800
0.034500,0.018350,0.178950,0.768200
0.036350,0.016900,0.179950,0.766800
0.036350,0.017150,0.179900,0.766600
0.036750,0.016300,0.180750,0.766200
0.036700,0.017000,0.180350,0.765950
0.036800,0.016250,0.180550,0.766400
0.035550,0.017250,0.179100,0.768100
0.035300,0.018000,0.179500,0.767200
0.035200,0.018350,0.179200,0.767250
0.034350,0.019000,0.178600,0.768050
