I,E,S,R
0.001000,0.000700,0.998300,0.000000
0.001100,0.001500,0.997300,0.000100
0.001300,0.001850,0.996500,0.000350
0.001850,0.002300,0.995350,0.000500
0.002150,0.003650,0.993500,0.000700
0.002950,0.004100,0.991950,0.001000
0.003750,0.005550,0.989250,0.001450
0.005000,0.008000,0.985100,0.001900
0.006600,0.010750,0.980400,0.002250
0.008100,0.013500,0.975200,0.003200
0.010950,0.017400,0.967650,0.004000
0.013900,0.023450,0.957300,0.005350
0.018650,0.028150,0.945500,0.007700
0.024700,0.033400,0.931500,0.010400
0.030400,0.045400,0.910600,0.013600
0.038500,0.057750,0.886400,0.017350
0.048800,0.071050,0.857400,0.022750
0.064250,0.088450,0.819000,0.028300
0.080850,0.109200,0.772950,0.037000
0.100700,0.129800,0.721750,0.047750
0.123800,0.153950,0.661100,0.061150
0.149400,0.177150,0.595600,0.077850
0.180650,0.199750,0.522500,0.097100
0.213000,0.218800,0.447000,0.121200
0.247100,0.228750,0.374050,0.150100
0.278650,0.234950,0.304550,0.181850
0.307600,0.231550,0.241450,0.219400
0.329000,0.220150,0.187800,0.263050
0.349950,0.200750,0.143650,0.305650
0.359750,0.178950,0.108550,0.352750
0.361450,0.153450,0.083250,0.401850
0.356800,0.131650,0.063550,0.448000
0.344400,0.110400,0.050900,0.494300
0.330700,0.091250,0.039900,0.538150
0.314550,0.074350,0.032600,0.578500
0.292800,0.060000,0.027400,0.619800
0.269050,0.046650,0.024500,0.659800
0.249250,0.037700,0.021350,0.691700
0.229800,0.028600,0.021100,0.720500
0.206650,0.023100,0.020100,0.750150
0.185600,0.018800,0.020250,0.775350
0.164550,0.016750,0.020150,0.798550
0.147350,0.014750,0.020450,0.817450
0.130500,0.012000,0.021400,0.836100
0.118000,0.010100,0.022050,0.849850
0.103000,0.008850,0.023950,0.864200
0.091650,0.008350,0.024750,0.875250
0.082400,0.007050,0.026400,0.884150
0.072800,0.006600,0.028400,0.892200
0.064550,0.005900,0.029850,0.899700
0.058800,0.005100,0.031850,0.904250
0.053100,0.004800,0.033450,0.908650
0.046000,0.004400,0.034900,0.914700
0.041500,0.004350,0.036750,0.917400
0.037300,0.004400,0.039050,0.919250
0.032550,0.004250,0.040800,0.922400
0.029750,0.003450,0.043600,0.923200
0.026750,0.003900,0.045300,0.924050
0.023950,0.003600,0.048150,0.924300
0.021050,0.003350,0.050350,0.925250
0.019100,0.003500,0.052100,0.925300
0.016750,0.003400,0.055150,0.924700
0.015300,0.002800,0.058050,0.923850
0.014500,0.002750,0.061200,0.921550
0.012950,0.002250,0.064350,0.920450
0.011050,0.002550,0.066050,0.920350
0.009950,0.002450,0.068350,0.919250
0.008950,0.002600,0.071250,0.917200
0.008250,0.002400,0.074350,0.915000
0.007850,0.002100,0.076700,0.913350
0.007500,0.001650,0.080200,0.910650
0.006450,0.001150,0.083150,0.909250
0.005550,0.001250,0.085600,0.907600
0.005050,0.001050,0.088450,0.905450
0.004650,0.000900,0.090950,0.903500
0.004200,0.000950,0.093700,0.901150
0.004000,0.001000,0.096850,0.898150
0.003750,0.000950,0.099450,0.895850
0.003650,0.000950,0.103100,0.892300
0.003350,0.001000,0.105500,0.890150
0.002900,0.001200,0.108650,0.887250
0.003150,0.001050,0.111350,0.884450
0.003300,0.000950,0.114100,0.881650
0.003150,0.000850,0.116650,0.879350
0.002900,0.000950,0.119750,0.876400
0.002500,0.000950,0.122200,0.874350
0.002350,0.001000,0.124650,0.872000
0.002500,0.000750,0.126900,0.869850
0.002150,0.000900,0.128850,0.868100
0.001850,0.000850,0.131400,0.865900
0.002000,0.000700,0.133850,0.863450
0.001800,0.000700,0.136550,0.860950
0.001650,0.000700,0.138900,0.858750
0.001550,0.000550,0.141550,0.856350
0.001650,0.000550,0.144000,0.853800
0.001450,0.000700,0.146300,0.851550
0.001450,0.000550,0.148950,0.849050
0.001450,0.000500,0.151950,0.846100
0.001350,0.000500,0.154750,0.843400
0.001400,0.000500,0.156950,0.841150
0.001250,0.000700,0.159300,0.838750
0.001300,0.000450,0.161550,0.836700
0.001200,0.000400,0.164350,0.834050
0.001200,0.000250,0.166750,0.831800
0.001050,0.000300,0.169000,0.829650
0.001050,0.000150,0.171700,0.827100
0.000850,0.000150,0.174100,0.824900
0.000700,0.000250,0.176300,0.822750
0.000750,0.000300,0.178700,0.820250
0.000700,0.000200,0.180550,0.818550
0.000600,0.000300,0.182400,0.816700
0.000600,0.000250,0.184550,0.814600
0.000650,0.000350,0.187250,0.811750
0.000700,0.000300,0.189650,0.809350
0.000650,0.000400,0.191800,0.807150
0.000700,0.000400,0.194200,0.804700
0.000550,0.000500,0.196750,0.802200
0.000600,0.000450,0.198800,0.800150
0.000600,0.000350,0.202050,0.797000
0.000750,0.000250,0.204000,0.795000
0.000750,0.000350,0.206250,0.792650
0.000750,0.000350,0.208500,0.790400
0.000750,0.000350,0.210900,0.788000
0.000750,0.000300,0.212750,0.786200
0.000700,0.000300,0.214800,0.784200
0.000650,0.000200,0.216600,0.782550
0.000700,0.000300,0.218650,0.780350
0.000600,0.000400,0.220650,0.778350
0.000700,0.000400,0.222600,0.776300
0.000750,0.000400,0.224750,0.774100
0.000700,0.000300,0.226300,0.772700
0.000700,0.000400,0.227900,0.771000
0.000850,0.000350,0.230350,0.768450
0.000850,0.000500,0.232550,0.766100
0.001000,0.000350,0.234250,0.764400
0.001000,0.000400,0.236550,0.762050
0.000950,0.000450,0.238750,0.759850
0.000900,0.000300,0.240650,0.758150
0.000850,0.000300,0.242650,0.756200
0.001050,0.000350,0.244600,0.754000
0.001050,0.000350,0.246750,0.751850
0.000850,0.000700,0.248850,0.749600
0.001100,0.000500,0.250850,0.747550
0.001250,0.000400,0.252600,0.745750
0.001300,0.000800,0.254450,0.743450
0.001400,0.001100,0.256000,0.741500
0.001450,0.001300,0.258200,0.739050
0.001950,0.001050,0.259750,0.737250
0.002050,0.001000,0.261600,0.735350
0.001800,0.001250,0.263350,0.733600
0.002150,0.001150,0.265150,0.731550
0.002100,0.001300,0.266750,0.729850
0.002300,0.001200,0.268500,0.728000
0.002000,0.001400,0.270400,0.726200
0.002250,0.001200,0.272300,0.724250
0.002500,0.001450,0.273900,0.722150
0.002550,0.001650,0.275150,0.720650
0.002850,0.001600,0.276650,0.718900
0.003100,0.001850,0.278200,0.716850
0.003200,0.001900,0.279300,0.715600
0.003350,0.001800,0.281050,0.713800
0.003450,0.002000,0.283450,0.711100
0.003450,0.002700,0.284750,0.709100
0.003750,0.002850,0.285450,0.707950
0.004100,0.002650,0.286700,0.706550
0.004350,0.002650,0.287900,0.705100
0.004900,0.003000,0.288350,0.703750
0.004800,0.003300,0.289000,0.702900
0.004700,0.003750,0.289900,0.701650
0.005300,0.003600,0.291250,0.699850
0.005900,0.003500,0.291600,0.699000
0.006050,0.004400,0.292050,0.697500
0.007150,0.004100,0.292800,0.695950
0.007400,0.004800,0.292650,0.695150
0.007800,0.005600,0.292700,0.693900
0.009050,0.005800,0.292250,0.692900
0.010050,0.006300,0.292050,0.691600
0.009700,0.006500,0.292300,0.691500
0.010600,0.006550,0.292000,0.690850
0.011500,0.007500,0.290700,0.690300
0.012150,0.007750,0.290000,0.690100
0.011750,0.008750,0.289050,0.690450
0.012900,0.008550,0.289050,0.689500
0.013750,0.008550,0.288100,0.689600
0.014350,0.009150,0.286950,0.689550
0.015450,0.010000,0.285350,0.689200
0.016500,0.010900,0.283450,0.689150
0.017050,0.011600,0.281300,0.690050
0.017200,0.012100,0.279750,0.690950
0.019000,0.012500,0.277550,0.690950
0.020050,0.013550,0.274400,0.692000
0.021450,0.013550,0.272000,0.693000
0.022800,0.014000,0.269300,0.693900
0.024200,0.014750,0.266800,0.694250
0.025300,0.014950,0.264550,0.695200
0.026650,0.015450,0.261650,0.696250
0.028050,0.016150,0.258500,0.697300
0.028400,0.017850,0.255000,0.698750
0.029750,0.018650,0.251000,0.700600
0.031300,0.020000,0.246750,0.701950
0.032450,0.021150,0.242550,0.703850
0.033950,0.021250,0.239550,0.705250
0.035900,0.020500,0.235800,0.707800
0.037300,0.021200,0.231850,0.709650
0.038500,0.020900,0.228500,0.712100
0.039400,0.022000,0.223900,0.714700
0.039200,0.021300,0.221200,0.718300
0.040450,0.022500,0.216650,0.720400
0.040050,0.024000,0.212050,0.723900
0.040700,0.024450,0.207050,0.727800
0.043150,0.023850,0.202550,0.730450
0.043650,0.023750,0.199300,0.733300
0.044200,0.023500,0.195700,0.736600
0.044800,0.022300,0.193600,0.739300
0.043700,0.023500,0.189850,0.742950
0.046000,0.021800,0.187600,0.744600
0.046750,0.022000,0.183650,0.747600
0.046800,0.021000,0.180700,0.751500
0.045950,0.021900,0.176200,0.755950
0.046200,0.021850,0.173300,0.758650
0.046450,0.021800,0.170900,0.760850
0.045500,0.023350,0.167400,0.763750
0.045800,0.022500,0.164850,0.766850
0.045250,0.021050,0.163400,0.770300
0.043900,0.021050,0.161500,0.773550
0.042600,0.021700,0.159000,0.776700
0.043900,0.021000,0.156000,0.779100
0.044350,0.021550,0.152700,0.781400
0.044500,0.020350,0.151450,0.783700
0.043550,0.019700,0.149300,0.787450
0.043100,0.019550,0.147200,0.790150
0.043150,0.018500,0.147000,0.791350
0.042400,0.018800,0.144950,0.793850
0.041500,0.017200,0.144950,0.796350
0.039600,0.018200,0.143300,0.798900
0.039600,0.017650,0.142700,0.800050
0.038300,0.017250,0.142550,0.801900
0.038300,0.016850,0.141450,0.803400
0.037650,0.016000,0.141450,0.804900
0.036800,0.014950,0.141600,0.806650
0.034150,0.015300,0.141750,0.808800
0.033550,0.014700,0.141250,0.810500
0.032400,0.014900,0.141450,0.811250
0.032550,0.013900,0.141750,0.811800
0.031900,0.012250,0.143800,0.812050
0.030350,0.012900,0.143750,0.813000
0.030100,0.012500,0.145350,0.812050
0.030100,0.012100,0.146300,0.811500
0.029300,0.011400,0.146450,0.812850
0.028600,0.010800,0.147700,0.812900
0.028100,0.009650,0.149700,0.812550
0.025850,0.010500,0.151000,0.812650
0.024950,0.010000,0.151800,0.813250
0.025200,0.009650,0.153150,0.812000
0.024600,0.008950,0.154850,0.811600
0.024050,0.009250,0.156200,0.810500
0.023250,0.009000,0.158050,0.809700
0.023050,0.008900,0.159000,0.809050
0.021950,0.009100,0.160600,0.808350
0.021950,0.008600,0.162800,0.806650
0.021400,0.008600,0.164450,0.805550
0.020950,0.009200,0.166150,0.803700
0.021150,0.009600,0.167400,0.801850
0.020900,0.009500,0.168800,0.800800
0.020500,0.009450,0.170200,0.799850
0.019950,0.009300,0.172200,0.798550
0.019300,0.009550,0.173500,0.797650
0.018650,0.009300,0.175400,0.796650
0.019150,0.008550,0.177300,0.795000
0.019100,0.008550,0.179000,0.793350
0.018400,0.008950,0.181150,0.791500
0.017400,0.009000,0.183250,0.790350
0.017050,0.009100,0.184950,0.788900
0.016550,0.009450,0.186900,0.787100
0.017400,0.008550,0.189600,0.784450
0.017750,0.008800,0.190650,0.782800
0.017950,0.008150,0.192550,0.781350
0.017050,0.009250,0.193750,0.779950
0.017200,0.009100,0.195100,0.778600
0.017750,0.008850,0.197250,0.776150
0.017550,0.008350,0.198500,0.775600
0.017950,0.008400,0.199700,0.773950
0.017800,0.008700,0.200450,0.773050
0.018500,0.008300,0.201650,0.771550
0.018000,0.008500,0.203900,0.769600
0.017500,0.009500,0.205150,0.767850
0.018200,0.010100,0.206500,0.765200
0.018900,0.010250,0.207050,0.763800
0.020000,0.010600,0.206750,0.762650
0.020050,0.010000,0.208400,0.761550
0.020300,0.010800,0.209150,0.759750
0.020450,0.011000,0.210900,0.757650
0.020000,0.012150,0.210950,0.756900
0.020800,0.011100,0.212300,0.755800
0.021700,0.011050,0.213100,0.754150
0.022100,0.011100,0.214750,0.752050
0.022900,0.011400,0.215450,0.750250
0.023750,0.011700,0.215950,0.748600
0.024250,0.011750,0.217050,0.746950
0.024500,0.012200,0.216850,0.746450
0.023950,0.012700,0.216900,0.746450
0.024350,0.012400,0.217350,0.745900
0.024950,0.013500,0.217250,0.744300
0.024400,0.014800,0.217050,0.743750
0.025250,0.015700,0.216000,0.743050
0.026950,0.015300,0.215850,0.741900
0.028000,0.014650,0.216350,0.741000
0.028650,0.013250,0.217200,0.740900
0.028000,0.014150,0.217400,0.740450
0.028350,0.015100,0.217350,0.739200
0.027650,0.015750,0.215750,0.740850
0.029350,0.015100,0.216550,0.739000
0.029850,0.015150,0.215600,0.739400
0.030300,0.015000,0.215350,0.739350
0.030950,0.016150,0.214500,0.738400
0.031250,0.017650,0.212850,0.738250
0.031150,0.017700,0.211900,0.739250
0.031600,0.018000,0.210150,0.740250
0.032050,0.018500,0.208500,0.740950
0.033300,0.017700,0.207650,0.741350
0.034000,0.016900,0.207250,0.741850
0.034100,0.018550,0.205650,0.741700
0.033850,0.019250,0.204500,0.742400
0.035650,0.017300,0.204950,0.742100
0.035600,0.018150,0.203450,0.742800
0.035300,0.019600,0.202550,0.742550
0.036250,0.019900,0.200650,0.743200
0.036650,0.019850,0.199150,0.744350
0.036200,0.020100,0.199100,0.744600
0.037800,0.020800,0.197150,0.744250
0.037150,0.020250,0.196300,0.746300
0.037150,0.020450,0.195000,0.747400
0.037650,0.020300,0.193750,0.748300
0.038400,0.019900,0.193750,0.747950
0.038800,0.019750,0.192150,0.749300
0.038350,0.020450,0.190250,0.750950
0.038950,0.020650,0.188800,0.751600
0.039500,0.020750,0.187700,0.752050
0.039650,0.019800,0.187500,0.753050
0.040700,0.019650,0.186100,0.753550
0.040300,0.019900,0.185100,0.754700
0.040900,0.020200,0.184950,0.753950
0.041700,0.020150,0.184300,0.753850
0.041300,0.020950,0.182200,0.755550
0.041750,0.020600,0.180900,0.756750
0.042350,0.021150,0.178800,0.757700
0.043450,0.019900,0.179000,0.757650
0.042200,0.020550,0.177550,0.759700
0.042850,0.019600,0.176800,0.760750
0.042250,0.020500,0.176400,0.760850
0.042750,0.020000,0.174550,0.762700
0.042550,0.020750,0.172300,0.764400
0.044150,0.020800,0.170350,0.764700
0.043850,0.020950,0.169250,0.765950
0.044450,0.021700,0.166800,0.767050
0.043500,0.020950,0.165600,0.769950
0.044250,0.020850,0.165500,0.769400
0.045150,0.019800,0.163350,0.771700
0.043350,0.019550,0.163150,0.773950
0.042650,0.018500,0.163200,0.775650
0.041400,0.019300,0.162500,0.776800
0.041300,0.018100,0.163050,0.777550
0.040100,0.018700,0.162550,0.778650
0.040550,0.017400,0.162900,0.779150
0.039150,0.017500,0.163350,0.780000
0.038450,0.017200,0.163850,0.780500
0.038600,0.016600,0.165000,0.779800
0.038750,0.016850,0.163400,0.781000
0.039650,0.015950,0.164950,0.779450
0.038950,0.016350,0.165650,0.779050
0.037750,0.015950,0.166200,0.780100
0.037100,0.015750,0.165900,0.781250
0.036100,0.015100,0.167200,0.781600
0.036050,0.015750,0.167200,0.781000
0.035600,0.015100,0.168700,0.780600
0.033850,0.016850,0.168050,0.781250
0.032800,0.017250,0.169250,0.780700
0.032900,0.017200,0.169400,0.780500
0.033300,0.016150,0.171900,0.778650
0.033400,0.015450,0.172750,0.778400
0.034200,0.015000,0.173050,0.777750
0.033700,0.015450,0.172850,0.778000
0.033800,0.016050,0.172650,0.777500
0.034000,0.016100,0.172500,0.777400
0.032800,0.015550,0.173900,0.777750
0.032050,0.016350,0.174800,0.776800
0.031900,0.016150,0.176250,0.775700
0.032200,0.014800,0.177800,0.775200
0.031850,0.015600,0.177700,0.774850
0.032000,0.016450,0.177200,0.774350
0.032000,0.016900,0.176000,0.775100
0.032150,0.016500,0.176600,0.774750
0.033300,0.015900,0.177100,0.773700
0.034000,0.017250,0.176400,0.772350
0.033150,0.016500,0.176850,0.773500
0.033400,0.015150,0.177750,0.773700
0.033500,0.015350,0.177500,0.773650
0.032700,0.014600,0.179450,0.773250
0.031700,0.014700,0.180250,0.773350
0.030800,0.015450,0.180500,0.773250
0.031000,0.015450,0.180800,0.772750
0.032450,0.014800,0.180850,0.771900
0.032350,0.015350,0.182100,0.770200
0.031800,0.015100,0.183250,0.769850
0.032000,0.014450,0.184100,0.769450
0.032050,0.015450,0.184100,0.768400
0.031850,0.015300,0.184650,0.768200
0.032000,0.014750,0.185800,0.767450
0.031950,0.014600,0.186050,0.767400
0.031950,0.014950,0.186200,0.766900
0.031250,0.015350,0.186450,0.766950
0.031500,0.014800,0.187550,0.766150
0.031450,0.014700,0.187750,0.766100
0.031900,0.014200,0.188350,0.765550
0.030800,0.014500,0.188950,0.765750
0.030550,0.015150,0.188800,0.765500
0.030000,0.014750,0.189000,0.766250
0.030100,0.014650,0.189100,0.766150
0.029500,0.015350,0.188300,0.766850
0.029550,0.014650,0.189700,0.766100
0.029000,0.015600,0.189400,0.766000
0.029500,0.016150,0.189850,0.764500
0.030000,0.016200,0.190050,0.763750
0.031100,0.016000,0.189950,0.762950
0.030950,0.015700,0.189950,0.763400
0.031900,0.015150,0.189550,0.763400
0.031500,0.016050,0.189600,0.762850
0.031650,0.016250,0.190700,0.761400
0.030600,0.016800,0.191000,0.761600
0.031100,0.016300,0.192050,0.760550
0.030800,0.016900,0.192250,0.760050
0.031150,0.017500,0.191900,0.759450
0.033050,0.017050,0.191000,0.758900
0.033850,0.017400,0.191100,0.757650
0.034450,0.018050,0.190000,0.757500
0.035150,0.018200,0.188850,0.757800
0.035450,0.017650,0.188700,0.758200
0.034950,0.018250,0.187000,0.759800
0.035150,0.018250,0.186550,0.760050
0.035250,0.017900,0.186850,0.760000
0.036200,0.018350,0.186350,0.759100
0.037100,0.017900,0.186650,0.758350
0.037250,0.018150,0.185350,0.759250
0.037900,0.018450,0.184500,0.759150
0.036700,0.018850,0.184550,0.759900
0.035950,0.019300,0.184050,0.760700
0.036350,0.019300,0.182250,0.762100
0.036300,0.018350,0.182850,0.762500
0.035950,0.018550,0.182500,0.763000
0.036800,0.017750,0.183000,0.762450
0.036200,0.017700,0.183100,0.763000
0.035750,0.017300,0.183450,0.763500
0.034850,0.017850,0.182900,0.764400
0.036050,0.016650,0.183050,0.764250
0.035400,0.016250,0.183850,0.764500
0.034800,0.016950,0.183750,0.764500
0.034950,0.015750,0.184650,0.764650
0.034700,0.015100,0.184750,0.765450
0.034150,0.015450,0.185500,0.764900
0.033550,0.015100,0.186200,0.765150
0.032700,0.015850,0.185600,0.765850
0.032450,0.016550,0.184850,0.766150
0.033300,0.016650,0.183900,0.766150
0.033450,0.016700,0.183450,0.766400
0.032650,0.017500,0.183700,0.766150
0.032550,0.017150,0.184750,0.765550
0.032700,0.017000,0.185250,0.765050
0.033250,0.016400,0.185750,0.764600
0.033150,0.016250,0.186000,0.764600
0.034300,0.016700,0.185650,0.763350
0.034450,0.016850,0.184900,0.763800
0.035450,0.016000,0.185000,0.763550
0.035400,0.015600,0.185850,0.763150
0.035700,0.015550,0.185600,0.763150
0.036350,0.016650,0.183850,0.763150
0.036500,0.017300,0.182800,0.763400
0.036550,0.017500,0.183850,0.762100
0.037350,0.017700,0.183050,0.761900
0.036900,0.018500,0.182800,0.761800
0.036350,0.019400,0.180600,0.763650
0.036650,0.018900,0.180950,0.763500
0.036850,0.019000,0.180100,0.764050
0.037000,0.019300,0.177900,0.765800
0.037200,0.017700,0.177850,0.767250
0.036900,0.017650,0.177250,0.768200
0.036900,0.017400,0.177000,0.768700
0.035950,0.018050,0.176600,0.769400
0.034950,0.017750,0.176500,0.770800
0.034300,0.018000,0.177200,0.770500
0.035000,0.017550,0.176900,0.770550
0.035200,0.017400,0.176000,0.771400
0.035850,0.016950,0.175800,0.771400
0.036550,0.016200,0.175000,0.772250
0.036300,0.017050,0.173800,0.772850
0.035700,0.016700,0.173850,0.773750
0.035500,0.016950,0.173950,0.773600
0.035850,0.017050,0.172900,0.774200
0.035950,0.016750,0.173200,0.774100
0.036200,0.016350,0.173350,0.774100
0.035200,0.015950,0.173900,0.774950
0.035250,0.014700,0.174900,0.775150
0.034400,0.016100,0.174550,0.774950
0.034600,0.015600,0.175000,0.774800
0.034050,0.016100,0.173800,0.776050
0.033700,0.015450,0.175200,0.775650
0.032250,0.016500,0.173900,0.777350
0.032400,0.016450,0.173450,0.777700
0.033350,0.016000,0.174450,0.776200
0.033300,0.016150,0.174900,0.775650
0.032800,0.016600,0.175050,0.775550
0.032450,0.016900,0.175100,0.775550
0.032850,0.016400,0.175550,0.775200
0.031900,0.016450,0.176050,0.775600
0.033300,0.016000,0.175400,0.775300
0.032900,0.016050,0.176450,0.774600
0.032050,0.015800,0.176750,0.775400
0.031300,0.016400,0.176800,0.775500
0.030500,0.016150,0.176750,0.776600
0.030700,0.015300,0.178550,0.775450
0.031200,0.014500,0.179100,0.775200
0.030800,0.014750,0.179950,0.774500
0.030750,0.015000,0.180250,0.774000
0.031450,0.014850,0.179700,0.774000
0.031300,0.014850,0.179400,0.774450
0.031200,0.015500,0.179850,0.773450
0.030900,0.015550,0.179800,0.773750
0.031150,0.015150,0.180850,0.772850
0.031050,0.015400,0.180750,0.772800
0.031050,0.015500,0.181150,0.772300
0.031050,0.014900,0.181300,0.772750
0.031100,0.014650,0.182950,0.771300
0.031950,0.014650,0.182700,0.770700
0.030850,0.014800,0.183100,0.771250
0.030200,0.015850,0.183150,0.770800
0.030400,0.016050,0.182250,0.771300
0.030350,0.016800,0.182500,0.770350
0.030900,0.016600,0.182850,0.769650
0.031400,0.015450,0.183250,0.769900
0.031200,0.015400,0.184950,0.768450
0.031800,0.016100,0.184200,0.767900
0.032150,0.017150,0.183050,0.767650
0.031650,0.018650,0.182300,0.767400
0.032950,0.018000,0.182650,0.766400
0.034000,0.017150,0.183150,0.765700
0.034700,0.017000,0.183250,0.765050
0.034950,0.017050,0.183300,0.764700
0.034550,0.018350,0.181950,0.765150
0.034300,0.018100,0.181750,0.765850
0.034300,0.017350,0.182150,0.766200
0.034750,0.017050,0.181850,0.766350
0.035750,0.017150,0.180850,0.766250
0.035100,0.017550,0.180700,0.766650
0.035050,0.017550,0.181300,0.766100
0.035300,0.016300,0.182250,0.766150
0.034750,0.016600,0.182750,0.765900
0.034100,0.018100,0.181150,0.766650
0.034700,0.017650,0.180800,0.766850
0.035150,0.017650,0.181600,0.765600
0.035250,0.017750,0.181550,0.765450
0.035550,0.017450,0.181200,0.765800
0.036000,0.016650,0.181700,0.765650
0.036300,0.015650,0.181550,0.766500
0.034600,0.016550,0.181100,0.767750
0.034650,0.015850,0.183100,0.766400
0.034650,0.016400,0.183000,0.765950
0.034500,0.016350,0.184400,0.764750
0.034850,0.016200,0.185200,0.763750
0.034600,0.016250,0.184600,0.764550
0.036600,0.015500,0.184900,0.763000
0.036350,0.015300,0.184750,0.763600
0.035150,0.016600,0.184200,0.764050
0.034700,0.016950,0.184150,0.764200
0.034000,0.017500,0.185350,0.763150
0.034550,0.017250,0.185200,0.763000
0.034750,0.016600,0.185200,0.763450
0.034650,0.016800,0.186000,0.762550
0.034650,0.017350,0.186100,0.761900
0.034450,0.018950,0.184650,0.761950
0.035150,0.018250,0.185350,0.761250
0.035400,0.017350,0.186300,0.760950
0.036150,0.017600,0.185150,0.761100
0.036300,0.017050,0.184900,0.761750
0.035850,0.017200,0.185200,0.761750
0.035350,0.017650,0.185550,0.761450
0.035750,0.016950,0.186400,0.760900
0.034550,0.017500,0.185800,0.762150
0.035350,0.016300,0.186450,0.761900
0.035550,0.017150,0.187250,0.760050
0.035750,0.018350,0.185500,0.760400
0.034550,0.018100,0.185600,0.761750
0.035200,0.017750,0.186800,0.760250
0.035950,0.017850,0.186700,0.759500
0.035300,0.018850,0.185900,0.759950
0.034450,0.018350,0.186500,0.760700
0.036850,0.016900,0.185550,0.760700
0.036300,0.019050,0.184150,0.760500
0.036000,0.018300,0.185450,0.760250
0.036250,0.017200,0.185750,0.760800
0.036350,0.016800,0.186150,0.760700
0.035400,0.017250,0.185650,0.761700
0.035000,0.017150,0.186100,0.761750
0.034500,0.016800,0.186850,0.761850
0.034850,0.016750,0.187300,0.761100
0.034400,0.016200,0.187650,0.761750
0.034450,0.016500,0.187950,0.761100
0.034350,0.016900,0.187150,0.761600
0.034000,0.016500,0.188100,0.761400
0.034350,0.016600,0.188100,0.760950
0.034750,0.016650,0.187900,0.760700
0.033850,0.016200,0.188900,0.761050
0.034700,0.015050,0.189600,0.760650
0.033600,0.015850,0.189500,0.761050
0.033200,0.016200,0.189800,0.760800
0.033750,0.017150,0.188900,0.760200
0.034500,0.017050,0.188750,0.759700
0.035300,0.015900,0.190050,0.758750
0.034950,0.017700,0.188500,0.758850
0.035650,0.017450,0.188650,0.758250
0.035450,0.017700,0.188350,0.758500
0.034900,0.018200,0.188050,0.758850
0.036050,0.018000,0.187950,0.758000
0.036800,0.016750,0.187600,0.758850
0.036100,0.016600,0.188050,0.759250
0.035100,0.018200,0.186600,0.760100
0.035600,0.018250,0.186800,0.759350
0.036550,0.017800,0.185650,0.760000
0.036150,0.018100,0.185300,0.760450
0.036150,0.018700,0.185350,0.759800
0.036250,0.018450,0.185150,0.760150
0.035900,0.018450,0.185550,0.760100
0.037000,0.018150,0.185150,0.759700
0.038000,0.018300,0.184800,0.758900
0.039150,0.017600,0.184700,0.758550
0.037700,0.019750,0.183800,0.758750
0.038150,0.018600,0.183800,0.759450
0.037150,0.018950,0.184400,0.759500
0.037650,0.019300,0.184800,0.758250
0.038700,0.018600,0.183800,0.758900
0.039650,0.019100,0.182500,0.758750
0.038900,0.019700,0.182050,0.759350
0.038750,0.018850,0.182100,0.760300
0.038500,0.018550,0.182200,0.760750
0.039100,0.018650,0.182250,0.760000
0.040050,0.018250,0.181900,0.759800
0.039150,0.020700,0.179900,0.760250
0.039900,0.019900,0.179350,0.760850
0.041400,0.019400,0.178250,0.760950
0.041750,0.019200,0.178250,0.760800
0.041700,0.019250,0.177800,0.761250
0.042950,0.017650,0.178750,0.760650
0.041050,0.019600,0.176500,0.762850
0.041550,0.019250,0.176600,0.762600
0.041250,0.018750,0.176500,0.763500
0.041850,0.017200,0.175700,0.765250
0.041200,0.017500,0.174900,0.766400
0.039800,0.018200,0.174900,0.767100
0.039450,0.019200,0.173450,0.767900
0.039650,0.018650,0.173200,0.768500
0.040150,0.017150,0.174200,0.768500
0.039650,0.017750,0.173100,0.769500
0.038650,0.017250,0.174650,0.769450
0.037400,0.018250,0.174200,0.770150
0.037850,0.018600,0.175150,0.768400
0.038300,0.018550,0.175100,0.768050
0.039300,0.018200,0.175450,0.767050
0.039250,0.017250,0.176100,0.767400
0.039900,0.016650,0.176400,0.767050
0.039600,0.017650,0.175400,0.767350
0.038900,0.018300,0.175750,0.767050
0.039050,0.017600,0.174500,0.768850
0.038600,0.017050,0.174000,0.770350
0.038950,0.016250,0.174100,0.770700
0.038000,0.017850,0.173100,0.771050
0.037300,0.017450,0.173700,0.771550
0.036600,0.018250,0.173700,0.771450
0.035950,0.017850,0.174100,0.772100
0.037250,0.018300,0.173450,0.771000
0.037150,0.017850,0.173200,0.771800
0.036300,0.017500,0.173600,0.772600
0.036500,0.017750,0.174150,0.771600
0.036450,0.017900,0.173850,0.771800
0.035150,0.017950,0.175300,0.771600
0.035800,0.016850,0.175550,0.771800
0.037900,0.015900,0.176250,0.769950
0.036950,0.017000,0.175650,0.770400
0.036650,0.016550,0.175700,0.771100
0.037600,0.016500,0.175400,0.770500
0.037050,0.017550,0.174400,0.771000
0.036950,0.016650,0.175350,0.771050
0.036600,0.016900,0.174850,0.771650
0.036200,0.017400,0.174550,0.771850
0.035600,0.017050,0.174900,0.772450
0.035600,0.018000,0.173850,0.772550
0.035950,0.017250,0.173550,0.773250
0.034850,0.018250,0.172600,0.774300
0.035650,0.017450,0.172900,0.774000
0.034700,0.016950,0.173950,0.774400
0.035750,0.016550,0.173250,0.774450
0.036350,0.016100,0.174800,0.772750
0.036100,0.016200,0.175750,0.771950
0.035150,0.016850,0.176250,0.771750
0.034250,0.017450,0.175050,0.773250
0.035000,0.017750,0.175200,0.772050
0.036150,0.016100,0.176550,0.771200
0.035100,0.016450,0.177450,0.771000
0.034500,0.016700,0.177450,0.771350
0.033950,0.017500,0.176950,0.771600
0.034800,0.016800,0.176800,0.771600
0.034250,0.016250,0.177200,0.772300
0.033950,0.016700,0.177050,0.772300
0.034200,0.015850,0.178150,0.771800
0.034050,0.016400,0.177300,0.772250
0.034250,0.016100,0.177650,0.772000
0.034350,0.015600,0.178100,0.771950
0.033600,0.016000,0.178500,0.771900
0.034400,0.016050,0.178750,0.770800
0.035650,0.015150,0.179250,0.769950
0.035050,0.016000,0.179050,0.769900
0.034700,0.016100,0.178850,0.770350
0.034650,0.017000,0.178150,0.770200
0.033800,0.016950,0.179450,0.769800
0.034050,0.017350,0.178800,0.769800
0.034500,0.016800,0.178950,0.769750
0.034500,0.016200,0.179500,0.769800
0.034350,0.016800,0.179250,0.769600
0.033900,0.016100,0.180250,0.769750
0.033200,0.017400,0.180000,0.769400
0.034400,0.015700,0.181100,0.768800
0.035050,0.016150,0.180650,0.768150
0.034350,0.016450,0.180250,0.768950
