I,E,S,R
0.001000,0.000500,0.998500,0.000000
0.001050,0.001200,0.997650,0.000100
0.001150,0.001500,0.997050,0.000300
0.001400,0.001800,0.996250,0.000550
0.001850,0.002500,0.995050,0.000600
0.002350,0.003700,0.993250,0.000700
0.003450,0.005000,0.990650,0.000900
0.004500,0.006350,0.987550,0.001600
0.005800,0.008100,0.983700,0.002400
0.006850,0.011450,0.978400,0.003300
0.009450,0.014450,0.972000,0.004100
0.012400,0.018850,0.963600,0.005150
0.016150,0.024600,0.952500,0.006750
0.020750,0.031900,0.938600,0.008750
0.027500,0.039850,0.921100,0.011550
0.034100,0.051800,0.898850,0.015250
0.046100,0.063350,0.870800,0.019750
0.057400,0.080850,0.835850,0.025900
0.072250,0.101900,0.792150,0.033700
0.092950,0.124700,0.739400,0.042950
0.116600,0.145250,0.682950,0.055200
0.143350,0.168550,0.617100,0.071000
0.169800,0.193100,0.545950,0.091150
0.201500,0.211250,0.474950,0.112300
0.237350,0.222400,0.402250,0.138000
0.268700,0.233300,0.330200,0.167800
0.300250,0.228200,0.267800,0.203750
0.327000,0.220850,0.209900,0.242250
0.348600,0.202900,0.164000,0.284500
0.362000,0.182750,0.126000,0.329250
0.363900,0.164900,0.093950,0.377250
0.362300,0.140550,0.071700,0.425450
0.352900,0.115400,0.056500,0.475200
0.340000,0.093950,0.044750,0.521300
0.317900,0.080100,0.035900,0.566100
0.298150,0.065400,0.029650,0.606800
0.275700,0.052400,0.026200,0.645700
0.252350,0.041950,0.023800,0.681900
0.229650,0.033750,0.022000,0.714600
0.206700,0.028250,0.021550,0.743500
0.188000,0.022800,0.021050,0.768150
0.169900,0.018900,0.021100,0.790100
0.152200,0.015750,0.021500,0.810550
0.138250,0.012700,0.022300,0.826750
0.124200,0.010250,0.023500,0.842050
0.110650,0.009350,0.024600,0.855400
0.098000,0.008400,0.026000,0.867600
0.087800,0.006850,0.027850,0.877500
0.076500,0.006450,0.029400,0.887650
0.069000,0.006200,0.030850,0.893950
0.061400,0.005800,0.032550,0.900250
0.053800,0.004700,0.035100,0.906400
0.047050,0.004750,0.037050,0.911150
0.041800,0.004650,0.038450,0.915100
0.037650,0.004850,0.039750,0.917750
0.034400,0.004200,0.042750,0.918650
0.030950,0.003650,0.046100,0.919300
0.028050,0.003250,0.048500,0.920200
0.024850,0.003150,0.050650,0.921350
0.022050,0.002950,0.053550,0.921450
0.019450,0.003400,0.055600,0.921550
0.017800,0.003050,0.058200,0.920950
0.015500,0.003200,0.061000,0.920300
0.014450,0.002500,0.063950,0.919100
0.012700,0.002650,0.066300,0.918350
0.011700,0.002750,0.068800,0.916750
0.011400,0.002300,0.071950,0.914350
0.010450,0.002250,0.074250,0.913050
0.009300,0.002050,0.076900,0.911750
0.008200,0.002250,0.079650,0.909900
0.007500,0.001950,0.083150,0.907400
0.007350,0.001750,0.085850,0.905050
0.006700,0.001550,0.089250,0.902500
0.006800,0.001350,0.091800,0.900050
0.006000,0.001500,0.094050,0.898450
0.005600,0.001550,0.096300,0.896550
0.005400,0.001500,0.098950,0.894150
0.004800,0.001900,0.101450,0.891850
0.004550,0.001500,0.103350,0.890600
0.004250,0.001400,0.105900,0.888450
0.004050,0.001350,0.108700,0.885900
0.004200,0.001300,0.111150,0.883350
0.003950,0.001050,0.113900,0.881100
0.003450,0.001250,0.116800,0.878500
0.002850,0.001300,0.119600,0.876250
0.002650,0.001000,0.122450,0.873900
0.002800,0.001250,0.124950,0.871000
0.003050,0.001000,0.128250,0.867700
0.002950,0.000950,0.131200,0.864900
0.002700,0.000900,0.134050,0.862350
0.002550,0.000750,0.136700,0.860000
0.002550,0.000650,0.139350,0.857450
0.002150,0.000800,0.141800,0.855250
0.002200,0.000750,0.144300,0.852750
0.001850,0.000750,0.146550,0.850850
0.001800,0.000500,0.149350,0.848350
0.001500,0.000500,0.152350,0.845650
0.001400,0.000550,0.154100,0.843950
0.001500,0.000500,0.156400,0.841600
0.001350,0.000600,0.158450,0.839600
0.001250,0.000450,0.161350,0.836950
0.001150,0.000350,0.163700,0.834800
0.001100,0.000350,0.166300,0.832250
0.001100,0.000350,0.168800,0.829750
0.001050,0.000300,0.171300,0.827350
0.001050,0.000500,0.173050,0.825400
0.001200,0.000500,0.175100,0.823200
0.001250,0.000450,0.177100,0.821200
0.001350,0.000400,0.179250,0.819000
0.001150,0.000500,0.181550,0.816800
0.001200,0.000550,0.184150,0.814100
0.001050,0.000650,0.186750,0.811550
0.001150,0.000700,0.189000,0.809150
0.001400,0.000650,0.190900,0.807050
0.001500,0.000700,0.192500,0.805300
0.001400,0.000850,0.194300,0.803450
0.001250,0.000850,0.196400,0.801500
0.001550,0.000700,0.198400,0.799350
0.001450,0.000700,0.200800,0.797050
0.001400,0.001000,0.202300,0.795300
0.001350,0.001000,0.204650,0.793000
0.001600,0.000900,0.206550,0.790950
0.001650,0.000950,0.208500,0.788900
0.001850,0.000900,0.210500,0.786750
0.001850,0.000950,0.212450,0.784750
0.001900,0.000900,0.214600,0.782600
0.001850,0.000950,0.216650,0.780550
0.001700,0.001100,0.218500,0.778700
0.001400,0.001150,0.220500,0.776950
0.001500,0.001100,0.222850,0.774550
0.001750,0.001100,0.224850,0.772300
0.001750,0.000900,0.227050,0.770300
0.001950,0.000600,0.229450,0.768000
0.001850,0.000900,0.231500,0.765750
0.001900,0.000950,0.233950,0.763200
0.001950,0.001000,0.236350,0.760700
0.002100,0.001200,0.238400,0.758300
0.002100,0.001250,0.240300,0.756350
0.002200,0.001050,0.242300,0.754450
0.002450,0.001000,0.244250,0.752300
0.002550,0.001000,0.246100,0.750350
0.002650,0.001500,0.248200,0.747650
0.002800,0.001750,0.249700,0.745750
0.002900,0.001550,0.251750,0.743800
0.003050,0.001750,0.253200,0.742000
0.003100,0.001950,0.254700,0.740250
0.003600,0.001500,0.256200,0.738700
0.003400,0.002000,0.257000,0.737600
0.003050,0.002350,0.258600,0.736000
0.002800,0.002650,0.260350,0.734200
0.003250,0.002450,0.261700,0.732600
0.003550,0.002150,0.263300,0.731000
0.003850,0.002450,0.264350,0.729350
0.004050,0.002650,0.266000,0.727300
0.004250,0.002750,0.267350,0.725650
0.004450,0.002250,0.269100,0.724200
0.004800,0.002500,0.270350,0.722350
0.005050,0.002650,0.271700,0.720600
0.005050,0.003400,0.272250,0.719300
0.005350,0.003400,0.273150,0.718100
0.005300,0.003650,0.274050,0.717000
0.005950,0.003450,0.274950,0.715650
0.006550,0.003500,0.275650,0.714300
0.006750,0.004600,0.275750,0.712900
0.007000,0.004750,0.276400,0.711850
0.007500,0.004800,0.276750,0.710950
0.007850,0.005050,0.277250,0.709850
0.008300,0.005150,0.277150,0.709400
0.008450,0.005750,0.277000,0.708800
0.009650,0.005350,0.277600,0.707400
0.010200,0.005700,0.278200,0.705900
0.010100,0.007150,0.277250,0.705500
0.010850,0.006800,0.277950,0.704400
0.010850,0.007350,0.277050,0.704750
0.011950,0.007100,0.276750,0.704200
0.012500,0.007200,0.276650,0.703650
0.012700,0.007750,0.276450,0.703100
0.012850,0.008700,0.275700,0.702750
0.013650,0.009000,0.275300,0.702050
0.014300,0.009900,0.273550,0.702250
0.015800,0.010100,0.272000,0.702100
0.015900,0.010600,0.271750,0.701750
0.016000,0.011050,0.271300,0.701650
0.017600,0.010850,0.269600,0.701950
0.018900,0.011350,0.267650,0.702100
0.020300,0.011950,0.265800,0.701950
0.021500,0.013250,0.263100,0.702150
0.022350,0.013850,0.260700,0.703100
0.023600,0.013350,0.258800,0.704250
0.023550,0.014350,0.256550,0.705550
0.024850,0.015050,0.254350,0.705750
0.025600,0.015350,0.251900,0.707150
0.026800,0.015900,0.248250,0.709050
0.028100,0.015900,0.245800,0.710200
0.028550,0.017850,0.242150,0.711450
0.030300,0.017950,0.238600,0.713150
0.030500,0.019650,0.235100,0.714750
0.031600,0.019450,0.232650,0.716300
0.032400,0.021550,0.228450,0.717600
0.034450,0.021650,0.222750,0.721150
0.034600,0.022150,0.218950,0.724300
0.036950,0.021150,0.215500,0.726400
0.038950,0.021400,0.211850,0.727800
0.040700,0.021550,0.208200,0.729550
0.041700,0.021550,0.204750,0.732000
0.041250,0.021750,0.201150,0.735850
0.041200,0.021700,0.198350,0.738750
0.040650,0.021200,0.195250,0.742900
0.041650,0.021000,0.191900,0.745450
0.042950,0.020050,0.188450,0.748550
0.042150,0.020500,0.185350,0.752000
0.042200,0.021150,0.182700,0.753950
0.043050,0.020450,0.179450,0.757050
0.043300,0.020350,0.176600,0.759750
0.042900,0.019750,0.173650,0.763700
0.041600,0.020000,0.171050,0.767350
0.042400,0.020650,0.168150,0.768800
0.043350,0.021000,0.164750,0.770900
0.043650,0.020450,0.162550,0.773350
0.042500,0.018800,0.161550,0.777150
0.042650,0.018000,0.159650,0.779700
0.041550,0.018250,0.157400,0.782800
0.042050,0.017600,0.155850,0.784500
0.041900,0.017700,0.154500,0.785900
0.040950,0.018250,0.152850,0.787950
0.040450,0.018500,0.151400,0.789650
0.039850,0.019250,0.149700,0.791200
0.039900,0.018500,0.148850,0.792750
0.039800,0.017450,0.149450,0.793300
0.040800,0.016350,0.148400,0.794450
0.039950,0.015200,0.148150,0.796700
0.038950,0.014950,0.148050,0.798050
0.036950,0.014200,0.149450,0.799400
0.035550,0.014150,0.148400,0.801900
0.034100,0.014600,0.146900,0.804400
0.034150,0.014200,0.147200,0.804450
0.033050,0.014300,0.147450,0.805200
0.032600,0.012650,0.148450,0.806300
0.030500,0.012650,0.149100,0.807750
0.029650,0.012250,0.149650,0.808450
0.030550,0.011100,0.150300,0.808050
0.029400,0.011550,0.150200,0.808850
0.028300,0.011800,0.150800,0.809100
0.028250,0.011250,0.153200,0.807300
0.027450,0.011100,0.154300,0.807150
0.026750,0.011650,0.155550,0.806050
0.027450,0.011050,0.156250,0.805250
0.026400,0.010950,0.157650,0.805000
0.025600,0.010050,0.160350,0.804000
0.024200,0.011550,0.160450,0.803800
0.024500,0.010400,0.161650,0.803450
0.023850,0.010650,0.163850,0.801650
0.023000,0.009300,0.166850,0.800850
0.022200,0.009900,0.168900,0.799000
0.022050,0.008600,0.171400,0.797950
0.021250,0.008900,0.172700,0.797150
0.021500,0.009550,0.173250,0.795700
0.021900,0.009300,0.175700,0.793100
0.022250,0.010000,0.177600,0.790150
0.022200,0.009900,0.179400,0.788500
0.021950,0.010500,0.180700,0.786850
0.022400,0.010600,0.182400,0.784600
0.022050,0.011400,0.183850,0.782700
0.021700,0.011150,0.184700,0.782450
0.021350,0.010650,0.186200,0.781800
0.020950,0.011750,0.186300,0.781000
0.021200,0.011500,0.186950,0.780350
0.020950,0.011800,0.188050,0.779200
0.021100,0.011800,0.189100,0.778000
0.021600,0.012150,0.190300,0.775950
0.022550,0.011250,0.192000,0.774200
0.022450,0.010950,0.193500,0.773100
0.023150,0.009650,0.195300,0.771900
0.023100,0.010700,0.194750,0.771450
0.022700,0.011750,0.195250,0.770300
0.022450,0.011450,0.196150,0.769950
0.022800,0.011950,0.196550,0.768700
0.022500,0.011850,0.198850,0.766800
0.022700,0.011500,0.201200,0.764600
0.023050,0.011650,0.201450,0.763850
0.023400,0.011750,0.201950,0.762900
0.023500,0.012050,0.202100,0.762350
0.023200,0.012650,0.202000,0.762150
0.024400,0.012650,0.201650,0.761300
0.024600,0.013750,0.201100,0.760550
0.025850,0.013600,0.201950,0.758600
0.026300,0.013450,0.202300,0.757950
0.026150,0.014550,0.202900,0.756400
0.026950,0.014100,0.204200,0.754750
0.027550,0.012650,0.204950,0.754850
0.028000,0.013500,0.205150,0.753350
0.027600,0.014400,0.205000,0.753000
0.028100,0.014500,0.205100,0.752300
0.029150,0.014600,0.204450,0.751800
0.029950,0.015300,0.203950,0.750800
0.030100,0.015950,0.203550,0.750400
0.030800,0.016000,0.203350,0.749850
0.030950,0.016950,0.201500,0.750600
0.031800,0.016250,0.201300,0.750650
0.031650,0.016350,0.201800,0.750200
0.031650,0.016050,0.201500,0.750800
0.031850,0.015700,0.200500,0.751950
0.031200,0.016150,0.200100,0.752550
0.031700,0.016800,0.199350,0.752150
0.031750,0.016950,0.198000,0.753300
0.031900,0.017250,0.197250,0.753600
0.032600,0.017100,0.197100,0.753200
0.032950,0.016450,0.198050,0.752550
0.032700,0.017050,0.197450,0.752800
0.033100,0.017350,0.196950,0.752600
0.032850,0.017400,0.196800,0.752950
0.034250,0.016500,0.196900,0.752350
0.034550,0.017000,0.194900,0.753550
0.034800,0.016050,0.195000,0.754150
0.034000,0.016250,0.194450,0.755300
0.033750,0.017400,0.193800,0.755050
0.034550,0.017550,0.193100,0.754800
0.035050,0.016650,0.192850,0.755450
0.035450,0.017400,0.192200,0.754950
0.036600,0.016750,0.193000,0.753650
0.037100,0.017100,0.191700,0.754100
0.037000,0.017650,0.192200,0.753150
0.037550,0.018500,0.191100,0.752850
0.036200,0.019250,0.190100,0.754450
0.037500,0.019100,0.188850,0.754550
0.037550,0.019350,0.186800,0.756300
0.038700,0.018100,0.187400,0.755800
0.038400,0.018800,0.185700,0.757100
0.037850,0.017850,0.185900,0.758400
0.037800,0.017350,0.185250,0.759600
0.037550,0.018000,0.184100,0.760350
0.038250,0.017650,0.184050,0.760050
0.038450,0.017350,0.183750,0.760450
0.038050,0.018150,0.183550,0.760250
0.038350,0.017750,0.183100,0.760800
0.038450,0.017850,0.182450,0.761250
0.037950,0.018800,0.182300,0.760950
0.038850,0.017750,0.182550,0.760850
0.038200,0.018050,0.182500,0.761250
0.039750,0.016800,0.181900,0.761550
0.038400,0.016600,0.182700,0.762300
0.038350,0.017250,0.182800,0.761600
0.037500,0.017200,0.182300,0.763000
0.036050,0.018100,0.182900,0.762950
0.036950,0.018100,0.182000,0.762950
0.037150,0.017700,0.181850,0.763300
0.036850,0.018100,0.181150,0.763900
0.035800,0.018150,0.180900,0.765150
0.036850,0.017550,0.181450,0.764150
0.036750,0.017450,0.180800,0.765000
0.036600,0.017000,0.180400,0.766000
0.037200,0.017000,0.180250,0.765550
0.037200,0.017450,0.179150,0.766200
0.036600,0.017550,0.178900,0.766950
0.035050,0.017350,0.179550,0.768050
0.035250,0.017050,0.180300,0.767400
0.034100,0.018150,0.179650,0.768100
0.034700,0.017900,0.178950,0.768450
0.034900,0.017950,0.178400,0.768750
0.035550,0.018550,0.177700,0.768200
0.036600,0.017000,0.178100,0.768300
0.036250,0.017850,0.177850,0.768050
0.036350,0.017250,0.177950,0.768450
0.036500,0.018450,0.176700,0.768350
0.036850,0.019200,0.175850,0.768100
0.036600,0.019700,0.175450,0.768250
0.037650,0.018700,0.175900,0.767750
0.037750,0.017100,0.176100,0.769050
0.037400,0.017700,0.176050,0.768850
0.038150,0.017200,0.176050,0.768600
0.037450,0.018550,0.175000,0.769000
0.037550,0.017750,0.174300,0.770400
0.037500,0.018050,0.174300,0.770150
0.037400,0.017600,0.175200,0.769800
0.036900,0.017850,0.174800,0.770450
0.037500,0.016700,0.175350,0.770450
0.037050,0.016500,0.176000,0.770450
0.036550,0.016950,0.175300,0.771200
0.036400,0.015750,0.176850,0.771000
0.035800,0.015900,0.178150,0.770150
0.036000,0.015600,0.178050,0.770350
0.036150,0.016100,0.177800,0.769950
0.035650,0.016850,0.177150,0.770350
0.035900,0.016300,0.177900,0.769900
0.035050,0.016150,0.178850,0.769950
0.034150,0.017000,0.178250,0.770600
0.034300,0.016550,0.177550,0.771600
0.034400,0.015350,0.178850,0.771400
0.034600,0.014850,0.178650,0.771900
0.033800,0.015500,0.178400,0.772300
0.033100,0.015900,0.178850,0.772150
0.033100,0.016450,0.178750,0.771700
0.032850,0.015750,0.178050,0.773350
0.033450,0.016050,0.179150,0.771350
0.033200,0.015800,0.179700,0.771300
0.032800,0.016000,0.179300,0.771900
0.032950,0.014800,0.179350,0.772900
0.032000,0.015900,0.179600,0.772500
0.032600,0.017050,0.179150,0.771200
0.032700,0.016150,0.179800,0.771350
0.032600,0.016300,0.179800,0.771300
0.031950,0.016800,0.179900,0.771350
0.031800,0.016450,0.181350,0.770400
0.031150,0.017000,0.182450,0.769400
0.032600,0.016400,0.182100,0.768900
0.033200,0.016350,0.181600,0.768850
0.033250,0.016400,0.181750,0.768600
0.033300,0.016850,0.181000,0.768850
0.033700,0.017250,0.180350,0.768700
0.033850,0.016500,0.180500,0.769150
0.034150,0.016150,0.180350,0.769350
0.034100,0.016700,0.180850,0.768350
0.033450,0.016600,0.181350,0.768600
0.034600,0.016350,0.180850,0.768200
0.034700,0.016700,0.180100,0.768500
0.035150,0.016450,0.179650,0.768750
0.035450,0.015400,0.179700,0.769450
0.035800,0.014800,0.181100,0.768300
0.035300,0.015100,0.181750,0.767850
0.035000,0.015550,0.182500,0.766950
0.034850,0.015600,0.182400,0.767150
0.033650,0.015950,0.182650,0.767750
0.033050,0.016650,0.181850,0.768450
0.033000,0.016400,0.181950,0.768650
0.033250,0.016900,0.181250,0.768600
0.033950,0.016700,0.180900,0.768450
0.033700,0.016000,0.181550,0.768750
0.034000,0.015400,0.181350,0.769250
0.034150,0.015050,0.181350,0.769450
0.033300,0.014750,0.182800,0.769150
0.034000,0.016200,0.181150,0.768650
0.033500,0.016900,0.180500,0.769100
0.034150,0.017150,0.179800,0.768900
0.034850,0.017400,0.178700,0.769050
0.033900,0.016000,0.180500,0.769600
0.034350,0.016350,0.179750,0.769550
0.035100,0.015200,0.180800,0.768900
0.033450,0.016200,0.181150,0.769200
0.033700,0.016300,0.181950,0.768050
0.034400,0.015600,0.182350,0.767650
0.034400,0.016450,0.181250,0.767900
0.033900,0.016550,0.181550,0.768000
0.033700,0.017000,0.181250,0.768050
0.033750,0.016800,0.181850,0.767600
0.033550,0.017400,0.180700,0.768350
0.033050,0.016100,0.182850,0.768000
0.033950,0.016100,0.183250,0.766700
0.034050,0.016450,0.183300,0.766200
0.033000,0.017050,0.183850,0.766100
0.033500,0.017850,0.183300,0.765350
0.033750,0.017600,0.183850,0.764800
0.034950,0.017150,0.183600,0.764300
0.035250,0.017150,0.182800,0.764800
0.034950,0.016950,0.182700,0.765400
0.035650,0.016300,0.182700,0.765350
0.036750,0.016600,0.181850,0.764800
0.035950,0.016550,0.180450,0.767050
0.036350,0.017800,0.179150,0.766700
0.035200,0.018300,0.178800,0.767700
0.035350,0.018700,0.177450,0.768500
0.036500,0.017900,0.177500,0.768100
0.037300,0.017250,0.177550,0.767900
0.037550,0.018700,0.176100,0.767650
0.036750,0.018050,0.176000,0.769200
0.036350,0.018000,0.175200,0.770450
0.036900,0.016450,0.175950,0.770700
0.037500,0.016000,0.175850,0.770650
0.035900,0.016350,0.176150,0.771600
0.034900,0.015700,0.177700,0.771700
0.034700,0.016250,0.175750,0.773300
0.035400,0.015800,0.175500,0.773300
0.036200,0.016050,0.176100,0.771650
0.035700,0.015900,0.176300,0.772100
0.035850,0.015100,0.176400,0.772650
0.034100,0.015200,0.177350,0.773350
0.034900,0.015900,0.175950,0.773250
0.033800,0.016150,0.175750,0.774300
0.033750,0.015900,0.175350,0.775000
0.033800,0.016000,0.175800,0.774400
0.034100,0.016350,0.175000,0.774550
0.034300,0.016500,0.175400,0.773800
0.033100,0.016350,0.176200,0.774350
0.033550,0.015800,0.175550,0.775100
0.032600,0.016900,0.175100,0.775400
0.033050,0.016550,0.175450,0.774950
0.033750,0.016950,0.174000,0.775300
0.033500,0.017200,0.173850,0.775450
0.033800,0.016400,0.173950,0.775850
0.033950,0.016800,0.173700,0.775550
0.034200,0.015950,0.174200,0.775650
0.033400,0.015900,0.175550,0.775150
0.034200,0.015500,0.176150,0.774150
0.033850,0.015700,0.176600,0.773850
0.034650,0.014950,0.177550,0.772850
0.032950,0.016400,0.178550,0.772100
0.032550,0.014800,0.179250,0.773400
0.033500,0.014350,0.180350,0.771800
0.032350,0.014950,0.180100,0.772600
0.032550,0.015350,0.179750,0.772350
0.032150,0.015000,0.180450,0.772400
0.032250,0.015000,0.180600,0.772150
0.032500,0.014750,0.181700,0.771050
0.032450,0.015150,0.183100,0.769300
0.031850,0.014700,0.183950,0.769500
0.031950,0.014650,0.185000,0.768400
0.031750,0.015850,0.184750,0.767650
0.032000,0.015550,0.185600,0.766850
0.030450,0.017500,0.184950,0.767100
0.031400,0.016500,0.186150,0.765950
0.032200,0.015450,0.186800,0.765550
0.032300,0.015200,0.187150,0.765350
0.032500,0.015800,0.186950,0.764750
0.033100,0.016600,0.187000,0.763300
0.033050,0.015850,0.186650,0.764450
0.033850,0.016000,0.187100,0.763050
0.033600,0.016300,0.186800,0.763300
0.033300,0.015800,0.188550,0.762350
0.033400,0.016350,0.188650,0.761600
0.033600,0.016800,0.188900,0.760700
0.033450,0.017000,0.189150,0.760400
0.033050,0.017150,0.190200,0.759600
0.033550,0.018800,0.189400,0.758250
0.034550,0.018150,0.189750,0.757550
0.035900,0.017100,0.190350,0.756650
0.035850,0.018000,0.189450,0.756700
0.035700,0.017550,0.188700,0.758050
0.036050,0.017150,0.187450,0.759350
0.035450,0.016900,0.188100,0.759550
0.035200,0.017950,0.186650,0.760200
0.035450,0.018250,0.185200,0.761100
0.036000,0.018050,0.184900,0.761050
0.036050,0.017600,0.185100,0.761250
0.036400,0.017150,0.185000,0.761450
0.037150,0.018150,0.183950,0.760750
0.037800,0.017750,0.183300,0.761150
0.037500,0.018300,0.182850,0.761350
0.036850,0.018400,0.182650,0.762100
0.036500,0.017700,0.182800,0.763000
0.036000,0.019150,0.181050,0.763800
0.036700,0.018850,0.181200,0.763250
0.037000,0.018250,0.180350,0.764400
0.037300,0.018500,0.179550,0.764650
0.038350,0.018100,0.178650,0.764900
0.038850,0.018250,0.177450,0.765450
0.039300,0.016650,0.177950,0.766100
0.038300,0.016750,0.177800,0.767150
0.036350,0.018250,0.177750,0.767650
0.036100,0.020350,0.176000,0.767550
0.037150,0.020550,0.176100,0.766200
0.037050,0.019800,0.176800,0.766350
0.037450,0.020000,0.175300,0.767250
0.037500,0.018800,0.175600,0.768100
0.038050,0.018300,0.176100,0.767550
0.037200,0.018300,0.177250,0.767250
0.038550,0.017000,0.177450,0.767000
0.037950,0.016850,0.176400,0.768800
0.036550,0.017700,0.176400,0.769350
0.037650,0.016850,0.176850,0.768650
0.037050,0.017750,0.176050,0.769150
0.037400,0.018250,0.175850,0.768500
0.037300,0.017650,0.175800,0.769250
0.037400,0.017650,0.175650,0.769300
0.037700,0.018350,0.176300,0.767650
0.037700,0.018400,0.176300,0.767600
0.037850,0.018350,0.175700,0.768100
0.037100,0.018150,0.174650,0.770100
0.037100,0.017550,0.174700,0.770650
0.036750,0.017650,0.174750,0.770850
0.037200,0.017250,0.175100,0.770450
0.037200,0.016500,0.174750,0.771550
0.036900,0.017250,0.174500,0.771350
0.036650,0.017450,0.173850,0.772050
0.036400,0.017950,0.174400,0.771250
0.036000,0.017900,0.175450,0.770650
0.036600,0.016600,0.175300,0.771500
0.036250,0.016350,0.176200,0.771200
0.036700,0.016100,0.176550,0.770650
0.035850,0.015500,0.177550,0.771100
0.034950,0.015700,0.177600,0.771750
0.034450,0.016200,0.178100,0.771250
0.034650,0.016350,0.178050,0.770950
0.034150,0.016050,0.178150,0.771650
0.034300,0.016000,0.178500,0.771200
0.034100,0.016100,0.179250,0.770550
0.033900,0.015800,0.180500,0.769800
0.033950,0.015800,0.181350,0.768900
0.033050,0.016700,0.181650,0.768600
0.034050,0.015400,0.182500,0.768050
0.033500,0.015000,0.184050,0.767450
0.032950,0.015200,0.185450,0.766400
0.032000,0.015300,0.186700,0.766000
0.032050,0.016450,0.186550,0.764950
0.032750,0.016150,0.188050,0.763050
0.033250,0.015950,0.189750,0.761050
0.033300,0.015900,0.189700,0.761100
0.033150,0.015950,0.190050,0.760850
0.033550,0.016850,0.188800,0.760800
0.033500,0.016650,0.189300,0.760550
0.033650,0.017400,0.189250,0.759700
0.034950,0.017500,0.189000,0.758550
0.036500,0.017650,0.188350,0.757500
0.036950,0.018200,0.187100,0.757750
0.036800,0.017600,0.187400,0.758200
0.036900,0.016700,0.187250,0.759150
0.037050,0.017800,0.186950,0.758200
0.037650,0.017600,0.187350,0.757400
0.038100,0.017250,0.186850,0.757800
0.038800,0.016950,0.187100,0.757150
0.038150,0.017550,0.187100,0.757200
0.037550,0.017950,0.187600,0.756900
0.037200,0.017650,0.187100,0.758050
0.037050,0.018250,0.186700,0.758000
0.037700,0.019100,0.185900,0.757300
0.037800,0.018750,0.185650,0.757800
0.037800,0.018950,0.184700,0.758550
0.038550,0.019150,0.183300,0.759000
0.039400,0.018250,0.182200,0.760150
0.040550,0.018850,0.181700,0.758900
0.039050,0.018500,0.181300,0.761150
0.039700,0.017650,0.182450,0.760200
0.040050,0.017850,0.181650,0.760450
0.039800,0.018450,0.181150,0.760600
0.040100,0.018550,0.180750,0.760600
0.040850,0.017950,0.180450,0.760750
0.040150,0.017850,0.179850,0.762150
0.039200,0.018450,0.179000,0.763350
0.037650,0.018650,0.179500,0.764200
0.036800,0.017950,0.180600,0.764650
0.035700,0.019100,0.180050,0.765150
0.036050,0.020050,0.178850,0.765050
0.036950,0.019300,0.178850,0.764900
0.039100,0.018500,0.178800,0.763600
0.038400,0.018150,0.179300,0.764150
0.037900,0.018700,0.178750,0.764650
0.038300,0.017950,0.178450,0.765300
0.037450,0.017750,0.178700,0.766100
0.037800,0.016950,0.179650,0.765600
0.037000,0.017950,0.179150,0.765900
0.037550,0.017300,0.178250,0.766900
0.037950,0.017500,0.178050,0.766500
0.037750,0.016950,0.177550,0.767750
0.038050,0.015900,0.177150,0.768900
0.037700,0.015600,0.177400,0.769300
0.036650,0.015950,0.177200,0.770200
0.035950,0.017300,0.177200,0.769550
0.036300,0.016950,0.177150,0.769600
0.036300,0.017250,0.177750,0.768700
0.037150,0.017150,0.177300,0.768400
0.037000,0.018050,0.176050,0.768900
0.037450,0.017450,0.176100,0.769000
0.038050,0.017950,0.175300,0.768700
0.038500,0.017200,0.176450,0.767850
0.038700,0.016200,0.176600,0.768500
0.037850,0.016450,0.176950,0.768750
0.037400,0.016000,0.177350,0.769250
0.036950,0.016400,0.178150,0.768500
0.035550,0.017400,0.177900,0.769150
0.035750,0.016650,0.178500,0.769100
0.035950,0.016850,0.177450,0.769750
0.035800,0.016400,0.177300,0.770500
0.035700,0.016100,0.177600,0.770600
0.034900,0.016050,0.178050,0.771000
0.034850,0.016100,0.178100,0.770950
0.034500,0.015700,0.177900,0.771900
0.034250,0.016350,0.177900,0.771500
0.033700,0.016800,0.177300,0.772200
0.033950,0.015900,0.177850,0.772300
0.033300,0.016100,0.178150,0.772450
0.032750,0.015150,0.180850,0.771250
0.032800,0.014550,0.182500,0.770150
0.032200,0.015550,0.182500,0.769750
0.030600,0.016600,0.183500,0.769300
0.030700,0.015500,0.184750,0.769050
0.031950,0.014750,0.184800,0.768500
0.031700,0.014200,0.187100,0.767000
0.032000,0.014150,0.187900,0.765950
0.030300,0.015700,0.186950,0.767050
0.030250,0.015250,0.187150,0.767350
0.030350,0.015500,0.187350,0.766800
0.029850,0.015550,0.188600,0.766000
0.030700,0.015550,0.189200,0.764550
0.031250,0.015550,0.189450,0.763750
0.031950,0.015450,0.189500,0.763100
0.030600,0.016850,0.189500,0.763050
0.031950,0.016250,0.189150,0.762650
0.032450,0.015600,0.188650,0.763300
0.032550,0.015600,0.189200,0.762650
0.033250,0.016000,0.188600,0.762150
0.032950,0.016300,0.189450,0.761300
0.033600,0.016350,0.190850,0.759200
0.033500,0.016350,0.191450,0.758700
0.033150,0.017200,0.191450,0.758200
0.033200,0.017250,0.191050,0.758500
0.034250,0.016550,0.191150,0.758050
0.034750,0.016100,0.190700,0.758450
0.034300,0.017100,0.190050,0.758550
0.034100,0.017250,0.189300,0.759350
0.034100,0.017650,0.188800,0.759450
0.033800,0.017900,0.187350,0.760950
0.034900,0.017550,0.186750,0.760800
0.035500,0.018150,0.185750,0.760600
0.035200,0.018500,0.185600,0.760700
0.036200,0.018550,0.184900,0.760350
0.037550,0.018450,0.185100,0.758900
0.039100,0.016900,0.185650,0.758350
0.039000,0.017300,0.184550,0.759150
0.038950,0.017500,0.183500,0.760050
0.038700,0.017950,0.183850,0.759500
0.038400,0.018250,0.184250,0.759100
0.038650,0.018350,0.184550,0.758450
0.038550,0.019650,0.183450,0.758350
0.038950,0.020950,0.181150,0.758950
0.039250,0.020750,0.180550,0.759450
0.040050,0.020250,0.178750,0.760950
0.040550,0.020200,0.177200,0.762050
0.039450,0.020200,0.177000,0.763350
0.039850,0.019250,0.177350,0.763550
0.040350,0.018200,0.178000,0.763450
0.039800,0.018700,0.177050,0.764450
0.039550,0.018500,0.176650,0.765300
0.039350,0.017550,0.176400,0.766700
0.038700,0.016900,0.176300,0.768100
0.038100,0.016500,0.176950,0.768450
0.037650,0.017200,0.178300,0.766850
0.036800,0.017650,0.178150,0.767400
0.036100,0.018250,0.177350,0.768300
0.035800,0.018650,0.177000,0.768550
0.036800,0.017450,0.176650,0.769100
0.036750,0.018000,0.175700,0.769550
0.037250,0.017350,0.175600,0.769800
