I,E,S,R
0.001,0.00055,0.99845,0
0.00095,0.00135,0.9975,0.0002
0.0012,0.00155,0.9969,0.00035
0.0013,0.00205,0.996,0.00065
0.0014,0.00315,0.9947,0.00075
0.0019,0.0038,0.99325,0.00105
0.00255,0.00475,0.9915,0.0012
0.0034,0.0055,0.9894,0.0017
0.00495,0.00605,0.9867,0.0023
0.00625,0.00795,0.9831,0.0027
0.0079,0.0113,0.97735,0.00345
0.01005,0.0149,0.9702,0.00485
0.01185,0.0204,0.9615,0.00625
0.0162,0.02615,0.9499,0.00775
0.02175,0.0326,0.93595,0.0097
0.02735,0.0408,0.9188,0.01305
0.0353,0.04995,0.8978,0.01695
0.0446,0.06275,0.87095,0.0217
0.05645,0.07765,0.83865,0.02725
0.07085,0.09745,0.7968,0.0349
0.08995,0.11905,0.7464,0.0446
0.1155,0.1419,0.68685,0.05575
0.1376,0.16965,0.62085,0.0719
0.1709,0.18855,0.55075,0.0898
0.1998,0.2075,0.4794,0.1133
0.23475,0.2214,0.4047,0.13915
0.2665,0.23055,0.3335,0.16945
0.29775,0.23085,0.2668,0.2046
0.3209,0.2222,0.212,0.2449
0.34155,0.2058,0.16455,0.2881
0.35505,0.1866,0.1256,0.33275
0.35855,0.16615,0.09465,0.38065
0.35555,0.14365,0.0722,0.4286
0.35095,0.1197,0.05625,0.4731
0.3359,0.09945,0.04545,0.5192
0.31845,0.0808,0.03705,0.5637
0.299,0.06525,0.0307,0.60505
0.2771,0.0539,0.02575,0.64325
0.25455,0.04225,0.02335,0.67985
0.23335,0.03405,0.02125,0.71135
0.2098,0.02705,0.02045,0.7427
0.19075,0.02155,0.02045,0.76725
0.1707,0.01825,0.02045,0.7906
0.15345,0.0144,0.0207,0.81145
0.13665,0.012,0.02145,0.8299
0.1207,0.0109,0.0217,0.8467
0.1076,0.01,0.0228,0.8596
0.09365,0.0094,0.0237,0.87325
0.0835,0.00835,0.02535,0.8828
0.07515,0.00745,0.0272,0.8902
0.06685,0.00675,0.0285,0.8979
0.0607,0.0057,0.0304,0.9032
0.0538,0.00555,0.0321,0.90855
0.04735,0.00575,0.03375,0.91315
0.0428,0.00495,0.03525,0.917
0.0389,0.004,0.038,0.9191
0.0344,0.0042,0.03965,0.92175
0.0321,0.0036,0.0426,0.9217
0.02855,0.0036,0.04475,0.9231
0.0255,0.00365,0.047,0.92385
0.02195,0.0035,0.0499,0.92465
0.02,0.00365,0.05275,0.9236
0.0177,0.003,0.0561,0.9232
0.01595,0.00325,0.0585,0.9223
0.01475,0.0033,0.0604,0.92155
0.01365,0.00295,0.0633,0.9201
0.0126,0.00265,0.06595,0.9188
0.0117,0.00245,0.0688,0.91705
0.0108,0.0021,0.0714,0.9157
0.0097,0.00205,0.0739,0.91435
0.00925,0.00175,0.07675,0.91225
0.0082,0.00185,0.079,0.91095
0.00735,0.00185,0.08195,0.90885
0.0072,0.00165,0.0849,0.90625
0.00615,0.00185,0.087,0.905
0.0055,0.0016,0.08935,0.90355
0.0049,0.00155,0.0918,0.90175
0.0047,0.00145,0.0958,0.89805
0.0047,0.00115,0.09845,0.8957
0.00435,0.00125,0.10045,0.89395
0.0041,0.00125,0.10275,0.8919
0.0038,0.00095,0.1062,0.88905
0.00335,0.00105,0.10935,0.88625
0.00305,0.001,0.1125,0.88345
0.0031,0.00125,0.11495,0.8807
0.0029,0.00125,0.1173,0.87855
0.00295,0.00095,0.12015,0.87595
0.0028,0.00085,0.12335,0.873
0.00255,0.0008,0.12565,0.871
0.0026,0.00075,0.1277,0.86895
0.0023,0.00085,0.1305,0.86635
0.00225,0.0006,0.1337,0.86345
0.00215,0.00075,0.1362,0.8609
0.0021,0.00075,0.13885,0.8583
0.002,0.00075,0.1415,0.85575
0.002,0.0006,0.14345,0.85395
0.0018,0.00065,0.14585,0.8517
0.00145,0.00075,0.14835,0.84945
0.0016,0.00065,0.15095,0.8468
0.0015,0.0006,0.15385,0.84405
0.0015,0.00065,0.15615,0.8417
0.00155,0.0007,0.15785,0.8399
0.0015,0.00065,0.16005,0.8378
0.00135,0.0008,0.16275,0.8351
0.0011,0.00085,0.16465,0.8334
0.0011,0.0009,0.1667,0.8313
0.00125,0.00085,0.169,0.8289
0.00135,0.0009,0.17145,0.8263
0.00155,0.00055,0.1737,0.8242
0.00145,0.0006,0.1758,0.82215
0.0016,0.00045,0.1774,0.82055
0.0012,0.0004,0.17955,0.81885
0.001,0.00055,0.1821,0.81635
0.00095,0.00035,0.1842,0.8145
0.0009,0.00025,0.18605,0.8128
0.00095,0.00015,0.1886,0.8103
0.00085,0.00025,0.19075,0.80815
0.0009,0.00025,0.19305,0.8058
0.00075,0.00055,0.1948,0.8039
0.00085,0.00055,0.1971,0.8015
0.00095,0.00055,0.19945,0.79905
0.00105,0.0006,0.2022,0.79615
0.00095,0.00035,0.2043,0.7944
0.0008,0.0005,0.20605,0.79265
0.0008,0.00055,0.20875,0.7899
0.001,0.00025,0.21115,0.7876
0.00085,0.0003,0.2128,0.78605
0.00075,0.0004,0.2146,0.78425
0.00085,0.00035,0.21685,0.78195
0.00085,0.0004,0.21865,0.7801
0.00085,0.0006,0.2203,0.77825
0.0009,0.0007,0.22205,0.77635
0.0009,0.00085,0.22425,0.774
0.001,0.00065,0.2266,0.77175
0.00115,0.0009,0.22825,0.7697
0.0012,0.0008,0.2299,0.7681
0.0013,0.00065,0.2321,0.76595
0.0014,0.0006,0.2342,0.7638
0.0013,0.0008,0.23595,0.76195
0.00145,0.0007,0.2387,0.75915
0.00115,0.0008,0.2407,0.75735
0.0012,0.00095,0.24295,0.7549
0.00125,0.00095,0.24505,0.75275
0.0014,0.001,0.2465,0.7511
0.00165,0.00105,0.2488,0.7485
0.0016,0.0011,0.2505,0.7468
0.00165,0.0011,0.2519,0.74535
0.00165,0.0011,0.2532,0.74405
0.00185,0.00115,0.25495,0.74205
0.00195,0.00105,0.25645,0.74055
0.00185,0.00105,0.25815,0.73895
0.002,0.00105,0.2596,0.73735
0.0018,0.00115,0.26155,0.7355
0.0019,0.0011,0.263,0.734
0.00195,0.00105,0.26495,0.73205
0.002,0.00125,0.26645,0.7303
0.00205,0.00125,0.2675,0.7292
0.002,0.001,0.2692,0.7278
0.002,0.0012,0.2706,0.7262
0.00205,0.00115,0.27225,0.72455
0.0019,0.00115,0.27395,0.723
0.00155,0.00135,0.27575,0.72135
0.0015,0.0013,0.2769,0.7203
0.00165,0.0012,0.27895,0.7182
0.0019,0.00115,0.27985,0.7171
0.0021,0.0013,0.28185,0.71475
0.00215,0.00165,0.2829,0.7133
0.0024,0.0018,0.2846,0.7112
0.0027,0.0019,0.2853,0.7101
0.00315,0.0014,0.28705,0.7084
0.00335,0.00155,0.28865,0.70645
0.0034,0.0013,0.2907,0.7046
0.00315,0.00175,0.29185,0.70325
0.00335,0.00205,0.2931,0.7015
0.00325,0.0023,0.2941,0.70035
0.0039,0.0018,0.29575,0.69855
0.0039,0.0017,0.29725,0.69715
0.00365,0.0021,0.29895,0.6953
0.0038,0.002,0.30025,0.69395
0.00395,0.00215,0.3011,0.6928
0.0044,0.00235,0.30165,0.6916
0.00415,0.0025,0.30245,0.6909
0.00435,0.0031,0.30335,0.6892
0.0049,0.00325,0.30475,0.6871
0.0049,0.00335,0.30565,0.6861
0.0052,0.00365,0.30615,0.685
0.00565,0.0037,0.30755,0.6831
0.0062,0.0039,0.30785,0.68205
0.00665,0.0049,0.30795,0.6805
0.00715,0.0048,0.30855,0.6795
0.0081,0.00505,0.3092,0.67765
0.00915,0.005,0.30895,0.6769
0.00915,0.0055,0.30875,0.6766
0.0101,0.00555,0.3087,0.67565
0.0103,0.0071,0.30775,0.67485
0.0119,0.00725,0.30675,0.6741
0.01225,0.0079,0.306,0.67385
0.0125,0.00905,0.3049,0.67355
0.01305,0.00995,0.3036,0.6734
0.01435,0.00975,0.3025,0.6734
0.01555,0.01,0.3009,0.67355
0.01585,0.0104,0.2998,0.67395
0.01665,0.0107,0.2984,0.67425
0.0172,0.0112,0.29735,0.67425
0.0179,0.01155,0.29595,0.6746
0.0191,0.0123,0.2937,0.6749
0.0199,0.0127,0.29205,0.67535
0.02055,0.0142,0.2895,0.67575
0.02225,0.0156,0.28585,0.6763
0.0231,0.0169,0.2828,0.6772
0.02505,0.01695,0.28005,0.67795
0.02535,0.0172,0.2778,0.67965
0.02675,0.0177,0.2749,0.68065
0.0285,0.0178,0.2718,0.6819
0.0298,0.019,0.26795,0.68325
0.03115,0.01965,0.26475,0.68445
0.0327,0.0198,0.26285,0.68465
0.03325,0.02205,0.25825,0.68645
0.0351,0.0231,0.25345,0.68835
0.03705,0.0246,0.2477,0.69065
0.0397,0.02465,0.2423,0.69335
0.04095,0.02605,0.23765,0.69535
0.04355,0.02485,0.2324,0.6992
0.0447,0.0257,0.2261,0.7035
0.0458,0.02515,0.22185,0.7072
0.04635,0.02605,0.21645,0.71115
0.04725,0.0264,0.2108,0.71555
0.04805,0.0256,0.20615,0.7202
0.04805,0.02585,0.20145,0.72465
0.049,0.02605,0.1971,0.72785
0.0483,0.0275,0.1922,0.732
0.04985,0.0265,0.18775,0.7359
0.05085,0.02805,0.181,0.7401
0.05165,0.027,0.17685,0.7445
0.0526,0.02575,0.17345,0.7482
0.0534,0.02465,0.1694,0.75255
0.05285,0.02305,0.1666,0.7575
0.05275,0.0222,0.16295,0.7621
0.0514,0.0216,0.16025,0.76675
0.0503,0.02055,0.1573,0.77185
0.0497,0.02025,0.15485,0.7752
0.04955,0.02025,0.15275,0.77745
0.04905,0.01975,0.1505,0.7807
0.0476,0.0202,0.1478,0.7844
0.0466,0.01835,0.1473,0.78775
0.04545,0.0184,0.14725,0.7889
0.04535,0.0186,0.14495,0.7911
0.04375,0.0192,0.1434,0.79365
0.04375,0.01825,0.14235,0.79565
0.04395,0.01705,0.1409,0.7981
0.0424,0.0165,0.14005,0.80105
0.04165,0.01665,0.1392,0.8025
0.0416,0.01685,0.13885,0.8027
0.0411,0.01575,0.13915,0.804
0.03865,0.01535,0.1389,0.8071
0.0368,0.01545,0.13825,0.8095
0.03575,0.01505,0.13855,0.81065
0.03565,0.0139,0.1379,0.81255
0.0338,0.01455,0.13935,0.8123
0.03245,0.0136,0.14015,0.8138
0.0304,0.0146,0.13995,0.81505
0.03195,0.01245,0.1414,0.8142
0.0316,0.0117,0.1416,0.8151
0.0293,0.0123,0.14185,0.81655
0.0282,0.0117,0.14285,0.81725
0.0274,0.01225,0.14295,0.8174
0.0278,0.01205,0.1441,0.81605
0.02755,0.0121,0.14555,0.8148
0.0267,0.01155,0.14645,0.8153
0.02585,0.01085,0.149,0.8143
0.0247,0.01065,0.15055,0.8141
0.02425,0.01025,0.1512,0.8143
0.02405,0.00925,0.15325,0.81345
0.02335,0.0098,0.15395,0.8129
0.0234,0.00985,0.15465,0.8121
0.02305,0.00915,0.15655,0.81125
0.02215,0.00995,0.1578,0.8101
0.0219,0.0103,0.1595,0.8083
0.02185,0.00965,0.16135,0.80715
0.0219,0.00925,0.16355,0.8053
0.02095,0.00995,0.16485,0.80425
0.02115,0.0105,0.1668,0.80155
0.0212,0.0103,0.1684,0.8001
0.02115,0.0101,0.1703,0.79845
0.02165,0.00935,0.17285,0.79615
0.0212,0.00955,0.1742,0.79505
0.02075,0.0095,0.1763,0.79345
0.0201,0.0094,0.1783,0.7922
0.02035,0.00885,0.1809,0.7899
0.0193,0.00825,0.18285,0.7896
0.01905,0.0087,0.1839,0.78835
0.01945,0.00925,0.18475,0.78655
0.0197,0.00855,0.18625,0.7855
0.0208,0.0081,0.1882,0.7829
0.0203,0.00875,0.18895,0.782
0.02035,0.00855,0.18955,0.78155
0.02025,0.0089,0.1912,0.77965
0.02035,0.00945,0.1915,0.7787
0.01915,0.0102,0.1937,0.77695
0.019,0.01105,0.1946,0.77535
0.0199,0.01045,0.19565,0.774
0.02005,0.0102,0.19715,0.7726
0.02025,0.01025,0.1986,0.7709
0.02045,0.00985,0.2004,0.7693
0.01995,0.0103,0.2017,0.76805
0.02025,0.01025,0.20225,0.76725
0.0203,0.0111,0.2033,0.7653
0.0204,0.0118,0.2042,0.7636
0.0214,0.0117,0.2055,0.7614
0.02225,0.0121,0.2051,0.76055
0.02155,0.01245,0.20585,0.76015
0.0223,0.012,0.20675,0.75895
0.02235,0.0128,0.20685,0.758
0.02325,0.01255,0.2066,0.7576
0.02375,0.01315,0.20645,0.75665
0.02315,0.0137,0.20695,0.7562
0.02485,0.0137,0.2071,0.75435
0.026,0.01345,0.2071,0.75345
0.02585,0.0138,0.2078,0.75255
0.02615,0.0137,0.20785,0.7523
0.02605,0.01425,0.20705,0.75265
0.02605,0.014,0.2075,0.75245
0.02625,0.0144,0.2079,0.75145
0.0263,0.015,0.2072,0.7515
0.02715,0.01445,0.2072,0.7512
0.02675,0.01505,0.20645,0.75175
0.02705,0.01545,0.2059,0.7516
0.0291,0.0153,0.2052,0.7504
0.0292,0.01645,0.20485,0.7495
0.02975,0.01685,0.20435,0.74905
0.03195,0.01615,0.20455,0.74735
0.0325,0.01675,0.2036,0.74715
0.0326,0.01755,0.20205,0.7478
0.03305,0.018,0.2014,0.74755
0.0349,0.0174,0.19985,0.74785
0.03495,0.0185,0.19825,0.7483
0.03615,0.0181,0.19635,0.7494
0.0365,0.0179,0.19635,0.74925
0.0353,0.0183,0.19565,0.75075
0.0354,0.0183,0.19445,0.75185
0.0364,0.0174,0.1936,0.7526
0.03575,0.0182,0.1926,0.75345
0.03675,0.01715,0.1928,0.7533
0.0366,0.01855,0.19055,0.7543
0.03625,0.01795,0.1902,0.7556
0.03645,0.0182,0.18915,0.7562
0.03675,0.0186,0.1873,0.75735
0.03675,0.01875,0.1865,0.758
0.03595,0.01895,0.1858,0.7593
0.036,0.0186,0.18595,0.75945
0.03705,0.01765,0.1866,0.7587
0.03645,0.017,0.1862,0.76035
0.0361,0.0174,0.18595,0.76055
0.03535,0.01795,0.1857,0.761
0.0359,0.01765,0.18545,0.761
0.03455,0.01735,0.18535,0.76275
0.0345,0.01745,0.18495,0.7631
0.0352,0.0172,0.18475,0.76285
0.0355,0.01725,0.1849,0.76235
0.0356,0.0178,0.18495,0.76165
0.0364,0.0182,0.18385,0.76155
0.0363,0.01795,0.18395,0.7618
0.03755,0.01745,0.1834,0.7616
0.03775,0.0166,0.18395,0.7617
0.0363,0.0176,0.1834,0.7627
0.0365,0.01755,0.1821,0.76385
0.0367,0.0176,0.18165,0.76405
0.0362,0.0177,0.1812,0.7649
0.03725,0.0173,0.18085,0.7646
0.0367,0.0177,0.18075,0.76485
0.037,0.0176,0.18035,0.76505
0.03725,0.01825,0.17875,0.76575
0.03655,0.01845,0.17915,0.76585
0.0375,0.0175,0.17905,0.76595
0.0375,0.01785,0.17835,0.7663
0.0383,0.0177,0.1781,0.7659
0.0398,0.01565,0.17855,0.766
0.0392,0.0172,0.1774,0.7662
0.0384,0.01665,0.1774,0.76755
0.0375,0.016,0.1776,0.7689
0.0376,0.0163,0.17725,0.76885
0.0372,0.01695,0.1768,0.76905
0.0368,0.0163,0.1774,0.7695
0.03665,0.01665,0.17645,0.77025
0.036,0.0182,0.17485,0.77095
0.0353,0.01835,0.17545,0.7709
0.0353,0.0175,0.1764,0.7708
0.03405,0.0176,0.17715,0.7712
0.0333,0.01745,0.1773,0.77195
0.03375,0.0166,0.1776,0.77205
0.0319,0.017,0.17765,0.77345
0.0317,0.0176,0.17845,0.77225
0.03225,0.0168,0.17915,0.7718
0.03285,0.01565,0.17905,0.77245
0.0345,0.01435,0.1799,0.77125
0.0341,0.0153,0.17955,0.77105
0.0342,0.01565,0.17985,0.7703
0.03395,0.0161,0.18005,0.7699
0.0336,0.0154,0.1814,0.7696
0.0323,0.01575,0.1829,0.76905
0.03215,0.0165,0.1841,0.76725
0.03215,0.0167,0.1846,0.76655
0.03335,0.01555,0.1846,0.7665
0.033,0.0164,0.18405,0.76655
0.0326,0.0165,0.1847,0.7662
0.0324,0.01605,0.1853,0.76625
0.03275,0.0146,0.18685,0.7658
0.03295,0.0152,0.18665,0.7652
0.0341,0.0144,0.1877,0.7638
0.0348,0.0141,0.18825,0.76285
0.0336,0.0141,0.1893,0.763
0.03375,0.0151,0.189,0.76215
0.03345,0.0165,0.18835,0.7617
0.03435,0.01615,0.1876,0.7619
0.0345,0.0164,0.1879,0.7612
0.03465,0.01735,0.18635,0.76165
0.03635,0.0175,0.18635,0.7598
0.036,0.01815,0.1863,0.75955
0.03605,0.01775,0.1864,0.7598
0.03615,0.0182,0.186,0.75965
0.03575,0.01825,0.1863,0.7597
0.03755,0.01725,0.18635,0.75885
0.0369,0.0179,0.18535,0.75985
0.037,0.01795,0.18495,0.7601
0.037,0.0187,0.1841,0.7602
0.0363,0.01805,0.1836,0.76205
0.03705,0.01805,0.183,0.7619
0.0375,0.01785,0.1822,0.76245
0.037,0.01845,0.1824,0.76215
0.0366,0.0171,0.1834,0.7629
0.0355,0.01775,0.18245,0.7643
0.03525,0.0181,0.18195,0.7647
0.03425,0.01775,0.18215,0.76585
0.03505,0.01675,0.18325,0.76495
0.0355,0.01645,0.18375,0.7643
0.03535,0.01615,0.1831,0.7654
0.03435,0.01595,0.18375,0.76595
0.03435,0.0159,0.18375,0.766
0.03385,0.0164,0.1849,0.76485
0.03365,0.0166,0.1857,0.76405
0.03365,0.01695,0.1863,0.7631
0.0336,0.0167,0.1868,0.7629
0.0332,0.0165,0.18745,0.76285
0.03325,0.01755,0.18625,0.76295
0.03375,0.01725,0.1856,0.7634
0.03375,0.01685,0.1856,0.7638
0.0345,0.01645,0.1857,0.76335
0.03455,0.01715,0.1852,0.7631
0.0345,0.0178,0.18535,0.76235
0.0345,0.0175,0.1848,0.7632
0.03375,0.01785,0.18515,0.76325
0.0343,0.017,0.1851,0.7636
0.0346,0.01735,0.18515,0.7629
0.0354,0.01665,0.1849,0.76305
0.03555,0.0156,0.186,0.76285
0.0342,0.0167,0.1853,0.7638
0.03525,0.0168,0.18525,0.7627
0.03555,0.0168,0.18455,0.7631
0.0348,0.01635,0.18535,0.7635
0.0353,0.0171,0.18475,0.76285
0.03585,0.01725,0.1839,0.763
0.03525,0.0181,0.18325,0.7634
0.0351,0.0182,0.1825,0.7642
0.03615,0.01835,0.18165,0.76385
0.0365,0.01775,0.1807,0.76505
0.0362,0.0171,0.17985,0.76685
0.0345,0.0172,0.17935,0.76895
0.0339,0.0173,0.1792,0.7696
0.03365,0.01725,0.17975,0.76935
0.0334,0.01685,0.1797,0.77005
0.0336,0.0164,0.1812,0.7688
0.03375,0.01635,0.181,0.7689
0.0339,0.01615,0.18095,0.769
0.0341,0.0149,0.1817,0.7693
0.03415,0.01365,0.1823,0.7699
0.03335,0.01425,0.18265,0.76975
0.0339,0.01395,0.1822,0.76995
0.0328,0.01485,0.1823,0.77005
0.03185,0.01535,0.18225,0.77055
0.03325,0.0144,0.18175,0.7706
0.033,0.0154,0.18165,0.76995
0.0325,0.0153,0.1817,0.7705
0.03185,0.0153,0.1814,0.77145
0.03205,0.0154,0.1813,0.77125
0.0318,0.01535,0.18125,0.7716
0.0309,0.01535,0.1818,0.77195
0.0302,0.01545,0.1825,0.77185
0.0291,0.01575,0.18365,0.7715
0.02885,0.01525,0.18555,0.77035
0.0303,0.0135,0.1872,0.769
0.03055,0.01385,0.18675,0.76885
0.03095,0.0141,0.18695,0.768
0.03055,0.01335,0.1874,0.7687
0.02975,0.014,0.18665,0.7696
0.0299,0.01475,0.1862,0.76915
0.0294,0.01485,0.18685,0.7689
0.03,0.01505,0.1868,0.76815
0.0301,0.01495,0.1867,0.76825
0.03035,0.01395,0.1872,0.7685
0.0303,0.01425,0.18765,0.7678
0.02975,0.01485,0.18775,0.76765
0.02905,0.01415,0.1899,0.7669
0.02855,0.01455,0.19125,0.76565
0.02875,0.0149,0.19215,0.7642
0.02825,0.0154,0.19305,0.7633
0.02875,0.01525,0.19345,0.76255
0.0286,0.0153,0.19415,0.76195
0.02885,0.0146,0.19495,0.7616
0.0291,0.01485,0.19385,0.7622
0.02865,0.0169,0.1918,0.76265
0.02895,0.01685,0.1915,0.7627
0.03025,0.0166,0.19075,0.7624
0.031,0.0167,0.19,0.7623
0.0311,0.0165,0.19105,0.76135
0.03225,0.01605,0.1916,0.7601
0.03175,0.0165,0.19085,0.7609
0.03255,0.0166,0.1909,0.75995
0.0329,0.0169,0.19,0.7602
0.03255,0.01645,0.18995,0.76105
0.03305,0.01625,0.1893,0.7614
0.0331,0.0167,0.1888,0.7614
0.03265,0.01675,0.18905,0.76155
0.0321,0.017,0.18895,0.76195
0.03175,0.0178,0.1896,0.76085
0.03235,0.01725,0.18845,0.76195
0.03245,0.01675,0.18905,0.76175
0.03225,0.01625,0.1884,0.7631
0.0324,0.01725,0.18725,0.7631
0.0332,0.01635,0.18675,0.7637
0.03375,0.01615,0.18635,0.76375
0.0344,0.01635,0.18685,0.7624
0.03365,0.01695,0.1872,0.7622
0.03435,0.0166,0.1873,0.76175
0.03535,0.01605,0.1873,0.7613
0.03535,0.01625,0.1876,0.7608
0.03515,0.01635,0.188,0.7605
0.0349,0.016,0.18825,0.76085
0.0342,0.01605,0.18765,0.7621
0.03375,0.01635,0.1873,0.7626
0.0334,0.017,0.18565,0.76395
0.0339,0.0172,0.18565,0.76325
0.03515,0.01685,0.1843,0.7637
0.0353,0.01645,0.1841,0.76415
0.036,0.01675,0.18465,0.7626
0.03585,0.01805,0.1834,0.7627
0.037,0.01855,0.18195,0.7625
0.038,0.0172,0.1817,0.7631
0.0379,0.0172,0.18105,0.76385
0.03655,0.0181,0.1802,0.76515
0.036,0.0191,0.1791,0.7658
0.03715,0.0183,0.17965,0.7649
0.03805,0.01625,0.1807,0.765
0.0374,0.0165,0.18155,0.76455
0.0374,0.01715,0.1812,0.76425
0.0359,0.0172,0.181,0.7659
0.03605,0.01705,0.1808,0.7661
0.0366,0.0179,0.18035,0.76515
0.0363,0.0183,0.1807,0.7647
0.03635,0.0175,0.18145,0.7647
0.03665,0.01595,0.18205,0.76535
0.0368,0.0152,0.1822,0.7658
0.0362,0.01595,0.18185,0.766
0.0358,0.01725,0.18075,0.7662
0.0357,0.0169,0.1805,0.7669
0.0353,0.01635,0.1808,0.76755
0.0348,0.0158,0.18125,0.76815
0.03495,0.01665,0.17955,0.76885
0.0353,0.01585,0.17945,0.7694
0.03545,0.0159,0.1795,0.76915
0.0352,0.01585,0.17955,0.7694
0.03565,0.01565,0.1789,0.7698
0.0351,0.01695,0.178,0.76995
0.03485,0.0168,0.178,0.77035
0.03555,0.0157,0.1785,0.77025
0.034,0.01605,0.1818,0.76815
0.03325,0.0158,0.1826,0.76835
0.0335,0.0156,0.18385,0.76705
0.03285,0.0172,0.1839,0.76605
0.03325,0.01625,0.1857,0.7648
0.03395,0.0161,0.1853,0.76465
0.03275,0.01665,0.18605,0.76455
0.0328,0.01525,0.1869,0.76505
0.03225,0.0156,0.1865,0.76565
0.0321,0.01675,0.18635,0.7648
0.0317,0.0169,0.1871,0.7643
0.0329,0.01605,0.1867,0.76435
0.03215,0.01715,0.18585,0.76485
0.03305,0.0168,0.18565,0.7645
0.03385,0.0168,0.18535,0.764
0.03495,0.01625,0.1861,0.7627
0.0344,0.01635,0.1868,0.76245
0.03345,0.01635,0.1872,0.763
0.0336,0.01615,0.1874,0.76285
0.0339,0.01515,0.18815,0.7628
0.03335,0.01515,0.1882,0.7633
0.03295,0.0164,0.1881,0.76255
0.03335,0.01585,0.1885,0.7623
0.0331,0.01765,0.1873,0.76195
0.03445,0.0173,0.1873,0.76095
0.0343,0.01605,0.1875,0.76215
0.0337,0.01565,0.1879,0.76275
0.03415,0.0156,0.1876,0.76265
0.03435,0.0152,0.18855,0.7619
0.0343,0.0167,0.1884,0.7606
0.0339,0.01715,0.18815,0.7608
0.03325,0.0179,0.1885,0.76035
0.03435,0.01775,0.18815,0.75975
0.03355,0.0172,0.18895,0.7603
0.03425,0.0161,0.1894,0.76025
0.0351,0.01575,0.18935,0.7598
0.03595,0.01645,0.18885,0.75875
0.03555,0.0168,0.1878,0.75985
0.0361,0.01655,0.18775,0.7596
0.0357,0.01695,0.1876,0.75975
0.0348,0.01755,0.18675,0.7609
0.03645,0.01715,0.18645,0.75995
0.03585,0.0181,0.1871,0.75895
0.03695,0.01715,0.1872,0.7587
0.037,0.01715,0.1871,0.75875
0.0371,0.0174,0.18675,0.75875
0.03735,0.01835,0.18465,0.75965
0.0381,0.01815,0.1844,0.75935
0.03755,0.01935,0.1836,0.7595
0.0383,0.01925,0.18255,0.7599
0.03935,0.0188,0.18125,0.7606
0.0387,0.01845,0.18215,0.7607
0.03725,0.01865,0.18155,0.76255
0.0371,0.01865,0.1814,0.76285
0.0388,0.01775,0.18135,0.7621
0.03835,0.01875,0.17945,0.76345
0.03855,0.0176,0.1787,0.76515
0.0381,0.0175,0.1781,0.7663
0.0366,0.01815,0.17795,0.7673
0.03715,0.0175,0.17865,0.7667
0.0366,0.0173,0.1793,0.7668
0.0375,0.0163,0.17935,0.76685
0.0376,0.0161,0.1789,0.7674
0.0372,0.0179,0.17675,0.76815
0.03855,0.0173,0.17635,0.7678
0.03915,0.01805,0.17625,0.76655
0.0388,0.01825,0.17535,0.7676
0.0381,0.01855,0.1747,0.76865
0.0399,0.01685,0.1742,0.76905
0.03885,0.017,0.1743,0.76985
0.03785,0.0176,0.17415,0.7704
0.0378,0.01805,0.17315,0.771
0.03815,0.01795,0.17315,0.77075
0.0378,0.0185,0.17275,0.77095
0.03845,0.01805,0.1719,0.7716
0.0383,0.0176,0.17225,0.77185
0.0377,0.0169,0.17295,0.77245
0.0374,0.0179,0.1723,0.7724
0.0367,0.018,0.1736,0.7717
0.03535,0.01825,0.17305,0.77335
0.0365,0.01695,0.17445,0.7721
0.03605,0.01775,0.1744,0.7718
0.03685,0.01855,0.17355,0.77105
0.03725,0.0189,0.172,0.77185
0.0363,0.0193,0.17275,0.77165
0.03755,0.0183,0.17305,0.7711
0.03715,0.01715,0.1737,0.772
0.03665,0.0173,0.1741,0.77195
0.03715,0.01765,0.1736,0.7716
0.03715,0.0179,0.173,0.77195
0.0377,0.01725,0.1745,0.77055
0.0381,0.01765,0.17345,0.7708
0.0369,0.0179,0.17325,0.77195
0.0373,0.0175,0.1737,0.7715
0.03645,0.0181,0.1735,0.77195
0.0368,0.01815,0.17275,0.7723
0.0376,0.0164,0.17285,0.77315
0.0369,0.01725,0.17255,0.7733
0.03705,0.01715,0.1729,0.7729
0.0363,0.01705,0.1733,0.77335
0.0366,0.0158,0.1741,0.7735
0.0368,0.01475,0.175,0.77345
0.0363,0.0145,0.1752,0.774
0.0346,0.01485,0.17555,0.775
0.03345,0.0148,0.17565,0.7761
0.0325,0.01525,0.17685,0.7754
0.0323,0.0151,0.1769,0.7757
0.03205,0.0149,0.17805,0.775
0.03165,0.0149,0.1786,0.77485
0.0314,0.0146,0.1796,0.7744
0.0315,0.0153,0.1802,0.773
0.03175,0.01555,0.1805,0.7722
0.03135,0.01565,0.18005,0.77295
0.03145,0.0155,0.18065,0.7724
0.0323,0.01435,0.1813,0.77205
0.03205,0.01445,0.18315,0.77035
0.0322,0.01555,0.1827,0.76955
0.03245,0.01495,0.18405,0.76855
0.03195,0.0157,0.184,0.76835
0.03195,0.0171,0.18435,0.7666
0.03305,0.0166,0.1843,0.76605
0.03415,0.01665,0.1844,0.7648
0.03385,0.0169,0.18355,0.7657
0.03455,0.01655,0.1829,0.766
0.03425,0.0166,0.18295,0.7662
0.03395,0.0168,0.18325,0.766
0.0342,0.01625,0.1832,0.76635
0.034,0.0166,0.18355,0.76585
0.03295,0.0158,0.1847,0.76655
0.03265,0.01715,0.18455,0.76565
0.03245,0.0172,0.18435,0.766
0.0323,0.0173,0.18405,0.76635
0.03325,0.01755,0.18335,0.76585
0.0328,0.0174,0.18325,0.76655
0.03305,0.01775,0.184,0.7652
0.0323,0.0177,0.1838,0.7662
0.032,0.01845,0.1839,0.76565
0.03315,0.0164,0.1855,0.76495
0.03315,0.0168,0.1858,0.76425
0.0334,0.0158,0.18605,0.76475
0.03325,0.0165,0.1864,0.76385
0.0334,0.01695,0.18725,0.7624
0.0347,0.0158,0.18685,0.76265
0.03425,0.017,0.1865,0.76225
0.0345,0.01785,0.18545,0.7622
0.03525,0.01715,0.18535,0.76225
0.0366,0.016,0.187,0.7604
0.0367,0.0156,0.1869,0.7608
0.0357,0.0172,0.18615,0.76095
0.03575,0.01745,0.18525,0.76155
0.035,0.0177,0.1835,0.7638
0.035,0.0182,0.18275,0.76405
0.0361,0.0173,0.18435,0.76225
0.0353,0.01805,0.18355,0.7631
0.03595,0.0166,0.18315,0.7643
0.03605,0.0159,0.1839,0.76415
