I,E,S,R
0.001,0.00065,0.99835,0
0.00105,0.00145,0.99735,0.00015
0.0012,0.0022,0.9963,0.0003
0.0017,0.00255,0.99525,0.0005
0.00225,0.00305,0.99405,0.00065
0.0031,0.0041,0.992,0.0008
0.00385,0.00565,0.9894,0.0011
0.0048,0.00735,0.986,0.00185
0.00615,0.0089,0.9826,0.00235
0.00745,0.0117,0.9774,0.00345
0.0095,0.01515,0.971,0.00435
0.0128,0.0185,0.9632,0.0055
0.01575,0.0254,0.95175,0.0071
0.02135,0.03125,0.9383,0.0091
0.027,0.04095,0.91985,0.0122
0.03465,0.0495,0.89925,0.0166
0.04355,0.0628,0.87295,0.0207
0.0536,0.07665,0.8431,0.02665
0.0685,0.09585,0.8025,0.03315
0.0871,0.114,0.757,0.0419
0.10855,0.13755,0.70115,0.05275
0.13295,0.1601,0.63915,0.0678
0.1618,0.18375,0.5693,0.08515
0.193,0.20525,0.494,0.10775
0.2255,0.2201,0.4215,0.1329
0.25825,0.2294,0.35005,0.1623
0.29295,0.2304,0.282,0.19465
0.3211,0.2254,0.22125,0.23225
0.3451,0.21085,0.17155,0.2725
0.36265,0.1887,0.1313,0.31735
0.3657,0.16945,0.09835,0.3665
0.36895,0.14445,0.07545,0.41115
0.36545,0.11975,0.0582,0.4566
0.35025,0.0997,0.04625,0.5038
0.3339,0.0819,0.03695,0.54725
0.3139,0.0651,0.03135,0.58965
0.29465,0.05365,0.0261,0.6256
0.2701,0.04375,0.0222,0.66395
0.244,0.03525,0.0205,0.70025
0.2228,0.0283,0.01915,0.72975
0.20095,0.02305,0.01915,0.75685
0.18075,0.01835,0.019,0.7819
0.16255,0.0156,0.01915,0.8027
0.14495,0.01265,0.01995,0.82245
0.1296,0.01095,0.0206,0.83885
0.11425,0.0093,0.0225,0.85395
0.10115,0.008,0.0233,0.86755
0.0902,0.00675,0.02455,0.8785
0.0801,0.005,0.0267,0.8882
0.0696,0.0042,0.02925,0.89695
0.0612,0.00435,0.0315,0.90295
0.0527,0.0045,0.03375,0.90905
0.04675,0.0048,0.0353,0.91315
0.04085,0.004,0.0385,0.91665
0.0367,0.00395,0.0403,0.91905
0.03225,0.00365,0.0427,0.9214
0.0286,0.00375,0.045,0.92265
0.0255,0.00315,0.04815,0.9232
0.0236,0.00285,0.05085,0.9227
0.02045,0.0035,0.05335,0.9227
0.01875,0.0031,0.05615,0.922
0.01695,0.00255,0.0591,0.9214
0.01535,0.0021,0.06175,0.9208
0.01375,0.00225,0.0652,0.9188
0.0121,0.00235,0.0672,0.91835
0.01095,0.0025,0.07055,0.916
0.0102,0.00245,0.07265,0.9147
0.009,0.00255,0.07525,0.9132
0.00835,0.0025,0.0783,0.91085
0.0077,0.00205,0.0809,0.90935
0.0072,0.0019,0.0837,0.9072
0.00705,0.00165,0.0861,0.9052
0.00645,0.00125,0.0891,0.9032
0.00625,0.0011,0.0918,0.90085
0.00575,0.00105,0.0944,0.8988
0.00535,0.00095,0.0965,0.8972
0.00455,0.0011,0.09985,0.8945
0.0044,0.0012,0.10245,0.89195
0.0044,0.001,0.10555,0.88905
0.0039,0.001,0.1085,0.8866
0.00375,0.00135,0.10985,0.88505
0.00355,0.0013,0.1129,0.88225
0.00345,0.0012,0.115,0.88035
0.0031,0.00125,0.1175,0.87815
0.003,0.0014,0.11995,0.87565
0.00295,0.0015,0.12215,0.8734
0.00295,0.0013,0.12495,0.8708
0.00265,0.00145,0.12795,0.86795
0.0028,0.0012,0.13085,0.86515
0.0026,0.0014,0.1327,0.8633
0.0026,0.0011,0.13535,0.86095
0.00235,0.0011,0.1376,0.85895
0.00245,0.0011,0.1401,0.85635
0.00235,0.0011,0.1427,0.85385
0.0023,0.00105,0.1453,0.85135
0.0022,0.00095,0.14745,0.8494
0.00225,0.00105,0.1493,0.8474
0.0022,0.0009,0.15135,0.84555
0.0022,0.0008,0.1538,0.8432
0.0023,0.0006,0.1558,0.8413
0.00215,0.00065,0.1577,0.8395
0.0022,0.00045,0.16035,0.837
0.00185,0.00065,0.1625,0.835
0.00175,0.00075,0.16415,0.83335
0.00195,0.0006,0.16665,0.8308
0.00185,0.0009,0.1689,0.82835
0.0017,0.00085,0.1709,0.82655
0.0018,0.0008,0.17275,0.82465
0.002,0.0006,0.1759,0.8215
0.00195,0.00065,0.178,0.8194
0.0019,0.0007,0.17995,0.81745
0.0019,0.0009,0.18185,0.81535
0.00195,0.0009,0.18335,0.8138
0.00185,0.0008,0.18535,0.812
0.0018,0.00085,0.18685,0.8105
0.00215,0.00075,0.189,0.8081
0.0022,0.00085,0.19125,0.8057
0.0021,0.00095,0.19395,0.803
0.00215,0.001,0.19605,0.8008
0.00195,0.0011,0.19825,0.7987
0.00205,0.001,0.20035,0.7966
0.00205,0.00095,0.2021,0.7949
0.00185,0.00105,0.20395,0.79315
0.00185,0.00095,0.20615,0.79105
0.00175,0.00095,0.20805,0.78925
0.0016,0.00115,0.2103,0.78695
0.00185,0.001,0.21265,0.7845
0.00205,0.0011,0.2149,0.78195
0.0019,0.00105,0.21745,0.7796
0.00195,0.0012,0.2189,0.77795
0.0021,0.0013,0.2207,0.7759
0.00245,0.00095,0.2222,0.7744
0.0024,0.0013,0.2243,0.772
0.00235,0.00115,0.22545,0.77105
0.0025,0.00105,0.2269,0.76955
0.00255,0.00105,0.22855,0.76785
0.00255,0.0012,0.2302,0.76605
0.0024,0.0015,0.23205,0.76405
0.0026,0.00185,0.2344,0.76115
0.0025,0.002,0.2361,0.7594
0.0027,0.00235,0.2375,0.75745
0.00325,0.00215,0.2392,0.7554
0.0036,0.00205,0.2414,0.75295
0.00395,0.002,0.24285,0.7512
0.004,0.00195,0.24395,0.7501
0.00395,0.0021,0.24545,0.7485
0.00385,0.0024,0.24675,0.747
0.0041,0.0022,0.24875,0.74495
0.00425,0.00215,0.25015,0.74345
0.0041,0.0023,0.2516,0.742
0.00405,0.00275,0.2529,0.7403
0.0043,0.0029,0.25385,0.73895
0.00465,0.0026,0.25525,0.7375
0.0046,0.0028,0.25625,0.73635
0.00485,0.00295,0.2578,0.7344
0.0053,0.00275,0.2596,0.73235
0.00585,0.0028,0.26075,0.7306
0.0063,0.0033,0.2609,0.7295
0.0063,0.0029,0.2624,0.7284
0.0064,0.00365,0.2626,0.72735
0.00675,0.0037,0.26375,0.7258
0.0068,0.0041,0.2647,0.7244
0.00705,0.0049,0.26485,0.7232
0.00715,0.00525,0.2652,0.7224
0.0078,0.00545,0.26585,0.7209
0.00785,0.0064,0.26595,0.7198
0.0086,0.0063,0.26685,0.71825
0.00905,0.00645,0.2672,0.7173
0.0099,0.00645,0.2672,0.71645
0.01055,0.00665,0.26715,0.71565
0.0109,0.00735,0.2672,0.71455
0.01105,0.0078,0.26765,0.7135
0.01135,0.0075,0.2686,0.71255
0.01255,0.007,0.2692,0.71125
0.01345,0.00805,0.2682,0.7103
0.0141,0.00825,0.26795,0.7097
0.0146,0.00795,0.26805,0.7094
0.01465,0.0096,0.26705,0.7087
0.0152,0.00995,0.2665,0.70835
0.0162,0.01125,0.26485,0.7077
0.0172,0.01125,0.26405,0.7075
0.01835,0.01225,0.26215,0.70725
0.01855,0.01335,0.26005,0.70805
0.01965,0.01395,0.25835,0.70805
0.0204,0.0148,0.2561,0.7087
0.0228,0.0152,0.2526,0.7094
0.0247,0.01495,0.25045,0.7099
0.0254,0.0154,0.24835,0.71085
0.0261,0.017,0.2457,0.7112
0.02735,0.0172,0.24275,0.7127
0.02865,0.0172,0.24015,0.714
0.0292,0.017,0.2375,0.7163
0.02965,0.0172,0.2345,0.71865
0.03105,0.0173,0.23145,0.7202
0.0315,0.01885,0.22815,0.7215
0.03275,0.01835,0.2257,0.7232
0.0342,0.01825,0.222,0.72555
0.03405,0.01965,0.2183,0.728
0.03435,0.0206,0.2146,0.73045
0.0358,0.02045,0.21105,0.7327
0.03565,0.0204,0.2086,0.73535
0.03655,0.02025,0.2065,0.7367
0.0381,0.0199,0.20315,0.73885
0.03805,0.0214,0.19945,0.7411
0.0381,0.02215,0.19495,0.7448
0.03925,0.02265,0.19115,0.74695
0.0402,0.02335,0.1877,0.74875
0.04165,0.02265,0.18455,0.75115
0.04365,0.02145,0.1816,0.7533
0.04315,0.02175,0.17855,0.75655
0.04315,0.0218,0.1758,0.75925
0.04395,0.0211,0.17335,0.7616
0.0441,0.0209,0.17165,0.76335
0.0444,0.0206,0.1679,0.7671
0.0438,0.01985,0.1667,0.76965
0.0446,0.0185,0.1643,0.7726
0.04415,0.01875,0.1613,0.7758
0.0426,0.0187,0.15945,0.77925
0.04335,0.0185,0.1574,0.78075
0.04195,0.01915,0.15525,0.78365
0.04165,0.0182,0.15335,0.7868
0.0423,0.0169,0.1524,0.7884
0.04145,0.01665,0.1513,0.7906
0.04055,0.01655,0.15125,0.79165
0.0395,0.01705,0.15,0.79345
0.0389,0.017,0.149,0.7951
0.0395,0.016,0.1474,0.7971
0.038,0.0158,0.1474,0.7988
0.03745,0.01565,0.14735,0.79955
0.03775,0.01415,0.1475,0.8006
0.03595,0.01485,0.14695,0.80225
0.03605,0.01535,0.14595,0.80265
0.03705,0.01465,0.1453,0.803
0.03545,0.01565,0.1444,0.8045
0.0361,0.0149,0.14405,0.80495
0.03475,0.0164,0.14405,0.8048
0.03525,0.0152,0.1435,0.80605
0.0346,0.01435,0.1446,0.80645
0.03415,0.01365,0.14435,0.80785
0.0335,0.01335,0.1453,0.80785
0.0339,0.01265,0.1464,0.80705
0.03245,0.0134,0.14775,0.8064
0.03115,0.0131,0.1481,0.80765
0.03145,0.0121,0.15005,0.8064
0.03,0.01245,0.1501,0.80745
0.03,0.0115,0.15125,0.80725
0.0284,0.01165,0.1523,0.80765
0.0279,0.01195,0.1533,0.80685
0.0284,0.01115,0.155,0.80545
0.02815,0.01155,0.15585,0.80445
0.02775,0.01165,0.15665,0.80395
0.0274,0.01215,0.15705,0.8034
0.02685,0.0116,0.15865,0.8029
0.026,0.0121,0.15915,0.80275
0.0262,0.0117,0.16105,0.80105
0.02595,0.01175,0.162,0.8003
0.026,0.0113,0.16285,0.79985
0.0248,0.01135,0.16425,0.7996
0.02485,0.01055,0.16445,0.80015
0.02505,0.01025,0.16665,0.79805
0.02465,0.01115,0.1673,0.7969
0.02415,0.0114,0.1685,0.79595
0.0243,0.0116,0.1689,0.7952
0.0241,0.0111,0.171,0.7938
0.0247,0.0103,0.173,0.792
0.02445,0.00995,0.1743,0.7913
0.02385,0.01025,0.1763,0.7896
0.02345,0.00965,0.17765,0.78925
0.02315,0.0096,0.17975,0.7875
0.02225,0.01055,0.18065,0.78655
0.0227,0.01085,0.1815,0.78495
0.0229,0.01195,0.18235,0.7828
0.02325,0.0115,0.1842,0.78105
0.02395,0.0119,0.1848,0.77935
0.02475,0.01175,0.18555,0.77795
0.0247,0.01145,0.18795,0.7759
0.0249,0.0117,0.1885,0.7749
0.02475,0.012,0.18955,0.7737
0.02395,0.0122,0.19085,0.773
0.0246,0.0115,0.19185,0.77205
0.02465,0.013,0.1915,0.77085
0.02465,0.0128,0.19165,0.7709
0.02515,0.01275,0.19145,0.77065
0.0253,0.0128,0.1912,0.7707
0.02595,0.0124,0.19235,0.7693
0.0264,0.01425,0.1907,0.76865
0.02655,0.0143,0.19125,0.7679
0.02655,0.0147,0.19075,0.768
0.0273,0.0149,0.1901,0.7677
0.02785,0.0149,0.1902,0.76705
0.0286,0.0136,0.19025,0.76755
0.02875,0.01325,0.19075,0.76725
0.0286,0.0131,0.1914,0.7669
0.0289,0.01255,0.19195,0.7666
0.02855,0.01195,0.19315,0.76635
0.0286,0.01285,0.1926,0.76595
0.02715,0.0138,0.1936,0.76545
0.0275,0.0143,0.19475,0.76345
0.02725,0.015,0.19465,0.7631
0.028,0.0156,0.19405,0.76235
0.0284,0.01435,0.19505,0.7622
0.02865,0.01465,0.19585,0.76085
0.02955,0.01535,0.19605,0.75905
0.03025,0.0156,0.19565,0.7585
0.03015,0.01585,0.19565,0.75835
0.0299,0.0167,0.19495,0.75845
0.03125,0.0163,0.19435,0.7581
0.03155,0.0165,0.1942,0.75775
0.032,0.0159,0.1942,0.7579
0.0323,0.01675,0.19295,0.758
0.03185,0.0174,0.1925,0.75825
0.0329,0.0164,0.1934,0.7573
0.03305,0.01695,0.19265,0.75735
0.0335,0.01705,0.1921,0.75735
0.0339,0.0159,0.1924,0.7578
0.03235,0.01735,0.19245,0.75785
0.03355,0.01715,0.19195,0.75735
0.03365,0.017,0.1916,0.75775
0.0346,0.0162,0.1913,0.7579
0.0353,0.01625,0.19135,0.7571
0.03495,0.01685,0.19045,0.75775
0.0338,0.0168,0.1902,0.7592
0.0326,0.01695,0.1901,0.76035
0.03295,0.017,0.19095,0.7591
0.03425,0.01635,0.18995,0.75945
0.03395,0.01655,0.18995,0.75955
0.0342,0.01685,0.1882,0.76075
0.03305,0.0182,0.1874,0.76135
0.0328,0.01885,0.1869,0.76145
0.03375,0.0173,0.18765,0.7613
0.03395,0.017,0.1876,0.76145
0.036,0.01605,0.1878,0.76015
0.0351,0.01655,0.18855,0.7598
0.03425,0.01745,0.1879,0.7604
0.03505,0.0162,0.1884,0.76035
0.0345,0.01715,0.1871,0.76125
0.0341,0.0176,0.18775,0.76055
0.034,0.0184,0.1876,0.76
0.03345,0.01885,0.18765,0.76005
0.03395,0.01885,0.1878,0.7594
0.03485,0.0189,0.18765,0.7586
0.03465,0.01925,0.1881,0.758
0.03545,0.01875,0.18825,0.75755
0.03555,0.019,0.18725,0.7582
0.03735,0.0197,0.18565,0.7573
0.03745,0.0199,0.18405,0.7586
0.0379,0.0205,0.1834,0.7582
0.03735,0.01985,0.183,0.7598
0.0377,0.01795,0.18425,0.7601
0.03835,0.01775,0.18355,0.76035
0.038,0.01805,0.1822,0.76175
0.0379,0.0182,0.18195,0.76195
0.0386,0.0183,0.18185,0.76125
0.03925,0.01765,0.1807,0.7624
0.039,0.0176,0.1804,0.763
0.0392,0.01835,0.17835,0.7641
0.03975,0.0188,0.17695,0.7645
0.04005,0.0182,0.17685,0.7649
0.03865,0.01865,0.17685,0.76585
0.03985,0.0178,0.176,0.76635
0.0388,0.01825,0.1753,0.76765
0.03955,0.0178,0.17465,0.768
0.0397,0.01635,0.17575,0.7682
0.0394,0.0173,0.17415,0.76915
0.03875,0.01835,0.1727,0.7702
0.0387,0.01825,0.17165,0.7714
0.0383,0.01835,0.1715,0.77185
0.0384,0.0177,0.17105,0.77285
0.03865,0.0172,0.17205,0.7721
0.03785,0.0166,0.17145,0.7741
0.0371,0.0163,0.17205,0.77455
0.0369,0.01655,0.172,0.77455
0.0374,0.016,0.1722,0.7744
0.03605,0.0169,0.1726,0.77445
0.03545,0.01735,0.17235,0.77485
0.03575,0.01815,0.1711,0.775
0.03725,0.01625,0.17235,0.77415
0.03635,0.01715,0.17295,0.77355
0.0368,0.01665,0.1739,0.77265
0.0357,0.0159,0.175,0.7734
0.0355,0.0167,0.175,0.7728
0.0359,0.0167,0.1747,0.7727
0.03635,0.01685,0.1741,0.7727
0.0363,0.0166,0.1743,0.7728
0.0357,0.01675,0.1744,0.77315
0.0363,0.01615,0.17535,0.7722
0.03525,0.0163,0.1748,0.77365
0.03545,0.01695,0.17485,0.77275
0.0371,0.01635,0.1756,0.77095
0.03675,0.01695,0.17505,0.77125
0.03695,0.0159,0.17645,0.7707
0.03465,0.01735,0.17545,0.77255
0.0356,0.0169,0.17525,0.77225
0.03615,0.0161,0.17525,0.7725
0.0362,0.01565,0.176,0.77215
0.0357,0.0163,0.17635,0.77165
0.03655,0.0156,0.1769,0.77095
0.03785,0.01505,0.17735,0.76975
0.03695,0.01545,0.1778,0.7698
0.03625,0.0154,0.17835,0.77
0.03685,0.01575,0.17795,0.76945
0.0363,0.01635,0.17755,0.7698
0.03505,0.01655,0.17805,0.77035
0.03445,0.01735,0.17785,0.77035
0.0352,0.0163,0.1781,0.7704
0.0342,0.01715,0.17715,0.7715
0.035,0.01695,0.17605,0.772
0.0342,0.01775,0.17625,0.7718
0.03545,0.01665,0.1759,0.772
0.0355,0.01685,0.176,0.77165
0.0361,0.0155,0.1761,0.7723
0.0363,0.0155,0.1758,0.7724
0.03555,0.0151,0.17715,0.7722
0.0352,0.0145,0.17765,0.77265
0.034,0.0152,0.17835,0.77245
0.0337,0.0162,0.17805,0.77205
0.03375,0.01615,0.17845,0.77165
0.0343,0.01625,0.179,0.77045
0.03465,0.01645,0.17805,0.77085
0.035,0.0162,0.1775,0.7713
0.03485,0.01625,0.1778,0.7711
0.03485,0.0167,0.1782,0.77025
0.0348,0.0165,0.1786,0.7701
0.0345,0.01685,0.17825,0.7704
0.03485,0.01705,0.17885,0.76925
0.0356,0.01765,0.1774,0.76935
0.03605,0.01725,0.1772,0.7695
0.03615,0.0179,0.17625,0.7697
0.03625,0.01805,0.17585,0.76985
0.0362,0.0176,0.176,0.7702
0.0368,0.0174,0.17515,0.77065
0.03685,0.01715,0.17475,0.77125
0.0364,0.01565,0.1757,0.77225
0.03655,0.0154,0.17605,0.772
0.0364,0.0155,0.1756,0.7725
0.0361,0.01675,0.17495,0.7722
0.03635,0.01645,0.17475,0.77245
0.03635,0.01635,0.17455,0.77275
0.03675,0.0159,0.17445,0.7729
0.0356,0.0172,0.1738,0.7734
0.0358,0.01695,0.1735,0.77375
0.03525,0.01685,0.17415,0.77375
0.035,0.01635,0.17545,0.7732
0.0345,0.0162,0.1763,0.773
0.03345,0.0171,0.1758,0.77365
0.03415,0.01615,0.1767,0.773
0.03425,0.0166,0.17655,0.7726
0.03435,0.01565,0.17705,0.77295
0.034,0.0151,0.1792,0.7717
0.03415,0.0153,0.18,0.77055
0.03395,0.01515,0.1806,0.7703
0.0339,0.01445,0.1809,0.77075
0.0338,0.0141,0.18225,0.76985
0.0323,0.0141,0.1836,0.77
0.03215,0.01405,0.18475,0.76905
0.03255,0.01445,0.18475,0.76825
0.03255,0.0141,0.1847,0.76865
0.03205,0.0151,0.1841,0.76875
0.0309,0.0161,0.18445,0.76855
0.0309,0.0158,0.1852,0.7681
0.0325,0.01565,0.18395,0.7679
0.0325,0.01675,0.1835,0.76725
0.0335,0.0159,0.18355,0.76705
0.03455,0.0156,0.18405,0.7658
0.0347,0.01585,0.18355,0.7659
0.0348,0.01585,0.18335,0.766
0.0334,0.01675,0.18335,0.7665
0.034,0.0173,0.18175,0.76695
0.03415,0.01695,0.18085,0.76805
0.0343,0.01665,0.18055,0.7685
0.0343,0.0163,0.1815,0.7679
0.03405,0.01595,0.18185,0.76815
0.0341,0.0154,0.18245,0.76805
0.0325,0.0158,0.18265,0.76905
0.03325,0.01555,0.1827,0.7685
0.03225,0.01505,0.1843,0.7684
0.03155,0.015,0.1852,0.76825
0.03135,0.0145,0.18625,0.7679
0.03175,0.01435,0.1874,0.7665
0.0326,0.0141,0.1884,0.7649
0.0331,0.01505,0.1871,0.76475
0.0337,0.01585,0.1864,0.76405
0.0341,0.01625,0.1869,0.76275
0.03335,0.01605,0.18855,0.76205
0.03345,0.0157,0.189,0.76185
0.03385,0.0154,0.1885,0.76225
0.0329,0.01705,0.18795,0.7621
0.0319,0.01775,0.18675,0.7636
0.0321,0.01685,0.18735,0.7637
0.0323,0.0167,0.1876,0.7634
0.0315,0.01765,0.18745,0.7634
0.0322,0.0168,0.1874,0.7636
0.033,0.0169,0.18665,0.76345
0.03285,0.0173,0.1857,0.76415
0.03445,0.01665,0.1855,0.7634
0.03375,0.01725,0.18455,0.76445
0.03405,0.01655,0.1857,0.7637
0.0339,0.01705,0.18445,0.7646
0.0349,0.01665,0.1839,0.76455
0.03415,0.01745,0.1841,0.7643
0.03565,0.0159,0.18485,0.7636
0.03685,0.0157,0.18475,0.7627
0.0368,0.0155,0.18645,0.76125
0.03645,0.0163,0.18695,0.7603
0.03675,0.01615,0.1877,0.7594
0.0365,0.0166,0.1876,0.7593
0.03645,0.0163,0.1875,0.75975
0.03595,0.01665,0.1882,0.7592
0.03615,0.01635,0.18825,0.75925
0.035,0.0171,0.1881,0.7598
0.03485,0.01775,0.1875,0.7599
0.0351,0.01825,0.1876,0.75905
0.03585,0.01835,0.18735,0.75845
0.0366,0.0187,0.18715,0.75755
0.03535,0.0187,0.18735,0.7586
0.0362,0.0182,0.1875,0.7581
0.0358,0.0175,0.1876,0.7591
0.0354,0.01745,0.18755,0.7596
0.03545,0.0171,0.1866,0.76085
0.03705,0.01685,0.18655,0.75955
0.03655,0.01695,0.1867,0.7598
0.03615,0.0175,0.18625,0.7601
0.0369,0.01755,0.1861,0.75945
0.03775,0.01655,0.18645,0.75925
0.0383,0.0173,0.1858,0.7586
0.0376,0.01895,0.1847,0.75875
0.03835,0.019,0.18445,0.7582
0.03935,0.01885,0.1835,0.7583
0.0384,0.01845,0.1839,0.75925
0.04015,0.0169,0.18395,0.759
0.0405,0.01735,0.1827,0.75945
0.03975,0.0178,0.1817,0.76075
0.03975,0.01825,0.1804,0.7616
0.0406,0.0184,0.1799,0.7611
0.03965,0.0194,0.1784,0.76255
0.04005,0.01815,0.1789,0.7629
0.0401,0.01765,0.1784,0.76385
0.03955,0.01805,0.1781,0.7643
0.03965,0.0181,0.1779,0.76435
0.03825,0.01785,0.17925,0.76465
0.0375,0.018,0.1784,0.7661
0.03965,0.018,0.1777,0.76465
0.03935,0.0172,0.1767,0.76675
0.03905,0.0184,0.1767,0.76585
0.0396,0.01825,0.1765,0.76565
0.03895,0.01905,0.17595,0.76605
0.03895,0.0188,0.17505,0.7672
0.0391,0.01785,0.1757,0.76735
0.04015,0.0182,0.1746,0.76705
0.0403,0.01775,0.17445,0.7675
0.0396,0.01775,0.1745,0.76815
0.0389,0.01675,0.17525,0.7691
0.0386,0.01585,0.17575,0.7698
0.0384,0.01725,0.1747,0.76965
0.0385,0.01705,0.17535,0.7691
0.03945,0.0165,0.17595,0.7681
0.03955,0.01715,0.1751,0.7682
0.0391,0.01715,0.1748,0.76895
0.0382,0.01755,0.1747,0.76955
0.0375,0.01705,0.1759,0.76955
0.0376,0.01695,0.17595,0.7695
0.0372,0.01795,0.1754,0.76945
0.03625,0.0179,0.1752,0.77065
0.03615,0.0174,0.17525,0.7712
0.03595,0.0172,0.1754,0.77145
0.03605,0.01625,0.1756,0.7721
0.0351,0.01635,0.17485,0.7737
0.0358,0.01595,0.17605,0.7722
0.036,0.01675,0.1763,0.77095
0.03545,0.0173,0.17535,0.7719
0.03585,0.01715,0.1751,0.7719
0.03645,0.01695,0.1753,0.7713
0.03745,0.0161,0.17605,0.7704
0.03625,0.016,0.1756,0.77215
0.0355,0.0158,0.1765,0.7722
0.03495,0.01545,0.1776,0.772
0.03505,0.0151,0.179,0.77085
0.03485,0.0159,0.1794,0.76985
0.03465,0.016,0.18015,0.7692
0.0347,0.01655,0.1814,0.76735
0.03535,0.01655,0.18255,0.76555
0.03325,0.01705,0.1822,0.7675
0.03325,0.017,0.1837,0.76605
0.0336,0.01815,0.1829,0.76535
0.03425,0.01725,0.18285,0.76565
0.0343,0.0166,0.1837,0.7654
0.0345,0.0167,0.1827,0.7661
0.03435,0.01755,0.18265,0.76545
0.0342,0.01715,0.18265,0.766
0.03455,0.0155,0.1842,0.76575
0.0348,0.01525,0.1842,0.76575
0.0342,0.0158,0.18535,0.76465
0.03395,0.0164,0.1856,0.76405
0.03515,0.01675,0.18465,0.76345
0.03595,0.01705,0.18395,0.76305
0.0358,0.01685,0.1835,0.76385
0.03545,0.0172,0.1835,0.76385
0.0363,0.01695,0.18335,0.7634
0.0354,0.0181,0.18355,0.76295
0.03555,0.0184,0.18205,0.764
0.0359,0.01795,0.18255,0.7636
0.0367,0.0174,0.18075,0.76515
0.036,0.0201,0.17825,0.76565
0.0364,0.01955,0.17835,0.7657
0.03585,0.01965,0.1797,0.7648
0.03745,0.01835,0.17895,0.76525
0.0384,0.01805,0.17835,0.7652
0.038,0.0173,0.17945,0.76525
0.03865,0.01655,0.1804,0.7644
0.0374,0.01635,0.18095,0.7653
0.0384,0.01625,0.1798,0.76555
0.03805,0.0161,0.17995,0.7659
0.03715,0.0154,0.18055,0.7669
0.037,0.0162,0.1791,0.7677
0.03665,0.01645,0.17925,0.76765
0.037,0.01665,0.17905,0.7673
0.03765,0.0165,0.17925,0.7666
0.03735,0.0186,0.1784,0.76565
0.03825,0.0183,0.17855,0.7649
0.03775,0.01915,0.1784,0.7647
0.0373,0.0209,0.1767,0.7651
0.03885,0.0196,0.1776,0.76395
0.03905,0.0205,0.1764,0.76405
0.04085,0.0186,0.17675,0.7638
0.0402,0.01885,0.1758,0.76515
0.03995,0.01845,0.1763,0.7653
0.0404,0.01785,0.17565,0.7661
0.03995,0.0181,0.17475,0.7672
0.03875,0.01895,0.1742,0.7681
0.03835,0.0192,0.1741,0.76835
0.03745,0.02005,0.17355,0.76895
0.03755,0.0194,0.17335,0.7697
0.03785,0.02005,0.1723,0.7698
0.03865,0.02025,0.1712,0.7699
0.03855,0.0198,0.17125,0.7704
0.0395,0.01875,0.17095,0.7708
0.04035,0.018,0.17175,0.7699
0.04,0.01755,0.1713,0.77115
0.0392,0.018,0.1708,0.772
0.0399,0.0179,0.1706,0.7716
0.0395,0.01755,0.1702,0.77275
0.0391,0.017,0.17045,0.77345
0.03825,0.0175,0.1706,0.77365
0.03915,0.01725,0.1708,0.7728
0.0385,0.0171,0.17145,0.77295
0.0392,0.01705,0.17105,0.7727
0.03845,0.01615,0.17215,0.77325
0.03775,0.01645,0.1715,0.7743
0.0368,0.0168,0.17155,0.77485
0.03675,0.0156,0.1725,0.77515
0.03555,0.01575,0.17285,0.77585
0.03485,0.01565,0.17355,0.77595
0.03465,0.0157,0.17375,0.7759
0.0342,0.01655,0.17385,0.7754
0.0345,0.0161,0.1745,0.7749
0.0346,0.01685,0.1747,0.77385
0.03495,0.0166,0.1749,0.77355
0.0352,0.01605,0.17555,0.7732
0.03435,0.0166,0.1745,0.77455
0.03455,0.01615,0.17595,0.77335
0.03305,0.01725,0.1764,0.7733
0.0334,0.0172,0.17725,0.77215
0.0328,0.01775,0.1774,0.77205
0.03295,0.01795,0.17825,0.77085
0.03335,0.0172,0.1785,0.77095
0.03395,0.0169,0.1788,0.77035
0.0347,0.01625,0.1804,0.76865
0.0339,0.01675,0.18085,0.7685
0.03385,0.0178,0.18025,0.7681
0.0341,0.01735,0.1804,0.76815
0.03415,0.01685,0.1801,0.7689
0.03435,0.01715,0.1796,0.7689
0.03585,0.01625,0.17945,0.76845
0.0357,0.0154,0.1799,0.769
0.0345,0.01705,0.17925,0.7692
0.03425,0.0179,0.179,0.76885
0.03405,0.0169,0.17965,0.7694
0.03365,0.0162,0.18165,0.7685
0.033,0.01625,0.1822,0.76855
0.03415,0.01545,0.18295,0.76745
0.0338,0.0157,0.18385,0.76665
0.0345,0.01575,0.1838,0.76595
0.03335,0.01665,0.18365,0.76635
0.03425,0.0169,0.18335,0.7655
0.0339,0.01675,0.18345,0.7659
0.03375,0.01575,0.1836,0.7669
0.0326,0.0152,0.1844,0.7678
0.0333,0.0139,0.18495,0.76785
0.0323,0.01475,0.18445,0.7685
0.0332,0.01465,0.18375,0.7684
0.0326,0.015,0.18435,0.76805
0.03285,0.016,0.18415,0.767
0.0325,0.01675,0.18435,0.7664
0.0335,0.01605,0.18405,0.7664
0.03395,0.01645,0.1844,0.7652
0.0346,0.016,0.18395,0.76545
0.0345,0.01695,0.1835,0.76505
0.03465,0.01715,0.1827,0.7655
0.0356,0.0166,0.18195,0.76585
0.03465,0.0164,0.1818,0.76715
0.03415,0.0151,0.18315,0.7676
0.0337,0.0157,0.1832,0.7674
0.03365,0.01555,0.1844,0.7664
0.03425,0.0151,0.1842,0.76645
0.0347,0.01535,0.1839,0.76605
0.0351,0.0159,0.18395,0.76505
0.0346,0.01565,0.1855,0.76425
0.0353,0.0161,0.18545,0.76315
0.03355,0.017,0.18495,0.7645
0.0342,0.0167,0.18685,0.76225
0.0348,0.016,0.1877,0.7615
0.0351,0.0163,0.1882,0.7604
0.0352,0.01585,0.1876,0.76135
0.03515,0.0157,0.18795,0.7612
0.03485,0.0162,0.18745,0.7615
0.0351,0.0165,0.18775,0.76065
0.03445,0.01845,0.1867,0.7604
0.0341,0.01765,0.1868,0.76145
0.03405,0.01775,0.18605,0.76215
0.03365,0.0174,0.18595,0.763
0.0335,0.0182,0.1861,0.7622
0.0347,0.01805,0.1863,0.76095
0.0349,0.01805,0.18665,0.7604
0.0353,0.01745,0.1881,0.75915
0.03625,0.0169,0.189,0.75785
0.0356,0.0169,0.18935,0.75815
0.0365,0.01715,0.18815,0.7582
0.03795,0.01615,0.1875,0.7584
0.03825,0.0169,0.1865,0.75835
0.0376,0.0182,0.1859,0.7583
