
real	0m0,546s
user	0m0,538s
sys	0m0,008s

real	0m0,542s
user	0m0,538s
sys	0m0,004s

real	0m0,547s
user	0m0,535s
sys	0m0,012s

real	0m0,551s
user	0m0,547s
sys	0m0,004s

real	0m0,545s
user	0m0,545s
sys	0m0,000s

real	0m0,546s
user	0m0,538s
sys	0m0,008s

real	0m0,550s
user	0m0,546s
sys	0m0,004s

real	0m0,532s
user	0m0,528s
sys	0m0,004s

real	0m0,543s
user	0m0,532s
sys	0m0,012s

real	0m0,546s
user	0m0,539s
sys	0m0,008s
