I,E,S,R
0.001000,0.000850,0.998150,0.000000
0.001000,0.001550,0.997300,0.000150
0.001500,0.001450,0.996850,0.000200
0.001700,0.001800,0.996100,0.000400
0.001800,0.002650,0.994900,0.000650
0.002250,0.003850,0.993100,0.000800
0.003000,0.004800,0.991150,0.001050
0.004100,0.006100,0.988450,0.001350
0.005250,0.008250,0.984700,0.001800
0.006600,0.010500,0.980600,0.002300
0.008800,0.013700,0.974400,0.003100
0.011550,0.016000,0.967800,0.004650
0.015400,0.022750,0.956150,0.005700
0.019600,0.027550,0.944900,0.007950
0.024300,0.035950,0.928550,0.011200
0.032150,0.045950,0.907250,0.014650
0.041050,0.057900,0.882200,0.018850
0.053750,0.071050,0.851300,0.023900
0.065250,0.090750,0.812450,0.031550
0.082400,0.113650,0.764300,0.039650
0.101900,0.134700,0.712000,0.051400
0.124900,0.156550,0.652900,0.065650
0.152450,0.180100,0.585100,0.082350
0.181500,0.201550,0.513100,0.103850
0.217750,0.214750,0.439750,0.127750
0.242650,0.232250,0.367450,0.157650
0.277500,0.231750,0.299950,0.190800
0.307300,0.225200,0.240200,0.227300
0.329200,0.212300,0.189950,0.268550
0.347650,0.195500,0.145600,0.311250
0.359300,0.172650,0.111600,0.356450
0.364550,0.151900,0.083450,0.400100
0.357850,0.129850,0.064650,0.447650
0.348250,0.106750,0.051500,0.493500
0.331800,0.088250,0.041500,0.538450
0.311200,0.072950,0.033450,0.582400
0.290750,0.057100,0.028600,0.623550
0.266850,0.045500,0.025550,0.662100
0.246150,0.036400,0.023000,0.694450
0.223950,0.029950,0.021450,0.724650
0.203100,0.023700,0.020800,0.752400
0.183200,0.019800,0.019600,0.777400
0.163150,0.016050,0.020000,0.800800
0.144650,0.013050,0.020300,0.822000
0.129000,0.011000,0.021950,0.838050
0.115850,0.009050,0.023400,0.851700
0.102350,0.008800,0.024300,0.864550
0.089650,0.007900,0.025750,0.876700
0.078450,0.007200,0.027550,0.886800
0.069500,0.006700,0.028950,0.894850
0.062700,0.005500,0.030550,0.901250
0.055150,0.005100,0.032450,0.907300
0.048850,0.004800,0.034500,0.911850
0.043200,0.004250,0.036400,0.916150
0.037900,0.004600,0.038600,0.918900
0.034100,0.005100,0.040100,0.920700
0.030950,0.004700,0.042200,0.922150
0.028000,0.004200,0.044950,0.922850
0.025300,0.004000,0.047700,0.923000
0.022100,0.003600,0.050700,0.923600
0.019750,0.003100,0.053050,0.924100
0.018200,0.003050,0.055150,0.923600
0.016400,0.002650,0.057750,0.923200
0.015200,0.002750,0.060600,0.921450
0.013550,0.002200,0.064100,0.920150
0.012100,0.001900,0.066700,0.919300
0.010100,0.002050,0.069300,0.918550
0.009250,0.001850,0.072250,0.916650
0.008200,0.001750,0.074400,0.915650
0.007800,0.001650,0.077650,0.912900
0.006900,0.001600,0.080200,0.911300
0.005550,0.001600,0.083000,0.909850
0.005150,0.001500,0.085750,0.907600
0.004800,0.001400,0.088450,0.905350
0.004900,0.001450,0.091000,0.902650
0.004600,0.001250,0.094400,0.899750
0.004350,0.001400,0.097250,0.897000
0.004100,0.001550,0.099300,0.895050
0.003900,0.001000,0.101750,0.893350
0.003250,0.000950,0.104400,0.891400
0.002950,0.000900,0.107400,0.888750
0.002950,0.001050,0.109450,0.886550
0.002700,0.001000,0.111900,0.884400
0.002400,0.001000,0.114850,0.881750
0.002300,0.001000,0.117100,0.879600
0.002100,0.001150,0.119950,0.876800
0.002100,0.001050,0.122650,0.874200
0.002000,0.000850,0.125300,0.871850
0.002000,0.001000,0.127750,0.869250
0.002000,0.000650,0.130600,0.866750
0.001900,0.000650,0.132700,0.864750
0.001550,0.000650,0.135150,0.862650
0.001700,0.000650,0.137800,0.859850
0.001800,0.000750,0.140150,0.857300
0.001600,0.000650,0.142650,0.855100
0.001400,0.000700,0.145100,0.852800
0.001500,0.000450,0.146850,0.851200
0.001450,0.000400,0.149500,0.848650
0.001250,0.000450,0.151350,0.846950
0.001150,0.000500,0.153750,0.844600
0.001150,0.000400,0.156000,0.842450
0.001050,0.000450,0.158200,0.840300
0.001050,0.000350,0.160600,0.838000
0.001000,0.000300,0.162450,0.836250
0.001000,0.000450,0.164950,0.833600
0.000850,0.000750,0.167000,0.831400
0.001050,0.000600,0.168800,0.829550
0.001050,0.000500,0.170500,0.827950
0.001100,0.000450,0.173100,0.825350
0.001200,0.000550,0.174950,0.823300
0.001200,0.000700,0.177150,0.820950
0.001150,0.000800,0.179500,0.818550
0.001350,0.000700,0.181700,0.816250
0.001450,0.000650,0.183750,0.814150
0.001400,0.000700,0.186150,0.811750
0.001150,0.000850,0.188300,0.809700
0.001100,0.000600,0.190750,0.807550
0.001050,0.000600,0.192850,0.805500
0.001000,0.000750,0.195200,0.803050
0.001050,0.000850,0.197350,0.800750
0.001300,0.000650,0.199650,0.798400
0.001100,0.000900,0.201450,0.796550
0.001350,0.000900,0.203250,0.794500
0.001500,0.000750,0.205850,0.791900
0.001550,0.000950,0.208350,0.789150
0.001650,0.001250,0.210200,0.786900
0.001500,0.001100,0.212800,0.784600
0.001550,0.000900,0.214700,0.782850
0.001600,0.001000,0.216750,0.780650
0.001450,0.000900,0.218550,0.779100
0.001650,0.001000,0.220750,0.776600
0.001850,0.000900,0.223050,0.774200
0.001750,0.001050,0.225400,0.771800
0.001950,0.000650,0.227450,0.769950
0.001700,0.000800,0.228900,0.768600
0.001700,0.000500,0.231450,0.766350
0.001600,0.000600,0.233350,0.764450
0.001450,0.001000,0.235050,0.762500
0.001550,0.000750,0.236750,0.760950
0.001650,0.000700,0.238350,0.759300
0.001550,0.001000,0.239750,0.757700
0.002050,0.000700,0.242200,0.755050
0.002050,0.000650,0.244250,0.753050
0.002050,0.000800,0.245950,0.751200
0.002100,0.000700,0.247650,0.749550
0.001950,0.001050,0.248950,0.748050
0.002300,0.001150,0.251200,0.745350
0.002250,0.001000,0.253750,0.743000
0.002100,0.001600,0.255050,0.741250
0.002350,0.001550,0.256650,0.739450
0.002650,0.001550,0.258600,0.737200
0.003150,0.001700,0.260550,0.734600
0.003050,0.002100,0.261900,0.732950
0.002900,0.002000,0.263900,0.731200
0.003100,0.002300,0.265550,0.729050
0.003250,0.002500,0.267250,0.727000
0.003650,0.002000,0.269400,0.724950
0.003650,0.002150,0.270400,0.723800
0.003850,0.002000,0.271650,0.722500
0.004250,0.002250,0.272450,0.721050
0.004500,0.002450,0.273150,0.719900
0.004600,0.003300,0.273850,0.718250
0.005000,0.003400,0.275100,0.716500
0.005350,0.003350,0.276100,0.715200
0.005450,0.003650,0.276700,0.714200
0.005950,0.004150,0.277850,0.712050
0.006250,0.003850,0.279100,0.710800
0.005750,0.004150,0.280200,0.709900
0.005950,0.004250,0.281250,0.708550
0.006850,0.004250,0.281850,0.707050
0.006950,0.004900,0.281950,0.706200
0.007300,0.005700,0.281000,0.706000
0.007700,0.005750,0.281850,0.704700
0.008300,0.005950,0.282300,0.703450
0.008800,0.006500,0.282000,0.702700
0.009750,0.006900,0.281900,0.701450
0.010800,0.006800,0.281750,0.700650
0.011550,0.007550,0.280850,0.700050
0.011900,0.008600,0.280500,0.699000
0.012400,0.008600,0.280150,0.698850
0.012450,0.009650,0.279100,0.698800
0.013550,0.009300,0.279000,0.698150
0.014500,0.010200,0.278000,0.697300
0.015050,0.010600,0.278000,0.696350
0.016050,0.010700,0.277100,0.696150
0.016500,0.010750,0.275900,0.696850
0.018300,0.010550,0.274100,0.697050
0.019200,0.011650,0.271700,0.697450
0.019600,0.012250,0.270200,0.697950
0.020800,0.013450,0.267750,0.698000
0.022250,0.014250,0.265100,0.698400
0.023550,0.015100,0.262700,0.698650
0.024850,0.016350,0.259300,0.699500
0.026000,0.016700,0.255900,0.701400
0.027050,0.017150,0.252850,0.702950
0.027500,0.017700,0.249750,0.705050
0.028500,0.018350,0.246600,0.706550
0.029650,0.018900,0.243650,0.707800
0.031350,0.019650,0.240850,0.708150
0.032500,0.021200,0.236800,0.709500
0.033950,0.021400,0.233450,0.711200
0.034800,0.021050,0.230850,0.713300
0.035800,0.021400,0.227550,0.715250
0.036900,0.021900,0.223100,0.718100
0.037300,0.022950,0.219450,0.720300
0.038650,0.023750,0.214800,0.722800
0.040600,0.023450,0.210500,0.725450
0.042100,0.023150,0.205700,0.729050
0.042500,0.023350,0.201650,0.732500
0.043800,0.024000,0.197150,0.735050
0.043600,0.025400,0.191650,0.739350
0.045300,0.024850,0.187950,0.741900
0.046850,0.023150,0.186200,0.743800
0.047300,0.022350,0.182900,0.747450
0.047500,0.021950,0.179150,0.751400
0.046900,0.022750,0.174950,0.755400
0.046850,0.022300,0.172400,0.758450
0.046400,0.022250,0.169550,0.761800
0.046800,0.022400,0.165250,0.765550
0.046200,0.021650,0.162550,0.769600
0.045950,0.021750,0.159300,0.773000
0.046050,0.020750,0.156550,0.776650
0.046200,0.020050,0.154200,0.779550
0.045150,0.020350,0.150800,0.783700
0.044050,0.020100,0.148150,0.787700
0.043900,0.018200,0.147450,0.790450
0.042950,0.018400,0.145200,0.793450
0.043100,0.017700,0.144050,0.795150
0.042800,0.017400,0.142650,0.797150
0.041000,0.017100,0.141350,0.800550
0.041000,0.016100,0.141800,0.801100
0.040300,0.016300,0.140400,0.803000
0.039400,0.016600,0.138750,0.805250
0.037800,0.016400,0.138950,0.806850
0.037950,0.015550,0.138900,0.807600
0.037450,0.014400,0.138250,0.809900
0.036450,0.013900,0.138200,0.811450
0.035000,0.014600,0.137600,0.812800
0.034150,0.014000,0.137850,0.814000
0.034100,0.012000,0.138900,0.815000
0.032000,0.012300,0.139450,0.816250
0.031050,0.011750,0.140050,0.817150
0.029150,0.012900,0.140150,0.817800
0.029700,0.011350,0.141100,0.817850
0.029150,0.010800,0.141700,0.818350
0.028100,0.011050,0.142200,0.818650
0.026950,0.011800,0.143700,0.817550
0.027150,0.011250,0.144800,0.816800
0.026650,0.010850,0.145800,0.816700
0.025550,0.010600,0.146650,0.817200
0.025300,0.010900,0.147850,0.815950
0.025050,0.010800,0.148650,0.815500
0.024750,0.010350,0.150350,0.814550
0.024750,0.010450,0.151450,0.813350
0.024500,0.010550,0.152150,0.812800
0.022950,0.010800,0.154150,0.812100
0.023100,0.010050,0.156150,0.810700
0.023100,0.010100,0.157650,0.809150
0.022650,0.009100,0.159850,0.808400
0.022100,0.008850,0.160900,0.808150
0.021950,0.008600,0.163500,0.805950
0.021000,0.008950,0.164850,0.805200
0.020700,0.008700,0.166500,0.804100
0.018900,0.009750,0.167550,0.803800
0.018050,0.009700,0.168800,0.803450
0.017800,0.010200,0.169350,0.802650
0.018400,0.009300,0.171150,0.801150
0.018700,0.008250,0.173450,0.799600
0.019200,0.007550,0.175250,0.798000
0.019050,0.007150,0.178000,0.795800
0.018900,0.007650,0.179950,0.793500
0.018250,0.008800,0.180650,0.792300
0.019550,0.008000,0.182400,0.790050
0.019250,0.008450,0.184000,0.788300
0.019200,0.008900,0.185500,0.786400
0.019200,0.008850,0.187850,0.784100
0.019050,0.008350,0.189900,0.782700
0.018950,0.008600,0.192950,0.779500
0.018600,0.008850,0.194100,0.778450
0.018200,0.009400,0.195450,0.776950
0.018000,0.009100,0.196300,0.776600
0.018100,0.009550,0.197250,0.775100
0.019400,0.009050,0.198350,0.773200
0.019150,0.009050,0.199100,0.772700
0.019250,0.008900,0.201450,0.770400
0.019200,0.009200,0.202950,0.768650
0.019150,0.010100,0.204100,0.766650
0.019600,0.010200,0.205700,0.764500
0.018800,0.010600,0.206400,0.764200
0.019450,0.010800,0.206700,0.763050
0.020500,0.010950,0.208150,0.760400
0.020700,0.010700,0.209650,0.758950
0.021250,0.011300,0.210650,0.756800
0.021200,0.010700,0.212800,0.755300
0.022200,0.010850,0.213100,0.753850
0.021750,0.011500,0.214250,0.752500
0.022350,0.012500,0.214500,0.750650
0.022850,0.012300,0.216200,0.748650
0.022750,0.012650,0.216700,0.747900
0.022950,0.012800,0.217400,0.746850
0.022350,0.012850,0.217650,0.747150
0.023700,0.014300,0.217050,0.744950
0.024600,0.013800,0.218250,0.743350
0.025300,0.014500,0.217200,0.743000
0.026700,0.014000,0.217250,0.742050
0.027350,0.014050,0.218200,0.740400
0.027150,0.015300,0.217200,0.740350
0.028950,0.015900,0.216550,0.738600
0.029300,0.015450,0.216350,0.738900
0.028400,0.016150,0.215950,0.739500
0.029150,0.016650,0.214950,0.739250
0.029600,0.015900,0.214400,0.740100
0.029700,0.016750,0.214000,0.739550
0.031400,0.015950,0.214100,0.738550
0.031700,0.016750,0.213500,0.738050
0.031400,0.017650,0.212250,0.738700
0.031300,0.018000,0.212200,0.738500
0.032550,0.017650,0.211600,0.738200
0.034050,0.018350,0.209850,0.737750
0.034400,0.018800,0.209050,0.737750
0.035550,0.018450,0.206950,0.739050
0.035500,0.019250,0.205900,0.739350
0.036050,0.019750,0.204100,0.740100
0.035200,0.020600,0.202800,0.741400
0.036250,0.020100,0.201350,0.742300
0.037500,0.021200,0.199400,0.741900
0.038550,0.020500,0.198900,0.742050
0.038800,0.020600,0.197250,0.743350
0.040000,0.020950,0.196050,0.743000
0.039800,0.021350,0.195050,0.743800
0.038950,0.022150,0.193700,0.745200
0.039250,0.022050,0.191950,0.746750
0.039900,0.020200,0.192850,0.747050
0.040750,0.019750,0.191700,0.747800
0.041200,0.019600,0.190450,0.748750
0.041100,0.020100,0.188400,0.750400
0.042000,0.019400,0.187950,0.750650
0.042400,0.019800,0.186900,0.750900
0.042500,0.020150,0.185600,0.751750
0.041700,0.020850,0.183500,0.753950
0.042600,0.020900,0.182750,0.753750
0.044150,0.020800,0.180850,0.754200
0.043850,0.022450,0.177800,0.755900
0.044450,0.022200,0.176300,0.757050
0.046000,0.021050,0.174600,0.758350
0.045250,0.020800,0.172700,0.761250
0.045450,0.019800,0.172500,0.762250
0.045300,0.019350,0.172150,0.763200
0.044650,0.018750,0.172150,0.764450
0.045050,0.019200,0.171000,0.764750
0.043400,0.019850,0.168950,0.767800
0.042200,0.019800,0.168450,0.769550
0.042750,0.019150,0.167600,0.770500
0.042100,0.020550,0.166300,0.771050
0.042800,0.020250,0.166000,0.770950
0.042550,0.020050,0.164650,0.772750
0.042800,0.019200,0.164300,0.773700
0.042700,0.018150,0.165200,0.773950
0.041250,0.018100,0.165450,0.775200
0.040200,0.018950,0.164050,0.776800
0.040700,0.017950,0.164400,0.776950
0.040200,0.018050,0.164400,0.777350
0.040100,0.017300,0.165000,0.777600
0.039000,0.017100,0.165700,0.778200
0.038850,0.016400,0.166500,0.778250
0.038050,0.017200,0.166950,0.777800
0.037850,0.016450,0.168000,0.777700
0.037400,0.015000,0.168900,0.778700
0.035450,0.016200,0.168550,0.779800
0.035450,0.016650,0.169200,0.778700
0.035250,0.016550,0.169150,0.779050
0.034550,0.017500,0.169000,0.778950
0.034250,0.016800,0.170250,0.778700
0.034500,0.016400,0.170100,0.779000
0.033250,0.016900,0.171800,0.778050
0.033400,0.016350,0.172100,0.778150
0.032950,0.016500,0.172750,0.777800
0.032400,0.016800,0.172500,0.778300
0.031800,0.016250,0.173100,0.778850
0.031250,0.016000,0.173100,0.779650
0.030300,0.016250,0.173050,0.780400
0.031400,0.015350,0.174400,0.778850
0.031500,0.015150,0.174900,0.778450
0.030650,0.015150,0.176850,0.777350
0.029850,0.015500,0.178200,0.776450
0.029550,0.016350,0.177900,0.776200
0.030250,0.015000,0.180450,0.774300
0.030700,0.014150,0.181250,0.773900
0.031200,0.014400,0.181250,0.773150
0.031350,0.015050,0.180700,0.772900
0.030950,0.015300,0.181450,0.772300
0.031250,0.015650,0.182200,0.770900
0.031550,0.015100,0.182850,0.770500
0.031600,0.014850,0.182550,0.771000
0.031300,0.015550,0.182900,0.770250
0.030950,0.016300,0.182600,0.770150
0.030550,0.016800,0.183250,0.769400
0.031050,0.016100,0.183850,0.769000
0.031600,0.016850,0.183400,0.768150
0.031950,0.016950,0.183850,0.767250
0.033150,0.016700,0.184000,0.766150
0.033650,0.017000,0.183600,0.765750
0.033550,0.017150,0.183100,0.766200
0.033350,0.015800,0.183950,0.766900
0.033050,0.016800,0.184150,0.766000
0.032800,0.016350,0.182950,0.767900
0.033400,0.016800,0.183350,0.766450
0.034300,0.015950,0.182650,0.767100
0.034750,0.015500,0.182400,0.767350
0.033950,0.015750,0.182100,0.768200
0.033000,0.017150,0.181450,0.768400
0.032100,0.017900,0.181300,0.768700
0.031000,0.017200,0.182150,0.769650
0.032250,0.016200,0.183450,0.768100
0.033700,0.014900,0.184200,0.767200
0.033300,0.015300,0.183750,0.767650
0.033700,0.015450,0.183350,0.767500
0.034550,0.015850,0.182600,0.767000
0.034150,0.015650,0.183300,0.766900
0.033950,0.016300,0.182250,0.767500
0.033250,0.017300,0.181800,0.767650
0.033800,0.017550,0.181650,0.767000
0.033650,0.017750,0.181100,0.767500
0.034850,0.017800,0.180050,0.767300
0.035450,0.016300,0.181000,0.767250
0.035300,0.017750,0.179900,0.767050
0.035600,0.019000,0.178450,0.766950
0.036500,0.016900,0.178150,0.768450
0.036500,0.017450,0.177150,0.768900
0.036950,0.017600,0.176150,0.769300
0.037450,0.017900,0.175350,0.769300
0.037400,0.017250,0.174600,0.770750
0.036800,0.017300,0.176000,0.769900
0.037350,0.017200,0.176150,0.769300
0.036650,0.017050,0.174950,0.771350
0.034900,0.017500,0.175750,0.771850
0.035500,0.017350,0.175300,0.771850
0.037550,0.016350,0.175450,0.770650
0.037350,0.016350,0.175550,0.770750
0.037000,0.016350,0.175050,0.771600
0.036400,0.016350,0.175900,0.771350
0.036350,0.016400,0.176050,0.771200
0.035650,0.015850,0.176850,0.771650
0.035700,0.016850,0.176050,0.771400
0.035300,0.016650,0.176800,0.771250
0.035650,0.016900,0.176400,0.771050
0.035700,0.016700,0.176150,0.771450
0.036100,0.016450,0.176050,0.771400
0.035600,0.016750,0.176850,0.770800
0.033850,0.017050,0.177150,0.771950
0.034550,0.016400,0.175700,0.773350
0.034600,0.016100,0.177550,0.771750
0.034250,0.017300,0.176050,0.772400
0.034150,0.016900,0.176550,0.772400
0.033200,0.017350,0.176900,0.772550
0.033700,0.017200,0.177500,0.771600
0.034600,0.016300,0.176600,0.772500
0.034350,0.015800,0.176850,0.773000
0.034100,0.015600,0.177100,0.773200
0.034250,0.014100,0.178300,0.773350
0.033450,0.014900,0.178950,0.772700
0.032950,0.015650,0.179600,0.771800
0.032950,0.016700,0.179050,0.771300
0.032150,0.016950,0.178600,0.772300
0.031950,0.017200,0.179250,0.771600
0.033000,0.017100,0.179400,0.770500
0.032850,0.017500,0.178400,0.771250
0.035100,0.016550,0.179250,0.769100
0.034100,0.017600,0.178400,0.769900
0.035500,0.016900,0.176600,0.771000
0.034600,0.016850,0.176650,0.771900
0.034750,0.016450,0.176000,0.772800
0.034100,0.016350,0.176450,0.773100
0.033850,0.016250,0.175800,0.774100
0.034200,0.015400,0.176250,0.774150
0.035100,0.014950,0.176700,0.773250
0.034450,0.015200,0.176750,0.773600
0.034050,0.015150,0.176900,0.773900
0.033600,0.016050,0.175600,0.774750
0.032900,0.015650,0.176400,0.775050
0.033250,0.014100,0.177650,0.775000
0.032800,0.014950,0.178200,0.774050
0.032200,0.015950,0.177200,0.774650
0.031800,0.016200,0.176400,0.775600
0.031900,0.015750,0.176800,0.775550
0.032300,0.015200,0.177450,0.775050
0.032850,0.015350,0.177200,0.774600
0.032650,0.015750,0.177100,0.774500
0.032800,0.016300,0.176700,0.774200
0.032550,0.016400,0.176150,0.774900
0.032000,0.016600,0.175900,0.775500
0.031950,0.016700,0.175300,0.776050
0.031900,0.016200,0.176100,0.775800
0.031900,0.015950,0.176650,0.775500
0.031350,0.016350,0.176600,0.775700
0.030550,0.016100,0.176350,0.777000
0.030900,0.015400,0.177350,0.776350
0.031250,0.015100,0.177950,0.775700
0.031350,0.014850,0.178200,0.775600
0.030700,0.014850,0.178700,0.775750
0.030950,0.014250,0.179600,0.775200
0.031350,0.014800,0.179500,0.774350
0.031400,0.014250,0.180650,0.773700
0.031050,0.014550,0.180800,0.773600
0.030200,0.015750,0.180650,0.773400
0.031250,0.015250,0.181350,0.772150
0.031250,0.015550,0.181000,0.772200
0.031150,0.015100,0.181400,0.772350
0.032000,0.014250,0.182550,0.771200
0.031150,0.015150,0.183400,0.770300
0.031400,0.014900,0.185250,0.768450
0.031350,0.015400,0.184550,0.768700
0.031200,0.016200,0.183950,0.768650
0.030650,0.016250,0.184250,0.768850
0.031050,0.015600,0.185450,0.767900
0.030150,0.016650,0.185350,0.767850
0.030350,0.016150,0.186250,0.767250
0.031100,0.016050,0.186000,0.766850
0.030400,0.016850,0.186050,0.766700
0.031050,0.017000,0.185650,0.766300
0.031200,0.016000,0.186250,0.766550
0.031250,0.015600,0.186800,0.766350
0.031150,0.016150,0.187050,0.765650
0.031500,0.016450,0.187500,0.764550
0.031950,0.015350,0.188100,0.764600
0.032750,0.014500,0.188700,0.764050
0.031900,0.015250,0.188800,0.764050
0.031400,0.015900,0.188600,0.764100
0.031850,0.015400,0.188650,0.764100
0.031200,0.015400,0.187250,0.766150
0.031950,0.015650,0.187750,0.764650
0.031500,0.015200,0.188650,0.764650
0.031750,0.015450,0.188800,0.764000
0.031750,0.016550,0.188000,0.763700
0.031700,0.016050,0.188850,0.763400
0.031500,0.017650,0.188050,0.762800
0.031850,0.017750,0.187650,0.762750
0.032200,0.017950,0.188550,0.761300
0.032350,0.018700,0.188250,0.760700
0.033250,0.019150,0.187100,0.760500
0.033900,0.018550,0.187350,0.760200
0.035200,0.018000,0.187450,0.759350
0.035450,0.017150,0.187600,0.759800
0.035850,0.017200,0.186000,0.760950
0.035500,0.016900,0.186350,0.761250
0.035100,0.016800,0.186250,0.761850
0.034800,0.016950,0.185600,0.762650
0.033800,0.017650,0.186050,0.762500
0.034200,0.016750,0.187150,0.761900
0.033650,0.017450,0.186600,0.762300
0.034100,0.017000,0.186500,0.762400
0.034500,0.017500,0.185350,0.762650
0.034150,0.017050,0.185950,0.762850
0.034100,0.017600,0.185200,0.763100
0.033800,0.017800,0.185150,0.763250
0.034750,0.017850,0.184800,0.762600
0.035350,0.017600,0.185350,0.761700
0.035650,0.017900,0.184150,0.762300
0.035200,0.018550,0.183050,0.763200
0.035200,0.017950,0.183450,0.763400
0.036200,0.016300,0.184100,0.763400
0.036650,0.017100,0.183900,0.762350
0.035950,0.017900,0.184350,0.761800
0.036800,0.018150,0.183750,0.761300
0.036600,0.019300,0.181950,0.762150
0.036200,0.020250,0.181400,0.762150
0.037600,0.018600,0.181900,0.761900
0.038600,0.018000,0.182750,0.760650
0.037350,0.019150,0.181700,0.761800
0.037850,0.018500,0.181950,0.761700
0.039100,0.017250,0.182400,0.761250
0.037000,0.017550,0.183350,0.762100
0.037500,0.017250,0.183650,0.761600
0.037200,0.016950,0.183700,0.762150
0.036500,0.017950,0.183050,0.762500
0.036200,0.016650,0.183700,0.763450
0.037100,0.016450,0.183850,0.762600
0.036950,0.016500,0.183350,0.763200
0.037550,0.015800,0.183700,0.762950
0.037250,0.016150,0.182800,0.763800
0.036100,0.016850,0.181900,0.765150
0.035500,0.017300,0.182950,0.764250
0.036150,0.016450,0.183650,0.763750
0.036000,0.017950,0.183350,0.762700
0.036450,0.018000,0.182950,0.762600
0.037500,0.016600,0.183500,0.762400
0.036600,0.017600,0.183700,0.762100
0.036700,0.017950,0.183800,0.761550
0.037000,0.018350,0.182950,0.761700
0.039200,0.017250,0.183650,0.759900
0.039750,0.017100,0.182800,0.760350
0.039700,0.018250,0.181800,0.760250
0.039850,0.018000,0.181550,0.760600
0.039450,0.018200,0.181250,0.761100
0.038500,0.018050,0.180450,0.763000
0.038600,0.018350,0.180000,0.763050
0.038250,0.018600,0.179250,0.763900
0.039150,0.018250,0.179100,0.763500
0.038900,0.018600,0.178650,0.763850
0.039650,0.018050,0.178300,0.764000
0.039800,0.018150,0.177850,0.764200
0.038700,0.018600,0.177600,0.765100
0.039250,0.019250,0.177550,0.763950
0.039750,0.018950,0.176200,0.765100
0.040200,0.018500,0.177050,0.764250
0.040700,0.018450,0.176950,0.763900
0.039550,0.018100,0.176950,0.765400
0.038750,0.017850,0.177500,0.765900
0.037950,0.018550,0.177500,0.766000
0.038350,0.018450,0.177650,0.765550
0.038450,0.020550,0.176400,0.764600
0.039100,0.020350,0.176100,0.764450
0.039450,0.020700,0.176300,0.763550
0.039500,0.019800,0.175500,0.765200
0.040900,0.018400,0.174650,0.766050
0.041250,0.018950,0.174250,0.765550
0.041300,0.019050,0.174150,0.765500
0.040150,0.019200,0.173800,0.766850
0.041250,0.019000,0.173250,0.766500
0.040450,0.019900,0.172350,0.767300
0.039150,0.020200,0.172050,0.768600
0.039650,0.019350,0.172300,0.768700
0.039350,0.020150,0.171250,0.769250
0.040250,0.020150,0.169350,0.770250
0.039800,0.019850,0.168800,0.771550
0.039550,0.018450,0.169500,0.772500
0.039500,0.018850,0.169250,0.772400
0.038350,0.018350,0.170200,0.773100
0.037900,0.019300,0.169450,0.773350
0.037350,0.019150,0.169550,0.773950
0.037600,0.018350,0.169300,0.774750
0.037300,0.018350,0.169650,0.774700
0.037800,0.018000,0.169900,0.774300
0.037950,0.016850,0.170050,0.775150
0.037700,0.016350,0.169950,0.776000
0.036850,0.015750,0.170550,0.776850
0.035500,0.016200,0.171900,0.776400
0.034750,0.016900,0.171850,0.776500
0.035050,0.017250,0.172400,0.775300
0.035400,0.017050,0.172350,0.775200
0.036000,0.015900,0.173850,0.774250
0.036050,0.016000,0.173950,0.774000
0.036700,0.015650,0.174000,0.773650
0.035950,0.016450,0.173750,0.773850
0.034050,0.016800,0.174200,0.774950
0.034850,0.015800,0.174900,0.774450
0.034250,0.016550,0.174550,0.774650
0.034500,0.017050,0.174400,0.774050
0.034350,0.016350,0.174800,0.774500
0.033750,0.017150,0.174750,0.774350
0.034900,0.015350,0.176250,0.773500
0.033450,0.015300,0.178050,0.773200
0.033100,0.014100,0.179550,0.773250
0.033300,0.014700,0.179850,0.772150
0.033400,0.015050,0.181000,0.770550
0.032800,0.015000,0.181750,0.770450
0.031700,0.015550,0.182200,0.770550
0.032000,0.015800,0.183300,0.768900
0.032050,0.016050,0.182600,0.769300
0.031600,0.015250,0.184750,0.768400
0.030150,0.015750,0.186050,0.768050
0.030000,0.015800,0.186400,0.767800
0.030750,0.014900,0.187450,0.766900
0.031250,0.015350,0.187050,0.766350
0.031300,0.015500,0.187550,0.765650
0.032200,0.015800,0.186900,0.765100
0.032500,0.015850,0.187750,0.763900
0.033350,0.016350,0.186950,0.763350
0.033850,0.017100,0.185700,0.763350
0.033950,0.016350,0.186250,0.763450
0.034200,0.017050,0.186800,0.761950
0.033150,0.018050,0.186700,0.762100
0.033550,0.017050,0.187450,0.761950
0.033500,0.016900,0.187900,0.761700
0.034000,0.017100,0.187900,0.761000
0.033100,0.017400,0.188000,0.761500
0.034400,0.015950,0.188150,0.761500
0.034100,0.016050,0.187600,0.762250
0.033550,0.016150,0.188200,0.762100
0.033250,0.017150,0.187950,0.761650
0.034800,0.016000,0.188500,0.760700
0.033900,0.016400,0.188500,0.761200
0.034000,0.016600,0.188750,0.760650
0.033700,0.017650,0.187750,0.760900
0.034550,0.017600,0.186750,0.761100
0.035950,0.017800,0.185850,0.760400
0.035500,0.017600,0.185800,0.761100
0.036100,0.016700,0.184650,0.762550
0.037550,0.016650,0.183250,0.762550
0.037700,0.017500,0.182650,0.762150
0.037450,0.017350,0.182500,0.762700
0.036550,0.016750,0.182400,0.764300
0.035900,0.016900,0.181250,0.765950
0.035250,0.017200,0.181800,0.765750
0.036050,0.017350,0.181900,0.764700
0.035450,0.018050,0.181150,0.765350
0.036500,0.017400,0.179400,0.766700
0.035950,0.018700,0.178000,0.767350
0.036050,0.018150,0.178600,0.767200
0.036200,0.017900,0.178450,0.767450
0.036500,0.017150,0.178350,0.768000
0.035750,0.018350,0.178950,0.766950
0.035200,0.017150,0.180600,0.767050
0.034250,0.016550,0.181350,0.767850
0.034500,0.017200,0.180600,0.767700
0.035400,0.016400,0.180850,0.767350
0.035200,0.015950,0.181800,0.767050
0.035600,0.016400,0.181750,0.766250
0.035200,0.016500,0.181400,0.766900
0.035300,0.016500,0.181500,0.766700
0.034500,0.017150,0.180800,0.767550
0.036050,0.017150,0.180850,0.765950
0.035800,0.018250,0.181150,0.764800
0.036150,0.017800,0.181050,0.765000
0.036100,0.018000,0.180850,0.765050
0.036350,0.016900,0.180800,0.765950
0.035600,0.017700,0.180700,0.766000
0.036750,0.016150,0.179950,0.767150
0.036400,0.016200,0.179800,0.767600
0.035700,0.016150,0.180500,0.767650
0.035700,0.016700,0.179050,0.768550
0.034100,0.016850,0.178800,0.770250
0.033400,0.017650,0.179250,0.769700
0.032600,0.017200,0.179700,0.770500
0.032400,0.016550,0.180500,0.770550
0.032850,0.016650,0.181150,0.769350
0.033850,0.016450,0.180600,0.769100
0.032400,0.015850,0.182050,0.769700
0.032500,0.016000,0.182300,0.769200
0.031950,0.015950,0.183050,0.769050
