
--------------------------
Total energy: 8207.64 Joules, including:
	CPU energy: 8207.64 Joules
	GPU energy: 0.00 Joules
--------------------------

--------------------------
Total energy: 10447.98 Joules, including:
	CPU energy: 10447.98 Joules
	GPU energy: 0.00 Joules
--------------------------

--------------------------
Total energy: 8388.75 Joules, including:
	CPU energy: 8388.75 Joules
	GPU energy: 0.00 Joules
--------------------------

--------------------------
Total energy: 8476.20 Joules, including:
	CPU energy: 8476.20 Joules
	GPU energy: 0.00 Joules
--------------------------

--------------------------
Total energy: 10513.22 Joules, including:
	CPU energy: 10513.22 Joules
	GPU energy: 0.00 Joules
--------------------------

--------------------------
Total energy: 8388.77 Joules, including:
	CPU energy: 8388.77 Joules
	GPU energy: 0.00 Joules
--------------------------
