
--------------------------
Total energy: 414.17 Joules, including:
	CPU energy: 414.17 Joules
	GPU energy: 0.00 Joules
--------------------------

--------------------------
Total energy: 417.21 Joules, including:
	CPU energy: 417.21 Joules
	GPU energy: 0.00 Joules
--------------------------

--------------------------
Total energy: 417.15 Joules, including:
	CPU energy: 417.15 Joules
	GPU energy: 0.00 Joules
--------------------------

--------------------------
Total energy: 415.45 Joules, including:
	CPU energy: 415.45 Joules
	GPU energy: 0.00 Joules
--------------------------

--------------------------
Total energy: 412.19 Joules, including:
	CPU energy: 412.19 Joules
	GPU energy: 0.00 Joules
--------------------------

--------------------------
Total energy: 412.05 Joules, including:
	CPU energy: 412.05 Joules
	GPU energy: 0.00 Joules
--------------------------

--------------------------
Total energy: 414.18 Joules, including:
	CPU energy: 414.18 Joules
	GPU energy: 0.00 Joules
--------------------------

--------------------------
Total energy: 417.19 Joules, including:
	CPU energy: 417.19 Joules
	GPU energy: 0.00 Joules
--------------------------

--------------------------
Total energy: 417.13 Joules, including:
	CPU energy: 417.13 Joules
	GPU energy: 0.00 Joules
--------------------------

--------------------------
Total energy: 415.53 Joules, including:
	CPU energy: 415.53 Joules
	GPU energy: 0.00 Joules
--------------------------
