
--------------------------
Total energy: 21881.20 Joules, including:
	CPU energy: 21881.20 Joules
	GPU energy: 0.00 Joules
--------------------------

--------------------------
Total energy: 17517.31 Joules, including:
	CPU energy: 17517.31 Joules
	GPU energy: 0.00 Joules
--------------------------

--------------------------
Total energy: 16669.09 Joules, including:
	CPU energy: 16669.09 Joules
	GPU energy: 0.00 Joules
--------------------------

--------------------------
Total energy: 16660.75 Joules, including:
	CPU energy: 16660.75 Joules
	GPU energy: 0.00 Joules
--------------------------

--------------------------
Total energy: 16665.22 Joules, including:
	CPU energy: 16665.22 Joules
	GPU energy: 0.00 Joules
--------------------------

--------------------------
Total energy: 16669.31 Joules, including:
	CPU energy: 16669.31 Joules
	GPU energy: 0.00 Joules
--------------------------

--------------------------
Total energy: 16667.98 Joules, including:
	CPU energy: 16667.98 Joules
	GPU energy: 0.00 Joules
--------------------------

--------------------------
Total energy: 15838.48 Joules, including:
	CPU energy: 15838.48 Joules
	GPU energy: 0.00 Joules
--------------------------
