I,E,S,R
0.001000,0.000500,0.998500,0.000000
0.000800,0.001150,0.997800,0.000250
0.001100,0.001500,0.997000,0.000400
0.001200,0.001950,0.996150,0.000700
0.001500,0.002800,0.994750,0.000950
0.002100,0.003250,0.993550,0.001100
0.002650,0.004450,0.991550,0.001350
0.003400,0.005450,0.989350,0.001800
0.004200,0.006800,0.986600,0.002400
0.004950,0.008550,0.983150,0.003350
0.006350,0.010200,0.979300,0.004150
0.008250,0.013550,0.973500,0.004700
0.011250,0.016550,0.966350,0.005850
0.014850,0.020300,0.957650,0.007200
0.019750,0.025950,0.945350,0.008950
0.024550,0.036100,0.927850,0.011500
0.031050,0.047900,0.906700,0.014350
0.042100,0.058250,0.881600,0.018050
0.054600,0.072000,0.849750,0.023650
0.065950,0.090050,0.812400,0.031600
0.081500,0.108700,0.768700,0.041100
0.100150,0.131250,0.716200,0.052400
0.123750,0.151100,0.658950,0.066200
0.149550,0.177500,0.589750,0.083200
0.180650,0.197900,0.518050,0.103400
0.209850,0.219300,0.443250,0.127600
0.246350,0.227700,0.371650,0.154300
0.277550,0.233750,0.300900,0.187800
0.310700,0.225700,0.240100,0.223500
0.334400,0.213250,0.187500,0.264850
0.348850,0.200250,0.139300,0.311600
0.356350,0.178650,0.105650,0.359350
0.357100,0.154950,0.081350,0.406600
0.353200,0.131800,0.062700,0.452300
0.347350,0.106750,0.048850,0.497050
0.332650,0.087700,0.039350,0.540300
0.315750,0.070850,0.031950,0.581450
0.294150,0.057250,0.027300,0.621300
0.272600,0.045550,0.023850,0.658000
0.248550,0.037100,0.021850,0.692500
0.227000,0.028500,0.020100,0.724400
0.204250,0.023050,0.018850,0.753850
0.184450,0.018200,0.018950,0.778400
0.164150,0.015250,0.020500,0.800100
0.147250,0.013250,0.021300,0.818200
0.130900,0.012050,0.021550,0.835500
0.116700,0.010100,0.021750,0.851450
0.102500,0.009250,0.023200,0.865050
0.092400,0.008300,0.023550,0.875750
0.082150,0.007150,0.025450,0.885250
0.074450,0.006050,0.026800,0.892700
0.066600,0.005750,0.028850,0.898800
0.059300,0.005300,0.030700,0.904700
0.053600,0.004600,0.032450,0.909350
0.048500,0.004650,0.034200,0.912650
0.043450,0.004150,0.037200,0.915200
0.037900,0.004800,0.039000,0.918300
0.034250,0.004550,0.041200,0.920000
0.030900,0.003900,0.044200,0.921000
0.027300,0.003600,0.046400,0.922700
0.024600,0.003050,0.049000,0.923350
0.022000,0.002700,0.052100,0.923200
0.020550,0.002650,0.054650,0.922150
0.018500,0.002700,0.057400,0.921400
0.017250,0.002250,0.060450,0.920050
0.015450,0.002600,0.062350,0.919600
0.013950,0.002000,0.065550,0.918500
0.012350,0.001950,0.068850,0.916850
0.011050,0.001950,0.071450,0.915550
0.010200,0.001800,0.074500,0.913500
0.009200,0.002100,0.076900,0.911800
0.008200,0.002150,0.079000,0.910650
0.007850,0.001700,0.081550,0.908900
0.007000,0.001850,0.084650,0.906500
0.006250,0.001950,0.086750,0.905050
0.005700,0.001600,0.089750,0.902950
0.005050,0.001550,0.092550,0.900850
0.005200,0.001350,0.095950,0.897500
0.005050,0.001150,0.099350,0.894450
0.004450,0.001150,0.102450,0.891950
0.004150,0.001350,0.104350,0.890150
0.003900,0.001350,0.107900,0.886850
0.003750,0.001250,0.110950,0.884050
0.003550,0.001350,0.113250,0.881850
0.003250,0.001150,0.116150,0.879450
0.003250,0.001250,0.118400,0.877100
0.002900,0.001350,0.120850,0.874900
0.002950,0.001150,0.123200,0.872700
0.002900,0.001250,0.125400,0.870450
0.002700,0.001200,0.127350,0.868750
0.002450,0.001250,0.130200,0.866100
0.002550,0.001200,0.132400,0.863850
0.002850,0.000900,0.134600,0.861650
0.002450,0.001100,0.137350,0.859100
0.002400,0.001250,0.139600,0.856750
0.002450,0.001100,0.142150,0.854300
0.002300,0.000850,0.144500,0.852350
0.002150,0.000850,0.147000,0.850000
0.001850,0.000950,0.149450,0.847750
0.001950,0.000950,0.152050,0.845050
0.001800,0.000950,0.154300,0.842950
0.001700,0.001000,0.157000,0.840300
0.001850,0.001050,0.158900,0.838200
0.002050,0.000850,0.161700,0.835400
0.002250,0.000600,0.163750,0.833400
0.002000,0.000350,0.165900,0.831750
0.001950,0.000550,0.168250,0.829250
0.001900,0.000650,0.170800,0.826650
0.002000,0.000550,0.173250,0.824200
0.001850,0.000650,0.176050,0.821450
0.001950,0.000650,0.178350,0.819050
0.001850,0.000750,0.180700,0.816700
0.001700,0.000800,0.183000,0.814500
0.001800,0.000700,0.185250,0.812250
0.001700,0.000800,0.187600,0.809900
0.001750,0.000650,0.190650,0.806950
0.001650,0.000850,0.192750,0.804750
0.001850,0.000550,0.195050,0.802550
0.002050,0.000400,0.197650,0.799900
0.001850,0.000500,0.199450,0.798200
0.002000,0.000850,0.200650,0.796500
0.001900,0.001000,0.202700,0.794400
0.001750,0.001050,0.205350,0.791850
0.001950,0.001200,0.206550,0.790300
0.001950,0.001450,0.208750,0.787850
0.002050,0.001600,0.210250,0.786100
0.002350,0.001300,0.212350,0.784000
0.002550,0.001050,0.214450,0.781950
0.002600,0.001150,0.216050,0.780200
0.002450,0.001250,0.217250,0.779050
0.002500,0.001200,0.219150,0.777150
0.002250,0.001600,0.221200,0.774950
0.002500,0.001450,0.223050,0.773000
0.002450,0.001350,0.225150,0.771050
0.002850,0.001300,0.226650,0.769200
0.003100,0.001250,0.228700,0.766950
0.002850,0.001350,0.230800,0.765000
0.002650,0.001550,0.232950,0.762850
0.002550,0.001500,0.234500,0.761450
0.002450,0.001650,0.236900,0.759000
0.002800,0.001800,0.237850,0.757550
0.003200,0.001550,0.239650,0.755600
0.003300,0.001600,0.241700,0.753400
0.002950,0.001600,0.242550,0.752900
0.003100,0.001550,0.244050,0.751300
0.003500,0.001250,0.245950,0.749300
0.003350,0.001700,0.247200,0.747750
0.003450,0.001650,0.248600,0.746300
0.003450,0.001750,0.250100,0.744700
0.003700,0.001850,0.251900,0.742550
0.003550,0.001750,0.254300,0.740400
0.004000,0.001900,0.255600,0.738500
0.004050,0.002000,0.257350,0.736600
0.004050,0.002400,0.258450,0.735100
0.003850,0.003200,0.259600,0.733350
0.003950,0.003350,0.260600,0.732100
0.004350,0.003450,0.261850,0.730350
0.005050,0.003650,0.263150,0.728150
0.005250,0.003800,0.264300,0.726650
0.005800,0.003800,0.265600,0.724800
0.006050,0.003600,0.267450,0.722900
0.005800,0.004400,0.268050,0.721750
0.006050,0.005050,0.268700,0.720200
0.006800,0.005200,0.269450,0.718550
0.007600,0.004900,0.270100,0.717400
0.008500,0.005200,0.270800,0.715500
0.008850,0.005550,0.270950,0.714650
0.009400,0.006150,0.270450,0.714000
0.009850,0.006150,0.271650,0.712350
0.010150,0.006450,0.271450,0.711950
0.010400,0.006800,0.271450,0.711350
0.010450,0.006650,0.271250,0.711650
0.010850,0.006950,0.271550,0.710650
0.012150,0.006100,0.272350,0.709400
0.011550,0.007200,0.271900,0.709350
0.012000,0.007350,0.271400,0.709250
0.012200,0.008000,0.270900,0.708900
0.012550,0.008700,0.271450,0.707300
0.013850,0.009000,0.270900,0.706250
0.014800,0.008900,0.270550,0.705750
0.015950,0.009200,0.269600,0.705250
0.016250,0.010850,0.267350,0.705550
0.018100,0.011900,0.264500,0.705500
0.018600,0.012050,0.262800,0.706550
0.019850,0.012250,0.261050,0.706850
0.021550,0.012400,0.259000,0.707050
0.021950,0.013000,0.257700,0.707350
0.023450,0.014200,0.254050,0.708300
0.024550,0.014900,0.251650,0.708900
0.025450,0.015100,0.249250,0.710200
0.026550,0.015850,0.246400,0.711200
0.027900,0.016350,0.243750,0.712000
0.029300,0.016350,0.241250,0.713100
0.028450,0.017200,0.238600,0.715750
0.029900,0.016600,0.235950,0.717550
0.030150,0.017550,0.233500,0.718800
0.030600,0.017750,0.230900,0.720750
0.031650,0.018350,0.227150,0.722850
0.033000,0.018550,0.223700,0.724750
0.034200,0.018350,0.220600,0.726850
0.035300,0.018800,0.216800,0.729100
0.036700,0.017950,0.214350,0.731000
0.037050,0.018750,0.210300,0.733900
0.037450,0.018550,0.208750,0.735250
0.037400,0.020350,0.205500,0.736750
0.038000,0.019650,0.202700,0.739650
0.039500,0.019550,0.199750,0.741200
0.039300,0.019200,0.197650,0.743850
0.038400,0.020100,0.194600,0.746900
0.038300,0.020100,0.192050,0.749550
0.039000,0.019950,0.189450,0.751600
0.039350,0.020850,0.185400,0.754400
0.039600,0.020650,0.183700,0.756050
0.040350,0.019950,0.181650,0.758050
0.039750,0.020200,0.179000,0.761050
0.039750,0.020250,0.176350,0.763650
0.039100,0.022000,0.173250,0.765650
0.039100,0.021600,0.171050,0.768250
0.039450,0.021400,0.168400,0.770750
0.040150,0.019600,0.168400,0.771850
0.040750,0.018850,0.166650,0.773750
0.040600,0.018650,0.164750,0.776000
0.041300,0.015950,0.163900,0.778850
0.040450,0.016250,0.162500,0.780800
0.039200,0.017300,0.161900,0.781600
0.039500,0.016100,0.161150,0.783250
0.039700,0.015150,0.160900,0.784250
0.037850,0.014100,0.161650,0.786400
0.037000,0.014400,0.160650,0.787950
0.036350,0.014250,0.159700,0.789700
0.035450,0.014900,0.159400,0.790250
0.034000,0.014800,0.159200,0.792000
0.033650,0.014450,0.159300,0.792600
0.034350,0.015250,0.158450,0.791950
0.033200,0.014550,0.159850,0.792400
0.032400,0.014350,0.159850,0.793400
0.032400,0.013450,0.160950,0.793200
0.031450,0.014150,0.160700,0.793700
0.031300,0.013550,0.160850,0.794300
0.030250,0.013300,0.161400,0.795050
0.029950,0.013000,0.161950,0.795100
0.028950,0.013000,0.162200,0.795850
0.028900,0.013450,0.162650,0.795000
0.029100,0.013100,0.162450,0.795350
0.029150,0.013200,0.162450,0.795200
0.029700,0.012850,0.162650,0.794800
0.029550,0.012550,0.163600,0.794300
0.028800,0.012750,0.163500,0.794950
0.028500,0.013200,0.163550,0.794750
0.028800,0.011950,0.165200,0.794050
0.028450,0.012100,0.165300,0.794150
0.028800,0.012850,0.164700,0.793650
0.028600,0.012300,0.165800,0.793300
0.029600,0.011950,0.165800,0.792650
0.028200,0.011550,0.167000,0.793250
0.027350,0.012150,0.166850,0.793650
0.026100,0.012200,0.168300,0.793400
0.025600,0.012150,0.169150,0.793100
0.025900,0.012600,0.170850,0.790650
0.024600,0.012450,0.172850,0.790100
0.023900,0.013250,0.173450,0.789400
0.024400,0.012850,0.175150,0.787600
0.024850,0.012700,0.175800,0.786650
0.025000,0.011350,0.178450,0.785200
0.024900,0.010700,0.180100,0.784300
0.025050,0.011300,0.181050,0.782600
0.024500,0.010600,0.181850,0.783050
0.024050,0.011600,0.182250,0.782100
0.024350,0.011350,0.184450,0.779850
0.025150,0.011100,0.186150,0.777600
0.025250,0.011800,0.186200,0.776750
0.025400,0.012100,0.186800,0.775700
0.024700,0.012650,0.187150,0.775500
0.024950,0.012900,0.187350,0.774800
0.025100,0.012650,0.188250,0.774000
0.024800,0.012350,0.189250,0.773600
0.025350,0.012150,0.190600,0.771900
0.024900,0.013000,0.190700,0.771400
0.024900,0.013800,0.190550,0.770750
0.025650,0.013300,0.190900,0.770150
0.025800,0.012550,0.191200,0.770450
0.025600,0.012450,0.191650,0.770300
0.026000,0.012400,0.192550,0.769050
0.026850,0.011750,0.192400,0.769000
0.027150,0.011800,0.191950,0.769100
0.027150,0.011950,0.192350,0.768550
0.027200,0.012600,0.192700,0.767500
0.026850,0.012700,0.192850,0.767600
0.026750,0.012550,0.193750,0.766950
0.027300,0.013600,0.193100,0.766000
0.027950,0.014000,0.192800,0.765250
0.027300,0.014000,0.193150,0.765550
0.028150,0.014050,0.193250,0.764550
0.028500,0.013550,0.193750,0.764200
0.028900,0.013900,0.193550,0.763650
0.029750,0.014500,0.192700,0.763050
0.029000,0.014350,0.193400,0.763250
0.028250,0.014900,0.193300,0.763550
0.028800,0.015150,0.193000,0.763050
0.028650,0.014700,0.193700,0.762950
0.029100,0.014450,0.194200,0.762250
0.028850,0.015150,0.194250,0.761750
0.029000,0.016050,0.193900,0.761050
0.028800,0.016700,0.193300,0.761200
0.030250,0.015700,0.193250,0.760800
0.031200,0.014900,0.194000,0.759900
0.030600,0.015500,0.194150,0.759750
0.031550,0.014500,0.195050,0.758900
0.031050,0.014300,0.194850,0.759800
0.030850,0.013650,0.195150,0.760350
0.030050,0.013700,0.195300,0.760950
0.029500,0.014450,0.195350,0.760700
0.029450,0.013650,0.196100,0.760800
0.029650,0.014450,0.196050,0.759850
0.030150,0.015100,0.195700,0.759050
0.031000,0.014850,0.195950,0.758200
0.031700,0.015600,0.196050,0.756650
0.033100,0.015900,0.194900,0.756100
0.033450,0.015950,0.194900,0.755700
0.033100,0.016250,0.194900,0.755750
0.033350,0.017000,0.193450,0.756200
0.034000,0.017050,0.192350,0.756600
0.034450,0.017000,0.193100,0.755450
0.035500,0.016200,0.193100,0.755200
0.035300,0.015950,0.194350,0.754400
0.034550,0.016350,0.194500,0.754600
0.034400,0.016350,0.194200,0.755050
0.035350,0.016200,0.194100,0.754350
0.034850,0.017050,0.193150,0.754950
0.034250,0.016800,0.192850,0.756100
0.034950,0.015650,0.193150,0.756250
0.034400,0.017250,0.192350,0.756000
0.034750,0.017650,0.191900,0.755700
0.034650,0.017800,0.192100,0.755450
0.036050,0.017700,0.191450,0.754800
0.036750,0.017400,0.190250,0.755600
0.036000,0.017100,0.190550,0.756350
0.036400,0.017850,0.189350,0.756400
0.036600,0.017850,0.189500,0.756050
0.037000,0.016400,0.190650,0.755950
0.036400,0.016850,0.189600,0.757150
0.036300,0.018350,0.188600,0.756750
0.036500,0.019050,0.187450,0.757000
0.037000,0.019600,0.187600,0.755800
0.036700,0.019550,0.186650,0.757100
0.037100,0.019250,0.186900,0.756750
0.037650,0.019950,0.185000,0.757400
0.036500,0.019750,0.184350,0.759400
0.037100,0.019350,0.183300,0.760250
0.037600,0.019500,0.183400,0.759500
0.038150,0.018550,0.182200,0.761100
0.039100,0.018750,0.180350,0.761800
0.037000,0.019300,0.180650,0.763050
0.037850,0.019150,0.180250,0.762750
0.037350,0.018300,0.180000,0.764350
0.037700,0.017450,0.180400,0.764450
0.037550,0.017550,0.179300,0.765600
0.036950,0.017300,0.179300,0.766450
0.037050,0.018800,0.178550,0.765600
0.037050,0.019050,0.177850,0.766050
0.038350,0.020400,0.175900,0.765350
0.039750,0.019200,0.174950,0.766100
0.039550,0.018500,0.175300,0.766650
0.039400,0.018750,0.174500,0.767350
0.039600,0.018200,0.173350,0.768850
0.039650,0.017700,0.173800,0.768850
0.038100,0.017900,0.173200,0.770800
0.036900,0.017850,0.173950,0.771300
0.036150,0.017850,0.174000,0.772000
0.037350,0.017200,0.173750,0.771700
0.036800,0.017150,0.173550,0.772500
0.036700,0.016850,0.173550,0.772900
0.037000,0.016650,0.173850,0.772500
0.037100,0.015500,0.175100,0.772300
0.036950,0.015700,0.175550,0.771800
0.035700,0.016350,0.175650,0.772300
0.036500,0.015900,0.176850,0.770750
0.035950,0.015750,0.176500,0.771800
0.036050,0.015650,0.176950,0.771350
0.035550,0.016000,0.177200,0.771250
0.034950,0.017600,0.175600,0.771850
0.035550,0.016900,0.176100,0.771450
0.035600,0.016500,0.176950,0.770950
0.035800,0.016200,0.176750,0.771250
0.035350,0.015400,0.178150,0.771100
0.034400,0.015600,0.178100,0.771900
0.034850,0.015450,0.178950,0.770750
0.033850,0.016450,0.178950,0.770750
0.034000,0.017450,0.177950,0.770600
0.034650,0.017750,0.176300,0.771300
0.036250,0.016600,0.176450,0.770700
0.035950,0.016200,0.177450,0.770400
0.035750,0.015500,0.178550,0.770200
0.036050,0.015450,0.178150,0.770350
0.034200,0.016450,0.177200,0.772150
0.033850,0.016950,0.177300,0.771900
0.033750,0.017000,0.177800,0.771450
0.035200,0.017350,0.176200,0.771250
0.035000,0.017500,0.176750,0.770750
0.035200,0.017200,0.176050,0.771550
0.034000,0.017050,0.175950,0.773000
0.035150,0.015600,0.177400,0.771850
0.035500,0.016550,0.177050,0.770900
0.034750,0.016400,0.177750,0.771100
0.035350,0.016900,0.177900,0.769850
0.034250,0.017250,0.176550,0.771950
0.033850,0.017400,0.176900,0.771850
0.034700,0.016800,0.177400,0.771100
0.034350,0.016200,0.178350,0.771100
0.034400,0.015650,0.179150,0.770800
0.034000,0.016550,0.178200,0.771250
0.033050,0.017000,0.177000,0.772950
0.033950,0.017150,0.176550,0.772350
0.034150,0.017300,0.176450,0.772100
0.034800,0.016300,0.176900,0.772000
0.034200,0.017250,0.175200,0.773350
0.035500,0.016150,0.175500,0.772850
0.035100,0.015900,0.175250,0.773750
0.035950,0.015700,0.174900,0.773450
0.034500,0.015400,0.175700,0.774400
0.035250,0.014900,0.176100,0.773750
0.033600,0.015500,0.176900,0.774000
0.033350,0.016000,0.176800,0.773850
0.033650,0.016400,0.177350,0.772600
0.033050,0.016550,0.178000,0.772400
0.032950,0.016200,0.178050,0.772800
0.034200,0.015600,0.179650,0.770550
0.033900,0.015600,0.180050,0.770450
0.034150,0.014850,0.180650,0.770350
0.034250,0.014000,0.181000,0.770750
0.033700,0.014900,0.180500,0.770900
0.033950,0.014100,0.181800,0.770150
0.033100,0.014800,0.181950,0.770150
0.032900,0.014900,0.181950,0.770250
0.033350,0.015150,0.181450,0.770050
0.033200,0.015200,0.181500,0.770100
0.033000,0.014850,0.181350,0.770800
0.031950,0.014900,0.182900,0.770250
0.031800,0.015650,0.183100,0.769450
0.032200,0.016000,0.183600,0.768200
0.031750,0.015950,0.184100,0.768200
0.031350,0.016600,0.183450,0.768600
0.032450,0.015850,0.184350,0.767350
0.033350,0.015550,0.183650,0.767450
0.033050,0.016000,0.183950,0.767000
0.033000,0.015750,0.184100,0.767150
0.032550,0.015200,0.184400,0.767850
0.032400,0.015600,0.184550,0.767450
0.032350,0.015850,0.184600,0.767200
0.033300,0.015450,0.183850,0.767400
0.033350,0.015550,0.184250,0.766850
0.033750,0.015200,0.184000,0.767050
0.033450,0.015850,0.184550,0.766150
0.033650,0.016000,0.184350,0.766000
0.033600,0.017300,0.183150,0.765950
0.033000,0.017250,0.183850,0.765900
0.033400,0.017100,0.183650,0.765850
0.033600,0.016050,0.184200,0.766150
0.034250,0.014900,0.184100,0.766750
0.033700,0.016750,0.182750,0.766800
0.033350,0.016600,0.182600,0.767450
0.032900,0.016900,0.182450,0.767750
0.033500,0.016200,0.183150,0.767150
0.033450,0.016300,0.183850,0.766400
0.034150,0.015600,0.184700,0.765550
0.034250,0.015550,0.184700,0.765500
0.033800,0.015250,0.185250,0.765700
0.033100,0.015550,0.185450,0.765900
0.033400,0.014900,0.186700,0.765000
0.033150,0.016000,0.185800,0.765050
0.034100,0.015850,0.185300,0.764750
0.033900,0.014750,0.186800,0.764550
0.033950,0.015300,0.186650,0.764100
0.034550,0.015350,0.187050,0.763050
0.034150,0.015750,0.187350,0.762750
0.032350,0.015650,0.188300,0.763700
0.033250,0.017100,0.188550,0.761100
0.033850,0.016450,0.188700,0.761000
0.034300,0.017400,0.188350,0.759950
0.034150,0.018250,0.187350,0.760250
0.034450,0.016700,0.188400,0.760450
0.035050,0.017550,0.188300,0.759100
0.036250,0.017350,0.187950,0.758450
0.035750,0.018100,0.187500,0.758650
0.035950,0.017750,0.187250,0.759050
0.034700,0.018300,0.187250,0.759750
0.035050,0.017550,0.187400,0.760000
0.035550,0.017900,0.186100,0.760450
0.037000,0.018400,0.184650,0.759950
0.037650,0.018050,0.184700,0.759600
0.037550,0.018850,0.184150,0.759450
0.036750,0.018900,0.183500,0.760850
0.036200,0.018950,0.183800,0.761050
0.037500,0.018600,0.182850,0.761050
0.037100,0.017450,0.183800,0.761650
0.037350,0.017350,0.184250,0.761050
0.037650,0.017850,0.183350,0.761150
0.038150,0.017400,0.183800,0.760650
0.036400,0.018700,0.182850,0.762050
0.037650,0.017450,0.182900,0.762000
0.038300,0.018250,0.180750,0.762700
0.037550,0.018600,0.180250,0.763600
0.036950,0.019200,0.179000,0.764850
0.036800,0.018850,0.179450,0.764900
0.035600,0.019350,0.178050,0.767000
0.036100,0.018250,0.179250,0.766400
0.036150,0.018450,0.178550,0.766850
0.036750,0.016750,0.179150,0.767350
0.036350,0.017150,0.178050,0.768450
0.036550,0.017200,0.177750,0.768500
0.035600,0.017900,0.176800,0.769700
0.036600,0.017150,0.176500,0.769750
0.036400,0.017300,0.176000,0.770300
0.036500,0.017650,0.175150,0.770700
0.036650,0.017950,0.175750,0.769650
0.036900,0.017850,0.175450,0.769800
0.037000,0.017550,0.176250,0.769200
0.036250,0.017650,0.176700,0.769400
0.036200,0.016850,0.177200,0.769750
0.036800,0.017550,0.176900,0.768750
0.036750,0.017400,0.177750,0.768100
0.037200,0.017050,0.178400,0.767350
0.037550,0.016400,0.178900,0.767150
0.037600,0.016050,0.177850,0.768500
0.036550,0.015550,0.178300,0.769600
0.035450,0.016300,0.178650,0.769600
0.034550,0.015900,0.179450,0.770100
0.034650,0.015550,0.179050,0.770750
0.033750,0.017000,0.177650,0.771600
0.033450,0.016100,0.179000,0.771450
0.034250,0.015850,0.179250,0.770650
0.033850,0.016350,0.179400,0.770400
0.033650,0.015100,0.180350,0.770900
0.033100,0.015400,0.181850,0.769650
0.033200,0.016000,0.181950,0.768850
0.033150,0.016250,0.181750,0.768850
0.033600,0.016050,0.182000,0.768350
0.034850,0.015900,0.182750,0.766500
0.033700,0.016250,0.182200,0.767850
0.033250,0.016600,0.181550,0.768600
0.033550,0.016650,0.181400,0.768400
0.033200,0.016050,0.182200,0.768550
0.033850,0.016350,0.181800,0.768000
0.034500,0.016750,0.181550,0.767200
0.035700,0.016700,0.181000,0.766600
0.036200,0.017000,0.181000,0.765800
0.036650,0.016200,0.181350,0.765800
0.035400,0.016850,0.181000,0.766750
0.035450,0.016400,0.181700,0.766450
0.035600,0.015300,0.182200,0.766900
0.035300,0.015050,0.182700,0.766950
0.034350,0.016600,0.182850,0.766200
0.035550,0.015500,0.183550,0.765400
0.035300,0.015800,0.184650,0.764250
0.033850,0.015850,0.185750,0.764550
0.033500,0.017050,0.185300,0.764150
0.034100,0.016250,0.185650,0.764000
0.035400,0.015400,0.186250,0.762950
0.035850,0.016800,0.186550,0.760800
0.036450,0.015950,0.187100,0.760500
0.035600,0.016800,0.186450,0.761150
0.035850,0.017300,0.186350,0.760500
0.036750,0.016600,0.187050,0.759600
0.037100,0.017000,0.187100,0.758800
0.036800,0.017200,0.187850,0.758150
0.036900,0.017700,0.188300,0.757100
0.036550,0.017900,0.188850,0.756700
0.036850,0.017700,0.188550,0.756900
0.037350,0.018200,0.188050,0.756400
0.036900,0.018400,0.187650,0.757050
0.036300,0.018650,0.187850,0.757200
0.037850,0.019000,0.186900,0.756250
0.038700,0.018600,0.185950,0.756750
0.038850,0.018700,0.184550,0.757900
0.039700,0.018700,0.183700,0.757900
0.040050,0.019500,0.181750,0.758700
0.039450,0.019750,0.181400,0.759400
0.039400,0.020400,0.179900,0.760300
0.039050,0.019950,0.179250,0.761750
0.039750,0.018350,0.179450,0.762450
0.039450,0.018700,0.179400,0.762450
0.039500,0.018850,0.178050,0.763600
0.040100,0.017700,0.178350,0.763850
0.040200,0.017200,0.178100,0.764500
0.039800,0.017350,0.177200,0.765650
0.039900,0.017000,0.176600,0.766500
0.038400,0.017050,0.176950,0.767600
0.039350,0.016350,0.177850,0.766450
0.038750,0.016750,0.177800,0.766700
0.038050,0.015850,0.178500,0.767600
0.037150,0.016050,0.178000,0.768800
0.036850,0.015650,0.178200,0.769300
0.037150,0.015700,0.177950,0.769200
0.035950,0.017600,0.176900,0.769550
0.035750,0.017100,0.177050,0.770100
0.035200,0.017600,0.177450,0.769750
0.035050,0.017150,0.178550,0.769250
0.035350,0.017500,0.178100,0.769050
0.034000,0.018650,0.178000,0.769350
0.034100,0.017700,0.178000,0.770200
0.033800,0.016750,0.179100,0.770350
0.032650,0.016650,0.178950,0.771750
0.032550,0.016550,0.179550,0.771350
0.032400,0.016100,0.180500,0.771000
0.032500,0.016200,0.181550,0.769750
0.032500,0.016050,0.182000,0.769450
0.032050,0.017100,0.181150,0.769700
0.032650,0.016600,0.181050,0.769700
0.033450,0.016450,0.181750,0.768350
0.033050,0.016300,0.181900,0.768750
0.033600,0.014950,0.184450,0.767000
0.032400,0.015000,0.185500,0.767100
0.031750,0.015500,0.185000,0.767750
0.031850,0.015450,0.184500,0.768200
0.031050,0.016400,0.184900,0.767650
0.032300,0.016350,0.184800,0.766550
0.031850,0.016200,0.185450,0.766500
0.033100,0.016100,0.185350,0.765450
0.033550,0.015450,0.185400,0.765600
0.033200,0.015100,0.186550,0.765150
0.033300,0.014750,0.188050,0.763900
0.032450,0.016300,0.187550,0.763700
0.031550,0.016800,0.188050,0.763600
0.032250,0.016350,0.188650,0.762750
0.033500,0.015000,0.189650,0.761850
0.031900,0.016250,0.189800,0.762050
0.032250,0.015900,0.191050,0.760800
0.032500,0.016200,0.192100,0.759200
0.032000,0.016950,0.191900,0.759150
0.033500,0.016250,0.190950,0.759300
0.034350,0.016100,0.190650,0.758900
0.034500,0.016750,0.188750,0.760000
0.035200,0.017000,0.189000,0.758800
0.034650,0.018350,0.188250,0.758750
0.035200,0.018100,0.188800,0.757900
0.035750,0.018250,0.188200,0.757800
0.035050,0.019400,0.187350,0.758200
0.036200,0.018400,0.187100,0.758300
0.036250,0.018100,0.187000,0.758650
0.036550,0.017750,0.187600,0.758100
0.035700,0.018250,0.188650,0.757400
0.035250,0.018850,0.188350,0.757550
0.036500,0.019000,0.186650,0.757850
0.037000,0.018000,0.186350,0.758650
0.036950,0.018850,0.184700,0.759500
0.037500,0.018650,0.184950,0.758900
0.036650,0.018050,0.184500,0.760800
0.037750,0.017400,0.184350,0.760500
0.038700,0.016250,0.184400,0.760650
0.038950,0.016150,0.184900,0.760000
0.038650,0.017000,0.184300,0.760050
0.037750,0.018250,0.183200,0.760800
0.037300,0.018700,0.182450,0.761550
0.037850,0.018250,0.182950,0.760950
0.037900,0.017100,0.184050,0.760950
0.037300,0.019000,0.181850,0.761850
0.037650,0.018150,0.182300,0.761900
0.037650,0.018100,0.182350,0.761900
0.036650,0.018750,0.182150,0.762450
0.036400,0.018600,0.182550,0.762450
0.037850,0.017500,0.182400,0.762250
0.036750,0.017450,0.181450,0.764350
0.036100,0.015750,0.182850,0.765300
0.035400,0.015700,0.183800,0.765100
0.035600,0.016850,0.182850,0.764700
0.035750,0.017400,0.182350,0.764500
0.035100,0.018100,0.182000,0.764800
0.034950,0.018250,0.183050,0.763750
0.034950,0.018150,0.183300,0.763600
0.035100,0.018350,0.181150,0.765400
0.035300,0.018050,0.180450,0.766200
0.036450,0.017350,0.181200,0.765000
0.036700,0.017900,0.180200,0.765200
0.035000,0.017700,0.180800,0.766500
0.035250,0.016450,0.181950,0.766350
0.034750,0.016850,0.182600,0.765800
0.033650,0.016600,0.183050,0.766700
0.034250,0.017150,0.182950,0.765650
0.033650,0.017450,0.182950,0.765950
0.034000,0.017300,0.182900,0.765800
0.034050,0.016900,0.182500,0.766550
0.033800,0.017400,0.182050,0.766750
0.034400,0.017700,0.181350,0.766550
0.034900,0.017550,0.180700,0.766850
0.035200,0.018250,0.180300,0.766250
0.036000,0.018600,0.179200,0.766200
0.035950,0.019150,0.178850,0.766050
0.036300,0.018550,0.179450,0.765700
0.037000,0.017850,0.179050,0.766100
0.036800,0.017400,0.178900,0.766900
0.035750,0.017750,0.179350,0.767150
0.036150,0.017350,0.179450,0.767050
0.035900,0.017250,0.179950,0.766900
0.035750,0.018550,0.178700,0.767000
0.036350,0.017900,0.178750,0.767000
0.036100,0.018000,0.177450,0.768450
0.036050,0.017900,0.177500,0.768550
0.036200,0.017700,0.177150,0.768950
0.036750,0.016850,0.176650,0.769750
0.037100,0.015950,0.176350,0.770600
0.037100,0.015900,0.175850,0.771150
0.035100,0.016850,0.176300,0.771750
0.035050,0.015600,0.176650,0.772700
0.035250,0.015100,0.177300,0.772350
0.035100,0.015300,0.177600,0.772000
0.034800,0.015750,0.177700,0.771750
0.034300,0.016850,0.177350,0.771500
0.034850,0.016400,0.178100,0.770650
0.035250,0.015800,0.178800,0.770150
0.035850,0.015450,0.180100,0.768600
0.034500,0.016950,0.179900,0.768650
0.035250,0.016550,0.179500,0.768700
0.035450,0.016800,0.180450,0.767300
0.035200,0.016850,0.180350,0.767600
0.035150,0.016450,0.180150,0.768250
0.035600,0.017100,0.180550,0.766750
0.035750,0.016550,0.180950,0.766750
0.035750,0.016200,0.181500,0.766550
0.035350,0.016600,0.180950,0.767100
0.036750,0.015900,0.181100,0.766250
0.036500,0.015900,0.181500,0.766100
0.037050,0.016300,0.180900,0.765750
0.035550,0.017550,0.180750,0.766150
0.035400,0.018250,0.181000,0.765350
0.036100,0.018050,0.180300,0.765550
0.037150,0.017250,0.180250,0.765350
0.037500,0.016350,0.180550,0.765600
0.036850,0.016900,0.180700,0.765550
0.036450,0.017750,0.179850,0.765950
0.036250,0.017450,0.179250,0.767050
