I,E,S,R
0.001000,0.000450,0.998550,0.000000
0.001050,0.001300,0.997550,0.000100
0.001500,0.001350,0.996750,0.000400
0.001700,0.002250,0.995500,0.000550
0.002200,0.002650,0.994300,0.000850
0.002550,0.003550,0.992750,0.001150
0.002900,0.004200,0.991450,0.001450
0.003500,0.004900,0.989500,0.002100
0.004500,0.006650,0.986250,0.002600
0.005700,0.008900,0.982250,0.003150
0.008200,0.011900,0.976400,0.003500
0.010450,0.015650,0.969250,0.004650
0.013150,0.019600,0.960950,0.006300
0.016800,0.024800,0.950150,0.008250
0.022200,0.030700,0.936500,0.010600
0.027050,0.040950,0.917950,0.014050
0.034450,0.051200,0.896500,0.017850
0.044450,0.065700,0.867950,0.021900
0.057850,0.081000,0.833500,0.027650
0.072750,0.098450,0.793350,0.035450
0.090000,0.120550,0.743150,0.046300
0.111700,0.144800,0.685650,0.057850
0.138350,0.165900,0.624050,0.071700
0.165950,0.190950,0.553100,0.090000
0.197800,0.212950,0.477150,0.112100
0.230050,0.227800,0.401750,0.140400
0.263200,0.233000,0.331400,0.172400
0.295100,0.232850,0.266350,0.205700
0.319850,0.227300,0.208500,0.244350
0.342750,0.209750,0.161450,0.286050
0.354850,0.193450,0.121850,0.329850
0.365750,0.167150,0.092900,0.374200
0.365650,0.142750,0.069650,0.421950
0.356550,0.118650,0.053300,0.471500
0.343300,0.098100,0.041350,0.517250
0.325200,0.078250,0.034300,0.562250
0.302250,0.063100,0.028650,0.606000
0.281900,0.049650,0.024900,0.643550
0.259300,0.039950,0.022150,0.678600
0.237300,0.032350,0.020600,0.709750
0.214050,0.025300,0.019950,0.740700
0.190300,0.021450,0.019850,0.768400
0.171050,0.017300,0.019150,0.792500
0.150950,0.015150,0.019550,0.814350
0.135600,0.012850,0.020250,0.831300
0.121650,0.010750,0.021300,0.846300
0.110550,0.008700,0.022900,0.857850
0.099000,0.006900,0.024900,0.869200
0.088150,0.006850,0.026350,0.878650
0.075000,0.006650,0.027850,0.890500
0.066800,0.005700,0.029650,0.897850
0.059100,0.005350,0.030650,0.904900
0.051500,0.005300,0.032850,0.910350
0.045800,0.004750,0.034300,0.915150
0.040900,0.004850,0.036550,0.917700
0.036350,0.004550,0.039450,0.919650
0.033250,0.004250,0.041600,0.920900
0.029650,0.004050,0.044100,0.922200
0.026550,0.003100,0.046050,0.924300
0.023750,0.002950,0.047900,0.925400
0.021100,0.002950,0.050850,0.925100
0.019500,0.002700,0.053150,0.924650
0.017800,0.002350,0.055950,0.923900
0.015850,0.002050,0.058600,0.923500
0.014650,0.001500,0.061350,0.922500
0.012850,0.001650,0.064350,0.921150
0.011100,0.002200,0.066400,0.920300
0.010250,0.002300,0.069000,0.918450
0.010250,0.001950,0.071400,0.916400
0.009450,0.001600,0.074400,0.914550
0.009000,0.001600,0.078450,0.910950
0.008200,0.001700,0.081950,0.908150
0.007750,0.001400,0.084700,0.906150
0.007700,0.001200,0.087350,0.903750
0.007000,0.001300,0.089850,0.901850
0.006050,0.001450,0.092650,0.899850
0.005500,0.001400,0.095150,0.897950
0.005200,0.001400,0.097600,0.895800
0.004900,0.001450,0.100350,0.893300
0.004650,0.001350,0.103150,0.890850
0.004300,0.001700,0.105900,0.888100
0.004300,0.001450,0.108150,0.886100
0.004250,0.001500,0.109750,0.884500
0.004500,0.001150,0.112500,0.881850
0.004000,0.000850,0.114900,0.880250
0.003600,0.001000,0.117750,0.877650
0.003100,0.001300,0.120100,0.875500
0.003200,0.001400,0.122550,0.872850
0.003000,0.001500,0.125100,0.870400
0.002650,0.001250,0.127700,0.868400
0.002400,0.001300,0.130200,0.866100
0.002650,0.001250,0.132900,0.863200
0.002700,0.001150,0.135400,0.860750
0.002600,0.000850,0.138000,0.858550
0.002350,0.000800,0.140300,0.856550
0.002100,0.000900,0.142750,0.854250
0.002150,0.001050,0.144800,0.852000
0.002250,0.001000,0.147000,0.849750
0.002000,0.000900,0.149550,0.847550
0.001800,0.000800,0.151900,0.845500
0.002050,0.000600,0.154000,0.843350
0.001950,0.000700,0.156150,0.841200
0.001950,0.000850,0.158200,0.839000
0.001900,0.000550,0.161150,0.836400
0.001700,0.000750,0.163000,0.834550
0.001700,0.000600,0.165700,0.832000
0.001550,0.000850,0.167750,0.829850
0.001450,0.001050,0.170150,0.827350
0.001500,0.001000,0.172900,0.824600
0.001550,0.000800,0.175200,0.822450
0.001250,0.000850,0.177450,0.820450
0.001150,0.000750,0.179900,0.818200
0.001300,0.000700,0.181500,0.816500
0.001200,0.000750,0.183800,0.814250
0.001250,0.000800,0.185550,0.812400
0.001200,0.000650,0.187750,0.810400
0.001250,0.000650,0.190800,0.807300
0.001500,0.000500,0.193050,0.804950
0.001450,0.000750,0.195300,0.802500
0.001450,0.000700,0.197850,0.800000
0.001250,0.000800,0.200150,0.797800
0.001250,0.000800,0.202150,0.795800
0.001350,0.000800,0.204600,0.793250
0.001500,0.000750,0.206650,0.791100
0.001350,0.000900,0.208300,0.789450
0.001400,0.001050,0.210600,0.786950
0.001550,0.001050,0.212450,0.784950
0.001450,0.001000,0.214300,0.783250
0.001500,0.000950,0.217250,0.780300
0.001900,0.000650,0.219400,0.778050
0.001900,0.000650,0.221700,0.775750
0.001900,0.000700,0.223950,0.773450
0.001800,0.000700,0.226050,0.771450
0.001800,0.000750,0.228150,0.769300
0.001750,0.000900,0.230300,0.767050
0.001750,0.001050,0.232150,0.765050
0.001850,0.001050,0.234200,0.762900
0.001750,0.001200,0.235500,0.761550
0.001950,0.000950,0.237100,0.760000
0.002050,0.000850,0.238700,0.758400
0.001850,0.001000,0.240650,0.756500
0.001800,0.001250,0.243000,0.753950
0.001800,0.001200,0.245200,0.751800
0.002150,0.000900,0.247650,0.749300
0.001900,0.001200,0.249650,0.747250
0.001850,0.001250,0.251250,0.745650
0.002400,0.000750,0.252900,0.743950
0.002050,0.001000,0.255000,0.741950
0.002000,0.001250,0.256300,0.740450
0.002150,0.001550,0.257850,0.738450
0.002450,0.001650,0.259400,0.736500
0.002700,0.001750,0.261250,0.734300
0.002350,0.002050,0.263250,0.732350
0.003050,0.001700,0.264300,0.730950
0.002800,0.001950,0.266350,0.728900
0.002800,0.002050,0.267900,0.727250
0.003250,0.002000,0.269900,0.724850
0.003450,0.002000,0.271500,0.723050
0.003600,0.002500,0.272750,0.721150
0.003800,0.002500,0.273750,0.719950
0.004000,0.002750,0.275550,0.717700
0.004450,0.002700,0.277100,0.715750
0.004950,0.003100,0.277950,0.714000
0.005350,0.003300,0.279050,0.712300
0.005500,0.003600,0.280300,0.710600
0.005250,0.004050,0.280800,0.709900
0.005450,0.004100,0.281200,0.709250
0.005850,0.004150,0.282200,0.707800
0.006500,0.004700,0.283050,0.705750
0.006600,0.004650,0.284000,0.704750
0.007300,0.005300,0.283900,0.703500
0.007950,0.005650,0.283900,0.702500
0.007950,0.006050,0.284200,0.701800
0.008650,0.005900,0.284700,0.700750
0.009150,0.006250,0.285200,0.699400
0.009450,0.006850,0.285050,0.698650
0.010300,0.006500,0.285650,0.697550
0.010000,0.007100,0.285400,0.697500
0.010900,0.007200,0.285300,0.696600
0.011500,0.007450,0.285100,0.695950
0.011550,0.007850,0.285150,0.695450
0.012200,0.008000,0.285450,0.694350
0.012850,0.008350,0.285050,0.693750
0.013300,0.008100,0.284950,0.693650
0.014000,0.009050,0.284100,0.692850
0.014850,0.009650,0.283150,0.692350
0.015800,0.009500,0.282500,0.692200
0.016100,0.011100,0.280350,0.692450
0.016300,0.012350,0.278600,0.692750
0.017500,0.012350,0.277250,0.692900
0.018050,0.013250,0.276150,0.692550
0.019650,0.012750,0.274950,0.692650
0.020850,0.012850,0.273600,0.692700
0.022100,0.012900,0.271500,0.693500
0.023300,0.013800,0.268550,0.694350
0.024150,0.015000,0.265500,0.695350
0.025300,0.016700,0.261550,0.696450
0.027200,0.017150,0.257950,0.697700
0.027850,0.016450,0.256850,0.698850
0.028350,0.017650,0.254200,0.699800
0.030200,0.018400,0.250700,0.700700
0.031750,0.019500,0.246500,0.702250
0.033950,0.018750,0.243400,0.703900
0.035400,0.019750,0.238800,0.706050
0.036550,0.020550,0.233400,0.709500
0.036600,0.021400,0.229250,0.712750
0.037850,0.021450,0.225400,0.715300
0.038000,0.022900,0.220750,0.718350
0.040600,0.022600,0.216250,0.720550
0.041900,0.023500,0.211100,0.723500
0.042700,0.024750,0.205300,0.727250
0.043800,0.025500,0.200900,0.729800
0.044150,0.025400,0.196850,0.733600
0.045750,0.024550,0.193050,0.736650
0.047350,0.024700,0.188250,0.739700
0.046700,0.024950,0.184050,0.744300
0.047250,0.023800,0.180450,0.748500
0.047550,0.022750,0.177350,0.752350
0.047950,0.023850,0.172500,0.755700
0.048200,0.023600,0.169400,0.758800
0.048550,0.022600,0.166100,0.762750
0.046950,0.023300,0.163500,0.766250
0.047900,0.021850,0.160500,0.769750
0.046200,0.022650,0.156750,0.774400
0.047450,0.020600,0.155550,0.776400
0.047300,0.019700,0.154050,0.778950
0.043900,0.020250,0.151900,0.783950
0.043900,0.020100,0.149600,0.786400
0.043450,0.019550,0.148200,0.788800
0.042100,0.018450,0.147300,0.792150
0.041150,0.017650,0.145850,0.795350
0.040900,0.016800,0.145050,0.797250
0.039950,0.015950,0.144050,0.800050
0.039600,0.015050,0.142900,0.802450
0.038250,0.015700,0.142300,0.803750
0.037800,0.015350,0.141500,0.805350
0.036800,0.014250,0.142200,0.806750
0.036850,0.015100,0.140850,0.807200
0.035850,0.015350,0.139050,0.809750
0.035550,0.013750,0.139450,0.811250
0.034050,0.012350,0.139600,0.814000
0.032800,0.012050,0.140700,0.814450
0.032100,0.012350,0.141050,0.814500
0.031700,0.012100,0.141650,0.814550
0.030150,0.011900,0.143200,0.814750
0.029750,0.011550,0.145300,0.813400
0.028700,0.011150,0.146200,0.813950
0.027800,0.012400,0.147050,0.812750
0.027000,0.012100,0.148100,0.812800
0.026550,0.012250,0.149300,0.811900
0.026750,0.011400,0.150400,0.811450
0.025400,0.010700,0.151500,0.812400
0.025450,0.010500,0.152200,0.811850
0.024700,0.010500,0.152600,0.812200
0.024900,0.009100,0.155200,0.810800
0.024500,0.008200,0.157050,0.810250
0.023450,0.008500,0.157950,0.810100
0.022150,0.009450,0.158950,0.809450
0.021650,0.009950,0.161250,0.807150
0.021250,0.009550,0.162650,0.806550
0.021050,0.009550,0.163350,0.806050
0.021500,0.009750,0.164050,0.804700
0.021200,0.010650,0.164250,0.803900
0.021400,0.009950,0.165650,0.803000
0.021000,0.010050,0.166450,0.802500
0.020950,0.009600,0.168750,0.800700
0.020750,0.009700,0.170500,0.799050
0.020500,0.009950,0.171750,0.797800
0.020650,0.009600,0.173550,0.796200
0.020350,0.009700,0.175350,0.794600
0.020050,0.009250,0.177200,0.793500
0.021050,0.008650,0.178650,0.791650
0.020200,0.009550,0.180700,0.789550
0.019800,0.009100,0.183250,0.787850
0.018700,0.009800,0.184350,0.787150
0.018650,0.009450,0.187050,0.784850
0.018850,0.009350,0.189500,0.782300
0.019350,0.008950,0.191700,0.780000
0.018800,0.008750,0.193400,0.779050
0.018450,0.009550,0.194700,0.777300
0.018700,0.009450,0.195850,0.776000
0.019000,0.008050,0.198700,0.774250
0.019400,0.008250,0.199400,0.772950
0.018750,0.009150,0.201150,0.770950
0.018550,0.009000,0.202400,0.770050
0.018550,0.008500,0.204400,0.768550
0.017800,0.009150,0.206500,0.766550
0.018100,0.009450,0.207600,0.764850
0.017550,0.009750,0.209150,0.763550
0.018150,0.009350,0.211050,0.761450
0.018450,0.009850,0.212500,0.759200
0.018550,0.010700,0.213900,0.756850
0.020050,0.010150,0.214900,0.754900
0.020300,0.010550,0.214950,0.754200
0.020500,0.010600,0.216000,0.752900
0.019900,0.009800,0.218000,0.752300
0.020750,0.010300,0.218250,0.750700
0.021000,0.011050,0.219400,0.748550
0.021800,0.011250,0.220600,0.746350
0.022050,0.011900,0.220700,0.745350
0.021950,0.013150,0.220700,0.744200
0.022200,0.012650,0.221250,0.743900
0.022600,0.013300,0.221650,0.742450
0.023800,0.013100,0.222050,0.741050
0.024600,0.013200,0.222300,0.739900
0.024750,0.013400,0.222500,0.739350
0.024500,0.013850,0.222300,0.739350
0.025100,0.013350,0.222700,0.738850
0.025350,0.014000,0.223300,0.737350
0.025800,0.013850,0.224100,0.736250
0.026600,0.014000,0.223350,0.736050
0.026800,0.014800,0.221750,0.736650
0.026300,0.015600,0.221600,0.736500
0.027050,0.016500,0.221200,0.735250
0.028450,0.016350,0.220950,0.734250
0.029700,0.018050,0.218900,0.733350
0.030700,0.017800,0.218850,0.732650
0.031300,0.017650,0.217900,0.733150
0.031750,0.018200,0.216350,0.733700
0.033550,0.017500,0.216500,0.732450
0.035000,0.018150,0.215050,0.731800
0.034750,0.020150,0.212950,0.732150
0.036200,0.020400,0.211050,0.732350
0.035850,0.021300,0.208500,0.734350
0.037200,0.021050,0.206000,0.735750
0.037750,0.021900,0.203500,0.736850
0.038750,0.022350,0.201050,0.737850
0.039650,0.023250,0.198250,0.738850
0.042400,0.021950,0.197000,0.738650
0.042550,0.022550,0.195050,0.739850
0.042500,0.023000,0.192600,0.741900
0.043350,0.023550,0.190100,0.743000
0.044700,0.022800,0.188800,0.743700
0.044900,0.023450,0.185900,0.745750
0.045300,0.023050,0.184400,0.747250
0.044250,0.024200,0.181100,0.750450
0.044950,0.024550,0.178650,0.751850
0.044850,0.023100,0.177650,0.754400
0.046000,0.021400,0.176950,0.755650
0.045000,0.021700,0.175250,0.758050
0.045300,0.021350,0.174300,0.759050
0.045500,0.021050,0.173300,0.760150
0.045250,0.021200,0.171800,0.761750
0.046700,0.021200,0.169150,0.762950
0.046500,0.021350,0.167500,0.764650
0.046800,0.021050,0.166600,0.765550
0.047750,0.019900,0.165950,0.766400
0.048350,0.020000,0.165450,0.766200
0.047650,0.019650,0.163100,0.769600
0.047100,0.019550,0.162150,0.771200
0.046200,0.019750,0.160950,0.773100
0.046850,0.018800,0.160050,0.774300
0.044800,0.018550,0.160900,0.775750
0.044500,0.019050,0.159300,0.777150
0.042700,0.020000,0.158650,0.778650
0.042500,0.019300,0.158200,0.780000
0.041550,0.019100,0.157050,0.782300
0.041650,0.018200,0.157900,0.782250
0.041800,0.018050,0.157400,0.782750
0.040950,0.018100,0.157150,0.783800
0.039600,0.018550,0.157450,0.784400
0.038700,0.019350,0.157200,0.784750
0.038800,0.018050,0.157900,0.785250
0.039050,0.018200,0.158100,0.784650
0.037650,0.018050,0.157900,0.786400
0.037000,0.018950,0.158750,0.785300
0.036700,0.017250,0.160150,0.785900
0.036700,0.016100,0.161600,0.785600
0.035750,0.015600,0.162550,0.786100
0.034950,0.015300,0.163950,0.785800
0.033900,0.016050,0.163750,0.786300
0.033600,0.015350,0.164500,0.786550
0.033850,0.014250,0.166600,0.785300
0.033150,0.014050,0.167200,0.785600
0.032350,0.014100,0.168150,0.785400
0.031650,0.014700,0.168300,0.785350
0.030950,0.014800,0.168900,0.785350
0.031100,0.015200,0.169500,0.784200
0.031500,0.015250,0.170450,0.782800
0.031650,0.014750,0.170500,0.783100
0.031150,0.015450,0.169950,0.783450
0.030800,0.015150,0.171050,0.783000
0.029950,0.015450,0.171650,0.782950
0.029950,0.014000,0.174200,0.781850
0.029300,0.013700,0.176000,0.781000
0.028950,0.014050,0.177150,0.779850
0.029550,0.013850,0.178050,0.778550
0.029350,0.014450,0.178800,0.777400
0.029150,0.013950,0.179500,0.777400
0.030200,0.013550,0.180000,0.776250
0.029200,0.014650,0.179700,0.776450
0.029600,0.015450,0.179400,0.775550
0.030200,0.015050,0.179550,0.775200
0.029300,0.015450,0.181750,0.773500
0.030450,0.014750,0.182350,0.772450
0.030700,0.014200,0.184300,0.770800
0.030250,0.015100,0.184400,0.770250
0.030800,0.015200,0.184050,0.769950
0.030250,0.014950,0.185700,0.769100
0.030450,0.016100,0.185450,0.768000
0.031200,0.015850,0.184950,0.768000
0.030750,0.014800,0.186250,0.768200
0.031400,0.014550,0.187950,0.766100
0.030300,0.015400,0.189050,0.765250
0.030550,0.015250,0.190100,0.764100
0.031250,0.015350,0.191650,0.761750
0.031550,0.015350,0.192200,0.760900
0.031400,0.016400,0.192950,0.759250
0.031550,0.016650,0.192100,0.759700
0.032450,0.016700,0.192050,0.758800
0.033000,0.016400,0.191800,0.758800
0.033650,0.016300,0.191550,0.758500
0.033200,0.016000,0.191800,0.759000
0.033750,0.016900,0.191600,0.757750
0.032250,0.017750,0.190750,0.759250
0.033550,0.016900,0.190800,0.758750
0.032600,0.017950,0.191000,0.758450
0.032150,0.017550,0.190850,0.759450
0.032800,0.016400,0.190150,0.760650
0.033100,0.016200,0.190650,0.760050
0.034150,0.014950,0.191000,0.759900
0.033500,0.016450,0.191150,0.758900
0.034450,0.016050,0.191000,0.758500
0.034350,0.017250,0.190250,0.758150
0.034650,0.017550,0.189900,0.757900
0.035750,0.018550,0.189300,0.756400
0.036250,0.017850,0.189450,0.756450
0.037000,0.017250,0.189250,0.756500
0.037300,0.016850,0.188450,0.757400
0.038150,0.017450,0.187000,0.757400
0.037500,0.018500,0.185900,0.758100
0.037300,0.018000,0.186450,0.758250
0.037400,0.018200,0.185750,0.758650
0.037400,0.017850,0.184900,0.759850
0.036750,0.017900,0.184800,0.760550
0.036800,0.018150,0.184350,0.760700
0.037650,0.018700,0.183250,0.760400
0.038400,0.017050,0.183900,0.760650
0.038300,0.017150,0.183250,0.761300
0.038500,0.017550,0.182100,0.761850
0.038550,0.017750,0.181250,0.762450
0.037450,0.018550,0.180400,0.763600
0.038200,0.017750,0.180750,0.763300
0.037700,0.019200,0.179750,0.763350
0.038550,0.018850,0.178950,0.763650
0.038350,0.018750,0.177800,0.765100
0.037950,0.018400,0.176350,0.767300
0.037450,0.019050,0.175700,0.767800
0.036600,0.018850,0.175400,0.769150
0.037950,0.017700,0.174550,0.769800
0.037400,0.017550,0.174200,0.770850
0.038150,0.016150,0.173850,0.771850
0.035300,0.016700,0.174650,0.773350
0.035950,0.016450,0.174850,0.772750
0.036150,0.016700,0.173800,0.773350
0.036000,0.016600,0.173900,0.773500
0.035400,0.016700,0.173550,0.774350
0.034900,0.016900,0.173350,0.774850
0.034450,0.016850,0.173300,0.775400
0.033700,0.017200,0.173650,0.775450
0.034450,0.016650,0.173900,0.775000
0.034550,0.016750,0.173100,0.775600
0.033650,0.016500,0.173850,0.776000
0.034150,0.015750,0.174100,0.776000
0.034300,0.015550,0.174700,0.775450
0.033750,0.015700,0.176150,0.774400
0.034500,0.015200,0.177050,0.773250
0.034200,0.014850,0.177700,0.773250
0.034200,0.015300,0.177200,0.773300
0.034100,0.016850,0.177000,0.772050
0.033550,0.016700,0.177550,0.772200
0.033750,0.015750,0.177750,0.772750
0.034200,0.014900,0.177550,0.773350
0.033950,0.014950,0.178550,0.772550
0.034450,0.015500,0.178250,0.771800
0.033550,0.016300,0.177600,0.772550
0.033650,0.016350,0.176800,0.773200
0.034400,0.015700,0.176300,0.773600
0.033850,0.015300,0.176300,0.774550
0.033100,0.015250,0.177200,0.774450
0.033500,0.014800,0.178300,0.773400
0.032750,0.014850,0.179900,0.772500
0.032850,0.015350,0.178850,0.772950
0.033650,0.014950,0.178050,0.773350
0.032900,0.015800,0.178400,0.772900
0.033550,0.015200,0.177850,0.773400
0.033500,0.016650,0.177650,0.772200
0.032750,0.017200,0.177650,0.772400
0.034150,0.016050,0.178300,0.771500
0.033650,0.016650,0.177950,0.771750
0.034200,0.016400,0.179000,0.770400
0.034350,0.016300,0.178500,0.770850
0.035800,0.014800,0.178750,0.770650
0.035900,0.014700,0.178900,0.770500
0.034500,0.014650,0.179900,0.770950
0.034450,0.014350,0.179750,0.771450
0.032850,0.015650,0.178850,0.772650
0.033450,0.015300,0.179400,0.771850
0.033200,0.014900,0.180250,0.771650
0.032750,0.014900,0.179550,0.772800
0.033300,0.015200,0.179350,0.772150
0.032950,0.015900,0.178800,0.772350
0.032250,0.016650,0.178250,0.772850
0.032300,0.016000,0.178800,0.772900
0.032600,0.014700,0.180300,0.772400
0.031950,0.015400,0.180950,0.771700
0.032000,0.015250,0.181650,0.771100
0.031150,0.015550,0.182100,0.771200
0.031450,0.015800,0.181850,0.770900
0.031350,0.016700,0.181250,0.770700
0.031200,0.016650,0.180700,0.771450
0.032350,0.015250,0.182050,0.770350
0.030600,0.016400,0.182150,0.770850
0.031250,0.016250,0.181400,0.771100
0.030850,0.016950,0.181850,0.770350
0.032200,0.015250,0.182150,0.770400
0.032700,0.014350,0.183100,0.769850
0.032150,0.016750,0.181700,0.769400
0.031850,0.017450,0.181450,0.769250
0.031850,0.017050,0.182650,0.768450
0.032050,0.016800,0.184500,0.766650
0.032500,0.016250,0.185250,0.766000
0.031700,0.015950,0.186200,0.766150
0.031550,0.017100,0.185400,0.765950
0.032700,0.016800,0.185950,0.764550
0.032900,0.017600,0.185650,0.763850
0.032600,0.018400,0.184900,0.764100
0.032500,0.018100,0.185100,0.764300
0.032900,0.018900,0.184900,0.763300
0.033900,0.017400,0.184750,0.763950
0.033950,0.017550,0.184450,0.764050
0.033650,0.017300,0.185650,0.763400
0.033350,0.016400,0.186150,0.764100
0.033950,0.016900,0.185300,0.763850
0.034950,0.016950,0.184150,0.763950
0.035450,0.016650,0.184000,0.763900
0.034800,0.017200,0.183850,0.764150
0.034800,0.016900,0.183700,0.764600
0.035100,0.017100,0.182350,0.765450
0.035300,0.016900,0.182150,0.765650
0.034900,0.016950,0.182500,0.765650
0.034350,0.017300,0.183050,0.765300
0.033900,0.017100,0.183750,0.765250
0.034250,0.016150,0.184900,0.764700
0.034100,0.016500,0.185350,0.764050
0.034650,0.015600,0.186250,0.763500
0.033800,0.016050,0.186300,0.763850
0.034350,0.016600,0.186050,0.763000
0.034350,0.015600,0.186550,0.763500
0.034650,0.015500,0.186950,0.762900
0.034750,0.015950,0.186700,0.762600
0.035100,0.016350,0.186200,0.762350
0.035750,0.017600,0.183850,0.762800
0.036350,0.017200,0.183600,0.762850
0.035300,0.017050,0.183750,0.763900
0.034700,0.018250,0.182500,0.764550
0.034500,0.018800,0.181550,0.765150
0.035500,0.017850,0.182050,0.764600
0.036750,0.017650,0.180300,0.765300
0.036800,0.017900,0.180000,0.765300
0.036150,0.017700,0.178850,0.767300
0.035800,0.018800,0.179650,0.765750
0.035350,0.019550,0.179350,0.765750
0.036200,0.018800,0.179550,0.765450
0.036950,0.018100,0.179950,0.765000
0.037150,0.016950,0.180750,0.765150
0.037650,0.015950,0.181300,0.765100
0.036750,0.015900,0.181300,0.766050
0.036550,0.016400,0.181100,0.765950
0.035800,0.017150,0.180500,0.766550
0.036450,0.017100,0.180750,0.765700
0.036750,0.017000,0.180700,0.765550
0.035500,0.017850,0.180150,0.766500
0.035750,0.016500,0.181700,0.766050
0.036100,0.016950,0.181450,0.765500
0.035850,0.017650,0.181400,0.765100
0.035650,0.017700,0.181350,0.765300
0.035000,0.017600,0.182500,0.764900
0.035650,0.016450,0.184150,0.763750
0.036550,0.016800,0.183950,0.762700
0.034400,0.018250,0.183100,0.764250
0.035400,0.019000,0.182900,0.762700
0.036050,0.018600,0.183050,0.762300
0.035850,0.018550,0.183450,0.762150
0.036400,0.019000,0.182550,0.762050
0.037100,0.019200,0.181950,0.761750
0.037550,0.018750,0.182050,0.761650
0.037250,0.019100,0.180600,0.763050
0.037400,0.018300,0.182300,0.762000
0.036950,0.017750,0.182650,0.762650
0.037500,0.018300,0.181350,0.762850
0.037550,0.019550,0.180400,0.762500
0.036750,0.020400,0.180500,0.762350
0.037550,0.020400,0.179850,0.762200
0.037250,0.020700,0.179900,0.762150
0.038550,0.019500,0.180650,0.761300
0.038150,0.020100,0.180150,0.761600
0.038200,0.019050,0.181200,0.761550
0.038100,0.019200,0.180400,0.762300
0.037600,0.019250,0.180550,0.762600
0.038350,0.019200,0.181550,0.760900
0.038450,0.018250,0.182800,0.760500
0.038200,0.018550,0.181950,0.761300
0.038250,0.018650,0.181650,0.761450
0.037600,0.019450,0.181850,0.761100
0.037200,0.019650,0.181800,0.761350
0.038100,0.018150,0.183700,0.760050
0.037800,0.017850,0.182750,0.761600
0.038350,0.017650,0.182950,0.761050
0.039100,0.016750,0.182950,0.761200
0.038650,0.016950,0.183150,0.761250
0.037450,0.017200,0.182900,0.762450
0.037300,0.017250,0.182550,0.762900
0.037300,0.017500,0.181450,0.763750
0.037250,0.017350,0.180900,0.764500
0.037000,0.017250,0.181300,0.764450
0.036300,0.017400,0.181800,0.764500
0.035350,0.017350,0.182050,0.765250
0.035550,0.016750,0.182600,0.765100
0.036350,0.016750,0.183150,0.763750
0.035950,0.016400,0.184300,0.763350
0.035100,0.017750,0.184900,0.762250
0.035250,0.017250,0.184300,0.763200
0.035600,0.017750,0.183250,0.763400
0.035450,0.018350,0.183550,0.762650
0.035600,0.017950,0.183650,0.762800
0.036550,0.017100,0.183750,0.762600
0.035900,0.017350,0.183800,0.762950
0.036500,0.017050,0.183850,0.762600
0.036950,0.017300,0.183350,0.762400
0.036450,0.017850,0.182700,0.763000
0.037200,0.017250,0.183450,0.762100
0.037250,0.016350,0.183550,0.762850
0.037750,0.015800,0.183550,0.762900
0.036250,0.017450,0.183000,0.763300
0.036600,0.017700,0.182850,0.762850
0.035700,0.017950,0.183050,0.763300
0.035650,0.019000,0.182700,0.762650
0.036700,0.018700,0.182750,0.761850
0.038000,0.018000,0.183300,0.760700
0.038900,0.017650,0.183000,0.760450
0.038400,0.018350,0.181050,0.762200
0.038300,0.018250,0.181700,0.761750
0.038900,0.018250,0.181600,0.761250
0.038350,0.018600,0.181250,0.761800
0.038400,0.018850,0.180600,0.762150
0.037800,0.018600,0.180750,0.762850
0.037950,0.019250,0.178850,0.763950
0.037850,0.019450,0.178900,0.763800
0.037750,0.019700,0.178500,0.764050
0.038100,0.019600,0.177750,0.764550
0.038300,0.019100,0.177250,0.765350
0.038350,0.019100,0.176300,0.766250
0.038750,0.018700,0.176400,0.766150
0.039650,0.018300,0.176250,0.765800
0.038750,0.018950,0.177000,0.765300
0.037650,0.019150,0.176800,0.766400
0.037850,0.019200,0.175650,0.767300
0.038750,0.018300,0.175300,0.767650
0.038100,0.017250,0.176100,0.768550
0.037600,0.016500,0.176650,0.769250
0.036950,0.016850,0.176850,0.769350
0.036950,0.016200,0.176700,0.770150
0.036150,0.016450,0.177300,0.770100
0.035700,0.016150,0.177750,0.770400
0.035650,0.016300,0.177450,0.770600
0.035650,0.016500,0.177850,0.770000
0.035550,0.017500,0.177850,0.769100
0.035800,0.017800,0.178350,0.768050
0.035550,0.018050,0.178550,0.767850
0.035150,0.017500,0.177850,0.769500
0.034950,0.016750,0.177800,0.770500
0.033750,0.017250,0.177700,0.771300
0.033150,0.017200,0.178100,0.771550
0.033050,0.016850,0.179150,0.770950
0.033550,0.016400,0.179500,0.770550
0.033900,0.016200,0.180700,0.769200
0.033650,0.017100,0.180200,0.769050
0.033150,0.017850,0.178800,0.770200
0.034350,0.017650,0.178400,0.769600
0.034800,0.017200,0.177650,0.770350
0.034300,0.018150,0.176650,0.770900
0.034950,0.017700,0.176350,0.771000
0.035100,0.016800,0.177600,0.770500
0.035350,0.017500,0.176100,0.771050
0.035250,0.017050,0.176100,0.771600
0.034750,0.016550,0.176650,0.772050
0.035300,0.016250,0.176600,0.771850
0.034900,0.015400,0.177650,0.772050
0.033850,0.016700,0.177800,0.771650
0.033550,0.016900,0.178150,0.771400
0.033450,0.017000,0.177900,0.771650
0.033500,0.016600,0.178000,0.771900
0.033450,0.016150,0.178300,0.772100
0.033850,0.016150,0.178550,0.771450
0.034650,0.016650,0.176700,0.772000
0.034400,0.017050,0.177200,0.771350
0.032750,0.017450,0.176300,0.773500
0.033550,0.016050,0.177100,0.773300
0.033950,0.016100,0.177300,0.772650
0.034350,0.016100,0.176450,0.773100
0.033850,0.015700,0.177450,0.773000
0.034100,0.015200,0.178500,0.772200
0.033800,0.014650,0.180150,0.771400
0.033750,0.015000,0.179700,0.771550
0.033300,0.016100,0.179850,0.770750
0.033800,0.014800,0.179850,0.771550
0.031400,0.015200,0.180450,0.772950
0.031500,0.016050,0.179900,0.772550
0.031300,0.015550,0.180150,0.773000
0.032650,0.015050,0.180200,0.772100
0.031700,0.015300,0.181500,0.771500
0.031400,0.016300,0.182000,0.770300
0.031800,0.016400,0.183400,0.768400
0.032000,0.016100,0.184400,0.767500
0.032150,0.016000,0.184950,0.766900
0.032200,0.016600,0.185000,0.766200
0.032650,0.016650,0.184400,0.766300
0.033150,0.015400,0.185200,0.766250
0.033650,0.014950,0.185650,0.765750
0.033850,0.016050,0.184900,0.765200
0.033700,0.015800,0.184000,0.766500
0.034000,0.016500,0.183200,0.766300
0.034050,0.016750,0.183050,0.766150
0.034350,0.017650,0.182600,0.765400
0.033850,0.017650,0.183150,0.765350
0.034600,0.017600,0.182350,0.765450
0.036400,0.016150,0.182350,0.765100
0.036200,0.016850,0.181700,0.765250
0.037000,0.016900,0.181450,0.764650
