
real	0m2,216s
user	0m2,108s
sys	0m0,108s

real	0m2,251s
user	0m2,035s
sys	0m0,216s

real	0m2,226s
user	0m2,070s
sys	0m0,157s

real	0m2,257s
user	0m2,117s
sys	0m0,141s

real	0m2,247s
user	0m2,079s
sys	0m0,168s

real	0m2,321s
user	0m2,086s
sys	0m0,236s

real	0m2,350s
user	0m2,059s
sys	0m0,292s

real	0m2,349s
user	0m2,149s
sys	0m0,200s

real	0m2,362s
user	0m2,098s
sys	0m0,264s

real	0m2,353s
user	0m1,998s
sys	0m0,355s
