I,E,S,R
0.001000,0.000900,0.998100,0.000000
0.001050,0.001450,0.997350,0.000150
0.001100,0.002150,0.996400,0.000350
0.001650,0.002950,0.994950,0.000450
0.002400,0.004250,0.992550,0.000800
0.003150,0.005350,0.990500,0.001000
0.003800,0.006850,0.987700,0.001650
0.004750,0.008600,0.984400,0.002250
0.006000,0.011900,0.979300,0.002800
0.008700,0.013950,0.973600,0.003750
0.010650,0.017250,0.966900,0.005200
0.014100,0.020550,0.958800,0.006550
0.019200,0.026850,0.946100,0.007850
0.023150,0.035500,0.930700,0.010650
0.030150,0.043950,0.911800,0.014100
0.038950,0.056500,0.887050,0.017500
0.049750,0.071200,0.855750,0.023300
0.063450,0.088600,0.817750,0.030200
0.078950,0.108450,0.773900,0.038700
0.099550,0.130150,0.721550,0.048750
0.123750,0.153200,0.660300,0.062750
0.148850,0.177450,0.593800,0.079900
0.178950,0.200800,0.520650,0.099600
0.210850,0.220150,0.444600,0.124400
0.249700,0.228500,0.370800,0.151000
0.279850,0.232100,0.303250,0.184800
0.309550,0.229550,0.240800,0.220100
0.330750,0.219100,0.187800,0.262350
0.348050,0.199850,0.144350,0.307750
0.359200,0.176400,0.111100,0.353300
0.362300,0.153850,0.082800,0.401050
0.355200,0.130500,0.064750,0.449550
0.343350,0.109450,0.051750,0.495450
0.328850,0.090650,0.039850,0.540650
0.309550,0.074550,0.032950,0.582950
0.291100,0.059700,0.028850,0.620350
0.269400,0.048950,0.025150,0.656500
0.247650,0.038700,0.022150,0.691500
0.224900,0.030700,0.020500,0.723900
0.201700,0.024550,0.020250,0.753500
0.182550,0.019750,0.020400,0.777300
0.166050,0.017150,0.019700,0.797100
0.148800,0.014400,0.020400,0.816400
0.132650,0.013100,0.021150,0.833100
0.118150,0.009800,0.023000,0.849050
0.104450,0.007500,0.024750,0.863300
0.093400,0.007050,0.025600,0.873950
0.081800,0.006800,0.026750,0.884650
0.072150,0.006050,0.028150,0.893650
0.063300,0.006450,0.030000,0.900250
0.056650,0.005200,0.032800,0.905350
0.051350,0.004650,0.034850,0.909150
0.045350,0.004300,0.037000,0.913350
0.042050,0.004250,0.038800,0.914900
0.037200,0.004100,0.041600,0.917100
0.033200,0.004000,0.044100,0.918700
0.028450,0.003650,0.046500,0.921400
0.025500,0.003150,0.049400,0.921950
0.022850,0.003350,0.051600,0.922200
0.021000,0.003200,0.053600,0.922200
0.018550,0.003250,0.055600,0.922600
0.016800,0.003100,0.058150,0.921950
0.015050,0.002800,0.060850,0.921300
0.013100,0.002250,0.063750,0.920900
0.011450,0.002600,0.066350,0.919600
0.010600,0.002850,0.069150,0.917400
0.009850,0.002550,0.072550,0.915050
0.009100,0.002200,0.076350,0.912350
0.009000,0.001550,0.078750,0.910700
0.007900,0.001500,0.081000,0.909600
0.007350,0.001450,0.083900,0.907300
0.006750,0.001400,0.086650,0.905200
0.006100,0.001650,0.088700,0.903550
0.005650,0.001550,0.092100,0.900700
0.005150,0.001550,0.094150,0.899150
0.005050,0.001250,0.097550,0.896150
0.004700,0.001350,0.100350,0.893600
0.004300,0.001250,0.102750,0.891700
0.004000,0.001300,0.105700,0.889000
0.003700,0.001350,0.108450,0.886500
0.003350,0.001200,0.111500,0.883950
0.003300,0.001100,0.113750,0.881850
0.003250,0.000950,0.116300,0.879500
0.003250,0.001350,0.118900,0.876500
0.003150,0.000900,0.122250,0.873700
0.003300,0.000800,0.124700,0.871200
0.002800,0.000950,0.126850,0.869400
0.002450,0.000850,0.129450,0.867250
0.002400,0.000800,0.132000,0.864800
0.002200,0.000900,0.134800,0.862100
0.002150,0.000850,0.137650,0.859350
0.002100,0.000900,0.140350,0.856650
0.002000,0.000750,0.142900,0.854350
0.001950,0.000750,0.145350,0.851950
0.001750,0.000650,0.148000,0.849600
0.001450,0.000850,0.149950,0.847750
0.001350,0.000850,0.153100,0.844700
0.001400,0.000900,0.155600,0.842100
0.001400,0.001050,0.157550,0.840000
0.001500,0.000750,0.160450,0.837300
0.001300,0.000850,0.163300,0.834550
0.001450,0.000750,0.165750,0.832050
0.001600,0.000750,0.168350,0.829300
0.001700,0.000600,0.171150,0.826550
0.001850,0.000400,0.173750,0.824000
0.001800,0.000700,0.176300,0.821200
0.001700,0.001000,0.178800,0.818500
0.001800,0.000850,0.180800,0.816550
0.001700,0.000900,0.182800,0.814600
0.001800,0.000900,0.185050,0.812250
0.001900,0.000750,0.187050,0.810300
0.001900,0.000750,0.189500,0.807850
0.001800,0.000800,0.191300,0.806100
0.001850,0.000650,0.193750,0.803750
0.001550,0.000800,0.195750,0.801900
0.001450,0.000800,0.198600,0.799150
0.001500,0.000850,0.200650,0.797000
0.001550,0.000700,0.202900,0.794850
0.001550,0.000850,0.205200,0.792400
0.001650,0.000750,0.207000,0.790600
0.001550,0.000850,0.208650,0.788950
0.001650,0.001000,0.211050,0.786300
0.001800,0.001200,0.212400,0.784600
0.002000,0.000850,0.214800,0.782350
0.002200,0.000750,0.216500,0.780550
0.001900,0.000700,0.218850,0.778550
0.001550,0.000800,0.220450,0.777200
0.001500,0.000750,0.222550,0.775200
0.001550,0.000900,0.224400,0.773150
0.001700,0.000850,0.226750,0.770700
0.001700,0.000950,0.228850,0.768500
0.001700,0.001100,0.230000,0.767200
0.001650,0.001500,0.231600,0.765250
0.001900,0.001150,0.233450,0.763500
0.001850,0.001400,0.234650,0.762100
0.001800,0.001450,0.236650,0.760100
0.001850,0.001350,0.238600,0.758200
0.002200,0.001100,0.240700,0.756000
0.002200,0.001150,0.242550,0.754100
0.002250,0.000900,0.244500,0.752350
0.002000,0.000950,0.246700,0.750350
0.001800,0.001300,0.248200,0.748700
0.002050,0.001200,0.250600,0.746150
0.002450,0.001100,0.252750,0.743700
0.002200,0.001450,0.254300,0.742050
0.002400,0.001500,0.255950,0.740150
0.002300,0.001500,0.257350,0.738850
0.002600,0.001200,0.258950,0.737250
0.002400,0.001450,0.260950,0.735200
0.002550,0.001500,0.262900,0.733050
0.002350,0.001600,0.264250,0.731800
0.002500,0.001850,0.265150,0.730500
0.002650,0.002300,0.266500,0.728550
0.003050,0.002100,0.267950,0.726900
0.003150,0.002100,0.269400,0.725350
0.003000,0.002350,0.271250,0.723400
0.003200,0.002450,0.273200,0.721150
0.003650,0.002400,0.274500,0.719450
0.004200,0.002200,0.276450,0.717150
0.004400,0.002200,0.277700,0.715700
0.004650,0.002400,0.278850,0.714100
0.004750,0.002900,0.279750,0.712600
0.004800,0.003600,0.280700,0.710900
0.005400,0.003600,0.281350,0.709650
0.005750,0.004450,0.281500,0.708300
0.005800,0.004750,0.281700,0.707750
0.006100,0.005350,0.281700,0.706850
0.006550,0.005550,0.282400,0.705500
0.007450,0.005550,0.282350,0.704650
0.007850,0.005950,0.282200,0.704000
0.008550,0.006050,0.282650,0.702750
0.009000,0.006250,0.282750,0.702000
0.009600,0.006100,0.282650,0.701650
0.009150,0.006700,0.282950,0.701200
0.009800,0.007300,0.282650,0.700250
0.010700,0.007050,0.282700,0.699550
0.011250,0.007600,0.282250,0.698900
0.012000,0.007750,0.281850,0.698400
0.012200,0.008250,0.281600,0.697950
0.012600,0.008900,0.280550,0.697950
0.013550,0.008600,0.280900,0.696950
0.014200,0.009150,0.279450,0.697200
0.015500,0.009150,0.278500,0.696850
0.016350,0.009350,0.277550,0.696750
0.017050,0.009850,0.275400,0.697700
0.017150,0.010900,0.274150,0.697800
0.016900,0.011550,0.273000,0.698550
0.017450,0.011850,0.271700,0.699000
0.017900,0.013050,0.269950,0.699100
0.018700,0.012700,0.269000,0.699600
0.019550,0.012450,0.267800,0.700200
0.021000,0.012900,0.265200,0.700900
0.021950,0.013450,0.263150,0.701450
0.022750,0.013500,0.260950,0.702800
0.023900,0.015000,0.257100,0.704000
0.025300,0.015650,0.254450,0.704600
0.026650,0.016700,0.252000,0.704650
0.027150,0.017250,0.249300,0.706300
0.028600,0.017050,0.246650,0.707700
0.028850,0.017350,0.244750,0.709050
0.029250,0.018350,0.241250,0.711150
0.030800,0.017900,0.239950,0.711350
0.031050,0.018050,0.237400,0.713500
0.031250,0.019000,0.233850,0.715900
0.032050,0.018350,0.231650,0.717950
0.032150,0.020050,0.226900,0.720900
0.033900,0.020400,0.224350,0.721350
0.034100,0.020950,0.221650,0.723300
0.035600,0.020500,0.218900,0.725000
0.036900,0.020650,0.214850,0.727600
0.038400,0.019800,0.212000,0.729800
0.039550,0.019700,0.208000,0.732750
0.039300,0.020200,0.205300,0.735200
0.039000,0.021700,0.201100,0.738200
0.039300,0.021650,0.198200,0.740850
0.040350,0.020300,0.196100,0.743250
0.041500,0.020600,0.192650,0.745250
0.041700,0.021750,0.189050,0.747500
0.043050,0.020650,0.186450,0.749850
0.043100,0.020550,0.183700,0.752650
0.043150,0.019450,0.181350,0.756050
0.043150,0.020350,0.177850,0.758650
0.042350,0.020800,0.174750,0.762100
0.043050,0.020800,0.172250,0.763900
0.042800,0.020900,0.169300,0.767000
0.042100,0.020700,0.166100,0.771100
0.043250,0.019750,0.163700,0.773300
0.043100,0.019850,0.161300,0.775750
0.043150,0.018700,0.160150,0.778000
0.041850,0.019450,0.158150,0.780550
0.041000,0.019050,0.157150,0.782800
0.041100,0.017700,0.156250,0.784950
0.040100,0.018000,0.153650,0.788250
0.039700,0.017450,0.152200,0.790650
0.038150,0.017250,0.151800,0.792800
0.037650,0.016450,0.151200,0.794700
0.037550,0.015700,0.150250,0.796500
0.036550,0.016300,0.149650,0.797500
0.036000,0.015800,0.149900,0.798300
0.036250,0.015500,0.149150,0.799100
0.034750,0.016300,0.148050,0.800900
0.033800,0.016350,0.147100,0.802750
0.033400,0.016150,0.146600,0.803850
0.032950,0.015200,0.146900,0.804950
0.032550,0.014700,0.146550,0.806200
0.032450,0.014650,0.146750,0.806150
0.032100,0.014350,0.147100,0.806450
0.031150,0.014300,0.147500,0.807050
0.030550,0.013650,0.148950,0.806850
0.029650,0.012850,0.149600,0.807900
0.030100,0.012150,0.150300,0.807450
0.029850,0.012100,0.151000,0.807050
0.029600,0.011550,0.152350,0.806500
0.027900,0.011950,0.152500,0.807650
0.027850,0.011050,0.153500,0.807600
0.027250,0.011600,0.154600,0.806550
0.027550,0.010850,0.155400,0.806200
0.027150,0.011150,0.156850,0.804850
0.026700,0.011400,0.157750,0.804150
0.026750,0.011400,0.158700,0.803150
0.026150,0.010950,0.159500,0.803400
0.025500,0.010450,0.161300,0.802750
0.025100,0.010400,0.162200,0.802300
0.024750,0.009300,0.163300,0.802650
0.023500,0.008800,0.164700,0.803000
0.023150,0.008900,0.165900,0.802050
0.022000,0.008800,0.168000,0.801200
0.021000,0.009350,0.169250,0.800400
0.020900,0.008650,0.171750,0.798700
0.020000,0.008650,0.175250,0.796100
0.019500,0.008600,0.177850,0.794050
0.019050,0.008900,0.178850,0.793200
0.020250,0.008650,0.181050,0.790050
0.020100,0.009050,0.182700,0.788150
0.019750,0.009600,0.184200,0.786450
0.019300,0.010400,0.186000,0.784300
0.019500,0.010950,0.186050,0.783500
0.019150,0.010250,0.188450,0.782150
0.018750,0.010350,0.189850,0.781050
0.019800,0.009400,0.191450,0.779350
0.019950,0.009950,0.191700,0.778400
0.019750,0.010700,0.193100,0.776450
0.019900,0.010650,0.195000,0.774450
0.020100,0.010200,0.196050,0.773650
0.019950,0.010250,0.197200,0.772600
0.020250,0.010000,0.197750,0.772000
0.019850,0.010750,0.199450,0.769950
0.021050,0.010600,0.200250,0.768100
0.020900,0.010950,0.201100,0.767050
0.021150,0.011350,0.201700,0.765800
0.021600,0.011700,0.202900,0.763800
0.022150,0.012150,0.203800,0.761900
0.022700,0.012100,0.204100,0.761100
0.023650,0.011800,0.205450,0.759100
0.023700,0.012800,0.205800,0.757700
0.023700,0.012550,0.207050,0.756700
0.024300,0.012550,0.208100,0.755050
0.023600,0.013250,0.208500,0.754650
0.023900,0.013700,0.208800,0.753600
0.024500,0.012700,0.210050,0.752750
0.024300,0.012950,0.210750,0.752000
0.024450,0.013200,0.210600,0.751750
0.024400,0.014350,0.210650,0.750600
0.024950,0.014450,0.212300,0.748300
0.025550,0.014250,0.212750,0.747450
0.025900,0.014350,0.213550,0.746200
0.027200,0.014300,0.213800,0.744700
0.027500,0.014100,0.214250,0.744150
0.027400,0.015400,0.213900,0.743300
0.027650,0.015050,0.214350,0.742950
0.029200,0.015300,0.214000,0.741500
0.030100,0.015300,0.214050,0.740550
0.030250,0.015600,0.214300,0.739850
0.031250,0.015400,0.213800,0.739550
0.031150,0.015800,0.212900,0.740150
0.031250,0.016100,0.211900,0.740750
0.031750,0.016850,0.211300,0.740100
0.032050,0.017300,0.210000,0.740650
0.032200,0.018150,0.208500,0.741150
0.032450,0.018050,0.207950,0.741550
0.032750,0.017400,0.207000,0.742850
0.032500,0.018600,0.207050,0.741850
0.032350,0.019200,0.205900,0.742550
0.034100,0.017450,0.206450,0.742000
0.035650,0.017350,0.205450,0.741550
0.035850,0.017850,0.204350,0.741950
0.036400,0.017700,0.203900,0.742000
0.037400,0.017700,0.202750,0.742150
0.037350,0.019000,0.200050,0.743600
0.037100,0.018800,0.199200,0.744900
0.036900,0.019050,0.198750,0.745300
0.037550,0.019550,0.197450,0.745450
0.037750,0.019400,0.196750,0.746100
0.037250,0.018600,0.196800,0.747350
0.036900,0.018600,0.195700,0.748800
0.036800,0.019250,0.195000,0.748950
0.035550,0.021550,0.192000,0.750900
0.037650,0.019950,0.191500,0.750900
0.037200,0.019750,0.191350,0.751700
0.037150,0.019700,0.191150,0.752000
0.037350,0.019700,0.191300,0.751650
0.037800,0.019150,0.191750,0.751300
0.039750,0.017900,0.191100,0.751250
0.039200,0.018800,0.189700,0.752300
0.038200,0.019250,0.189300,0.753250
0.038300,0.019400,0.188250,0.754050
0.038750,0.019400,0.187400,0.754450
0.039450,0.019300,0.186050,0.755200
0.040450,0.019300,0.186150,0.754100
0.040050,0.019500,0.184250,0.756200
0.040800,0.019900,0.181300,0.758000
0.041400,0.020050,0.179050,0.759500
0.041200,0.018850,0.179050,0.760900
0.041150,0.019450,0.177500,0.761900
0.041700,0.019300,0.177150,0.761850
0.041850,0.019700,0.175500,0.762950
0.041800,0.020100,0.173350,0.764750
0.041750,0.019350,0.172600,0.766300
0.041200,0.019900,0.172800,0.766100
0.040750,0.020000,0.170950,0.768300
0.041300,0.020150,0.170050,0.768500
0.041950,0.019300,0.170550,0.768200
0.041750,0.018600,0.170600,0.769050
0.041500,0.018300,0.170250,0.769950
0.041350,0.019200,0.168300,0.771150
0.040550,0.019500,0.167300,0.772650
0.039150,0.020650,0.165700,0.774500
0.039400,0.019500,0.165950,0.775150
0.038700,0.019100,0.166100,0.776100
0.039250,0.017400,0.166850,0.776500
0.038500,0.017600,0.167500,0.776400
0.039150,0.016700,0.167300,0.776850
0.039200,0.015950,0.167550,0.777300
0.037800,0.016200,0.168400,0.777600
0.036900,0.016400,0.167750,0.778950
0.036050,0.016300,0.169350,0.778300
0.037500,0.015800,0.169450,0.777250
0.036750,0.016850,0.168550,0.777850
0.037050,0.016300,0.169750,0.776900
0.037050,0.015800,0.170000,0.777150
0.036150,0.016600,0.170700,0.776550
0.034750,0.017200,0.170450,0.777600
0.034550,0.017450,0.171000,0.777000
0.035000,0.016050,0.172700,0.776250
0.032950,0.016800,0.173450,0.776800
0.033450,0.017200,0.173700,0.775650
0.033700,0.017000,0.174200,0.775100
0.033850,0.016500,0.174950,0.774700
0.033100,0.016000,0.175800,0.775100
0.033550,0.015850,0.177350,0.773250
0.034250,0.015900,0.177050,0.772800
0.033900,0.016500,0.177150,0.772450
0.034100,0.017100,0.177250,0.771550
0.035000,0.017050,0.177650,0.770300
0.035500,0.016600,0.177750,0.770150
0.034600,0.017550,0.177300,0.770550
0.035350,0.016750,0.177650,0.770250
0.034850,0.016200,0.178250,0.770700
0.033750,0.017400,0.177550,0.771300
0.033750,0.017500,0.177350,0.771400
0.033550,0.017400,0.178250,0.770800
0.034400,0.016800,0.177950,0.770850
0.033600,0.018050,0.175900,0.772450
0.034400,0.017650,0.177250,0.770700
0.034900,0.016250,0.177500,0.771350
0.034500,0.016650,0.177400,0.771450
0.034900,0.016100,0.178000,0.771000
0.035450,0.016350,0.177200,0.771000
0.034300,0.016450,0.177550,0.771700
0.033600,0.016400,0.177900,0.772100
0.034250,0.016150,0.178200,0.771400
0.034450,0.016050,0.178000,0.771500
0.034050,0.016800,0.177750,0.771400
0.033950,0.016500,0.177900,0.771650
0.033900,0.017400,0.177500,0.771200
0.034150,0.016400,0.178450,0.771000
0.033700,0.016950,0.178900,0.770450
0.033750,0.016700,0.179550,0.770000
0.033200,0.016600,0.180850,0.769350
0.034250,0.016650,0.181500,0.767600
0.034550,0.015750,0.182800,0.766900
0.033750,0.015800,0.183500,0.766950
0.033250,0.015250,0.184100,0.767400
0.033800,0.015400,0.184800,0.766000
0.033650,0.015150,0.184800,0.766400
0.032650,0.015350,0.185200,0.766800
0.031950,0.014100,0.187050,0.766900
0.031850,0.014350,0.187600,0.766200
0.030500,0.015450,0.188150,0.765900
0.030800,0.015650,0.187950,0.765600
0.031300,0.016450,0.187850,0.764400
0.031300,0.016950,0.188650,0.763100
0.031550,0.016300,0.189900,0.762250
0.032150,0.015600,0.190750,0.761500
0.032650,0.015750,0.191400,0.760200
0.032400,0.015900,0.191050,0.760650
0.032500,0.016100,0.189850,0.761550
0.032850,0.016500,0.188900,0.761750
0.032950,0.017050,0.188550,0.761450
0.032700,0.017200,0.188500,0.761600
0.032850,0.017500,0.188200,0.761450
0.033100,0.017550,0.187600,0.761750
0.032750,0.017700,0.187500,0.762050
0.034550,0.018050,0.185400,0.762000
0.033500,0.018600,0.185200,0.762700
0.034350,0.016750,0.185400,0.763500
0.035100,0.016600,0.184700,0.763600
0.035300,0.016900,0.184000,0.763800
0.034900,0.016500,0.184400,0.764200
0.035200,0.017250,0.183200,0.764350
0.034900,0.018600,0.182150,0.764350
0.036250,0.017500,0.181600,0.764650
0.036200,0.017100,0.182000,0.764700
0.037450,0.017100,0.181750,0.763700
0.037400,0.017050,0.181850,0.763700
0.036450,0.016700,0.182350,0.764500
0.034500,0.016950,0.182500,0.766050
0.034700,0.016900,0.181300,0.767100
0.034750,0.016450,0.181350,0.767450
0.033750,0.017350,0.181650,0.767250
0.034450,0.018300,0.181600,0.765650
0.035550,0.017650,0.181150,0.765650
0.036400,0.017200,0.182000,0.764400
0.036650,0.017700,0.181950,0.763700
0.036600,0.018200,0.180400,0.764800
0.037350,0.018900,0.179900,0.763850
0.038300,0.018400,0.178600,0.764700
0.038100,0.019500,0.176700,0.765700
0.037900,0.018750,0.176250,0.767100
0.038400,0.018550,0.176150,0.766900
0.038850,0.018200,0.176100,0.766850
0.038650,0.018400,0.175800,0.767150
0.038500,0.018450,0.175050,0.768000
0.037700,0.018150,0.175950,0.768200
0.037900,0.016950,0.176300,0.768850
0.037800,0.016800,0.176100,0.769300
0.037450,0.017600,0.175200,0.769750
0.037000,0.017600,0.174900,0.770500
0.035950,0.017300,0.175100,0.771650
0.035000,0.016900,0.175850,0.772250
0.034000,0.016850,0.176500,0.772650
0.033200,0.018000,0.175300,0.773500
0.032850,0.017200,0.175450,0.774500
0.032500,0.017050,0.174700,0.775750
0.033050,0.017200,0.175150,0.774600
0.033300,0.016900,0.175500,0.774300
0.033850,0.016700,0.175900,0.773550
0.034250,0.016000,0.176150,0.773600
0.033650,0.016750,0.176200,0.773400
0.034200,0.015400,0.177500,0.772900
0.033950,0.015400,0.177300,0.773350
0.034000,0.015850,0.176150,0.774000
0.034150,0.017150,0.175350,0.773350
0.034900,0.015550,0.175600,0.773950
0.034650,0.015300,0.176000,0.774050
0.035250,0.014300,0.177050,0.773400
0.034350,0.015600,0.175500,0.774550
0.034150,0.016050,0.174750,0.775050
0.033050,0.015850,0.176450,0.774650
0.032600,0.015800,0.177750,0.773850
0.033350,0.015150,0.178950,0.772550
0.032750,0.016050,0.179000,0.772200
0.032550,0.016150,0.179100,0.772200
0.033000,0.015500,0.179400,0.772100
0.032900,0.015300,0.180250,0.771550
0.033700,0.013900,0.182850,0.769550
0.033300,0.014650,0.182400,0.769650
0.033150,0.015650,0.180750,0.770450
0.031950,0.015600,0.182100,0.770350
0.031650,0.015450,0.182000,0.770900
0.031350,0.016900,0.181600,0.770150
0.031800,0.015750,0.181050,0.771400
0.031150,0.016800,0.181050,0.771000
0.031250,0.015600,0.182000,0.771150
0.031250,0.015700,0.182250,0.770800
0.031550,0.014500,0.183700,0.770250
0.031400,0.014700,0.184450,0.769450
0.031600,0.014550,0.184900,0.768950
0.030250,0.015400,0.185300,0.769050
0.029850,0.015550,0.185650,0.768950
0.030100,0.015650,0.185750,0.768500
0.031050,0.014850,0.186600,0.767500
0.031450,0.016350,0.185750,0.766450
0.031350,0.016750,0.185200,0.766700
0.031200,0.016150,0.186300,0.766350
0.032400,0.015200,0.186500,0.765900
0.032650,0.015050,0.186850,0.765450
0.033600,0.016250,0.185750,0.764400
0.033150,0.016100,0.186700,0.764050
0.032000,0.016250,0.186250,0.765500
0.031700,0.016450,0.186450,0.765400
0.031400,0.016100,0.186900,0.765600
0.031450,0.015400,0.188600,0.764550
0.031750,0.015800,0.188550,0.763900
0.032250,0.014800,0.189650,0.763300
0.031600,0.013700,0.191450,0.763250
0.030700,0.015200,0.190950,0.763150
0.031250,0.014650,0.192400,0.761700
0.031600,0.015300,0.192350,0.760750
0.031250,0.015750,0.192500,0.760500
0.030850,0.015550,0.193650,0.759950
0.029950,0.016150,0.193300,0.760600
0.031650,0.015550,0.193650,0.759150
0.032400,0.015350,0.194150,0.758100
0.032700,0.016050,0.193050,0.758200
0.033450,0.016900,0.192700,0.756950
0.032950,0.016950,0.192750,0.757350
0.033850,0.016500,0.192500,0.757150
0.033950,0.017150,0.191800,0.757100
0.034950,0.017200,0.191800,0.756050
0.034150,0.019250,0.191150,0.755450
0.034400,0.019250,0.191100,0.755250
0.034300,0.018650,0.191500,0.755550
0.034450,0.017900,0.191200,0.756450
0.034450,0.018400,0.190750,0.756400
0.035200,0.018800,0.190100,0.755900
0.034350,0.018600,0.190100,0.756950
0.035650,0.017400,0.190300,0.756650
0.036250,0.017150,0.190650,0.755950
0.035600,0.017850,0.190650,0.755900
0.035350,0.018100,0.190750,0.755800
0.034800,0.018900,0.189700,0.756600
0.035200,0.018100,0.188950,0.757750
0.036000,0.017250,0.188500,0.758250
0.036100,0.017700,0.188900,0.757300
0.035450,0.017750,0.188900,0.757900
0.035800,0.017600,0.189050,0.757550
0.036100,0.016900,0.188750,0.758250
0.036000,0.017450,0.187550,0.759000
0.036150,0.017050,0.187550,0.759250
0.036050,0.017100,0.188150,0.758700
0.036000,0.018350,0.187900,0.757750
0.036600,0.017450,0.189000,0.756950
0.036800,0.017350,0.188450,0.757400
0.036750,0.017400,0.187500,0.758350
0.037100,0.017350,0.186550,0.759000
0.037450,0.017600,0.186300,0.758650
0.037300,0.018800,0.185550,0.758350
0.037700,0.018750,0.185300,0.758250
0.037100,0.019000,0.185950,0.757950
0.039050,0.017700,0.184900,0.758350
0.038700,0.018550,0.183600,0.759150
0.039300,0.018500,0.182950,0.759250
0.038900,0.018350,0.182300,0.760450
0.038500,0.020100,0.180250,0.761150
0.039300,0.020000,0.179250,0.761450
0.040150,0.019300,0.178650,0.761900
0.039650,0.019400,0.178850,0.762100
0.038150,0.020700,0.176700,0.764450
0.039850,0.019800,0.176150,0.764200
0.040150,0.019800,0.174650,0.765400
0.040400,0.019550,0.173950,0.766100
0.040950,0.018950,0.174250,0.765850
0.040300,0.019750,0.173700,0.766250
0.039850,0.019350,0.173550,0.767250
0.039850,0.018550,0.173650,0.767950
0.041100,0.018600,0.173200,0.767100
0.040500,0.019200,0.172950,0.767350
0.040050,0.019200,0.172800,0.767950
0.040350,0.018350,0.171950,0.769350
0.041150,0.017900,0.171850,0.769100
0.041800,0.017100,0.171050,0.770050
0.040650,0.017000,0.171700,0.770650
0.040350,0.016450,0.172550,0.770650
0.039750,0.017850,0.172350,0.770050
0.039000,0.017250,0.172800,0.770950
0.038900,0.017150,0.172250,0.771700
0.037750,0.017350,0.172200,0.772700
0.036800,0.017750,0.172900,0.772550
0.037800,0.017300,0.172650,0.772250
0.036800,0.017650,0.172600,0.772950
0.037600,0.016250,0.174300,0.771850
0.035200,0.016550,0.174800,0.773450
0.033600,0.016050,0.176050,0.774300
0.034100,0.015600,0.177050,0.773250
0.034800,0.014900,0.178200,0.772100
0.034750,0.015550,0.177700,0.772000
0.034250,0.014850,0.178100,0.772800
0.034350,0.014300,0.178900,0.772450
0.033800,0.014450,0.179950,0.771800
0.033500,0.014550,0.181050,0.770900
0.032250,0.015150,0.182550,0.770050
0.031550,0.016000,0.183400,0.769050
0.032150,0.015050,0.184950,0.767850
0.031750,0.014200,0.186150,0.767900
0.031000,0.014800,0.186350,0.767850
0.031450,0.014800,0.186400,0.767350
0.031650,0.015350,0.187350,0.765650
0.031650,0.015450,0.187800,0.765100
0.031800,0.016600,0.187750,0.763850
0.032350,0.015800,0.187900,0.763950
0.031500,0.015950,0.188100,0.764450
0.032250,0.014800,0.189200,0.763750
0.032200,0.014850,0.190000,0.762950
0.031750,0.014850,0.190300,0.763100
0.031050,0.015250,0.190950,0.762750
0.031350,0.015450,0.191350,0.761850
0.031500,0.016000,0.191050,0.761450
0.030550,0.015350,0.192850,0.761250
0.030600,0.014850,0.193850,0.760700
0.030500,0.015750,0.195200,0.758550
0.030850,0.016450,0.195250,0.757450
0.031800,0.015000,0.196100,0.757100
0.030200,0.015300,0.197150,0.757350
0.030300,0.015400,0.198300,0.756000
0.031300,0.015550,0.198900,0.754250
0.031550,0.015150,0.199600,0.753700
0.031200,0.015650,0.199700,0.753450
0.032350,0.015200,0.200650,0.751800
0.030850,0.016450,0.201000,0.751700
0.030350,0.017350,0.200500,0.751800
0.031400,0.017250,0.200500,0.750850
0.032450,0.017150,0.200000,0.750400
0.032500,0.018650,0.198150,0.750700
0.032950,0.019400,0.197650,0.750000
0.034650,0.019150,0.196150,0.750050
0.034950,0.019250,0.196050,0.749750
0.035900,0.019350,0.195500,0.749250
0.037500,0.017800,0.195400,0.749300
0.037800,0.017550,0.194100,0.750550
0.037250,0.017550,0.193600,0.751600
0.036400,0.019350,0.191950,0.752300
0.036600,0.019300,0.191050,0.753050
0.038350,0.018000,0.190800,0.752850
0.038250,0.018000,0.190700,0.753050
0.037200,0.018250,0.190600,0.753950
0.036450,0.018950,0.189050,0.755550
0.037400,0.019300,0.188700,0.754600
0.038250,0.018200,0.189000,0.754550
0.037850,0.018850,0.188200,0.755100
0.037950,0.018750,0.187800,0.755500
0.038550,0.017750,0.187900,0.755800
0.038900,0.018300,0.187150,0.755650
0.038700,0.018300,0.186100,0.756900
0.038600,0.019100,0.186200,0.756100
0.038600,0.019350,0.184450,0.757600
0.038250,0.019800,0.184100,0.757850
0.039150,0.019550,0.184250,0.757050
0.039600,0.019700,0.182650,0.758050
0.040300,0.019150,0.182150,0.758400
0.039900,0.019700,0.182000,0.758400
0.040750,0.020400,0.179850,0.759000
0.039950,0.019950,0.179700,0.760400
0.040500,0.019750,0.179000,0.760750
0.040650,0.019350,0.178050,0.761950
0.040450,0.020050,0.176800,0.762700
0.041100,0.020450,0.176550,0.761900
0.041000,0.021150,0.175500,0.762350
0.041550,0.019900,0.175300,0.763250
0.041500,0.019200,0.174150,0.765150
0.040450,0.019600,0.174350,0.765600
0.039200,0.020250,0.174100,0.766450
0.038500,0.019450,0.172500,0.769550
0.038600,0.018300,0.173050,0.770050
0.038450,0.018650,0.172000,0.770900
0.038200,0.018900,0.171250,0.771650
0.037950,0.017800,0.171250,0.773000
0.036600,0.018900,0.170900,0.773600
0.036050,0.018200,0.172750,0.773000
0.036000,0.017250,0.173900,0.772850
0.035400,0.016750,0.175500,0.772350
0.035950,0.017350,0.174200,0.772500
0.035250,0.017350,0.174700,0.772700
0.034900,0.017100,0.174050,0.773950
0.036050,0.016350,0.173700,0.773900
0.034600,0.017150,0.173300,0.774950
0.034600,0.017050,0.173250,0.775100
0.034400,0.016900,0.173100,0.775600
0.034900,0.016450,0.173400,0.775250
0.036100,0.015250,0.173850,0.774800
0.035050,0.015550,0.173350,0.776050
0.034600,0.015700,0.173450,0.776250
0.034750,0.014750,0.173750,0.776750
0.034150,0.013850,0.174600,0.777400
0.033400,0.014400,0.176100,0.776100
0.033750,0.014350,0.175900,0.776000
0.033500,0.014950,0.176200,0.775350
0.033100,0.015000,0.176300,0.775600
0.033350,0.015400,0.176550,0.774700
0.033700,0.015300,0.177050,0.773950
0.033450,0.016300,0.177500,0.772750
0.032950,0.016550,0.177000,0.773500
0.033950,0.015400,0.177350,0.773300
0.032800,0.015850,0.178600,0.772750
0.033450,0.015350,0.178600,0.772600
0.033250,0.016500,0.178650,0.771600
0.033700,0.015500,0.179400,0.771400
0.032500,0.016000,0.179200,0.772300
0.032050,0.015700,0.180700,0.771550
0.032400,0.014500,0.182300,0.770800
