I,E,S,R
0.001000,0.000650,0.998350,0.000000
0.001000,0.001150,0.997650,0.000200
0.001050,0.001650,0.996950,0.000350
0.001400,0.002200,0.995900,0.000500
0.001850,0.002850,0.994650,0.000650
0.002450,0.003250,0.993450,0.000850
0.003350,0.004550,0.991050,0.001050
0.003950,0.007200,0.987100,0.001750
0.005700,0.009250,0.983150,0.001900
0.007650,0.012350,0.977050,0.002950
0.010700,0.015000,0.970300,0.004000
0.013500,0.019950,0.961000,0.005550
0.017700,0.025300,0.949600,0.007400
0.022650,0.032600,0.935100,0.009650
0.029650,0.040850,0.917050,0.012450
0.036700,0.052450,0.894350,0.016500
0.046700,0.066950,0.865200,0.021150
0.060700,0.081150,0.830950,0.027200
0.075850,0.100900,0.788100,0.035150
0.094050,0.125000,0.735300,0.045650
0.116250,0.149100,0.676700,0.057950
0.146000,0.171750,0.609000,0.073250
0.174250,0.194800,0.539700,0.091250
0.204050,0.214900,0.466300,0.114750
0.238500,0.225800,0.394900,0.140800
0.265250,0.235350,0.323750,0.175650
0.297200,0.235800,0.259100,0.207900
0.324600,0.227000,0.200850,0.247550
0.344700,0.210650,0.154350,0.290300
0.360550,0.186050,0.118200,0.335200
0.368600,0.162050,0.088200,0.381150
0.365700,0.139500,0.065700,0.429100
0.355100,0.117450,0.049700,0.477750
0.338850,0.098100,0.039300,0.523750
0.321900,0.079200,0.032500,0.566400
0.302700,0.063050,0.027250,0.607000
0.281450,0.049450,0.023600,0.645500
0.258950,0.039450,0.021450,0.680150
0.233300,0.032800,0.019600,0.714300
0.208400,0.026950,0.019400,0.745250
0.186000,0.022100,0.019500,0.772400
0.165800,0.017600,0.019350,0.797250
0.150750,0.014450,0.019350,0.815450
0.134050,0.011600,0.020100,0.834250
0.117500,0.010200,0.021300,0.851000
0.104300,0.009150,0.022450,0.864100
0.092250,0.008550,0.023550,0.875650
0.081350,0.007950,0.024550,0.886150
0.071750,0.006500,0.026500,0.895250
0.063550,0.005450,0.027800,0.903200
0.056550,0.005400,0.030550,0.907500
0.050050,0.004750,0.032300,0.912900
0.045250,0.004750,0.035100,0.914900
0.040600,0.004300,0.037250,0.917850
0.035500,0.003700,0.039550,0.921250
0.031650,0.003200,0.041750,0.923400
0.028650,0.003300,0.043750,0.924300
0.026050,0.003100,0.045800,0.925050
0.023400,0.003150,0.047500,0.925950
0.021300,0.003250,0.049500,0.925950
0.019900,0.002800,0.051650,0.925650
0.017750,0.003200,0.054150,0.924900
0.016700,0.002300,0.056600,0.924400
0.015250,0.002000,0.058900,0.923850
0.014050,0.001800,0.062000,0.922150
0.012150,0.001650,0.065200,0.921000
0.010650,0.001650,0.067950,0.919750
0.009700,0.001850,0.071350,0.917100
0.008800,0.002000,0.074000,0.915200
0.008350,0.001900,0.076850,0.912900
0.007450,0.001650,0.079300,0.911600
0.006950,0.001600,0.082000,0.909450
0.006050,0.001700,0.085150,0.907100
0.005350,0.001850,0.088150,0.904650
0.004950,0.002200,0.091600,0.901250
0.004950,0.002000,0.094250,0.898800
0.004950,0.001450,0.097400,0.896200
0.004400,0.001300,0.100700,0.893600
0.004200,0.001100,0.103550,0.891150
0.003800,0.001150,0.105850,0.889200
0.003350,0.001150,0.109750,0.885750
0.003200,0.000950,0.113150,0.882700
0.002750,0.000900,0.115500,0.880850
0.002850,0.000650,0.118550,0.877950
0.002650,0.000850,0.121100,0.875400
0.002650,0.000850,0.123850,0.872650
0.002500,0.001000,0.126850,0.869650
0.002250,0.001050,0.129200,0.867500
0.002500,0.001150,0.131500,0.864850
0.002350,0.001150,0.134200,0.862300
0.002350,0.001050,0.137600,0.859000
0.002450,0.000900,0.140150,0.856500
0.002200,0.000850,0.142450,0.854500
0.001850,0.001000,0.144950,0.852200
0.001850,0.001000,0.147150,0.850000
0.002000,0.000950,0.149600,0.847450
0.002050,0.000750,0.152350,0.844850
0.001650,0.000800,0.154100,0.843450
0.001650,0.000750,0.156650,0.840950
0.001550,0.000650,0.158850,0.838950
0.001400,0.000850,0.161150,0.836600
0.001500,0.000800,0.163800,0.833900
0.001450,0.000650,0.165900,0.832000
0.001600,0.000600,0.168950,0.828850
0.001950,0.000400,0.171600,0.826050
0.001800,0.000300,0.173900,0.824000
0.001600,0.000500,0.175650,0.822250
0.001600,0.000500,0.178000,0.819900
0.001600,0.000550,0.180550,0.817300
0.001500,0.000650,0.183200,0.814650
0.001400,0.000750,0.185300,0.812550
0.001500,0.000750,0.187100,0.810650
0.001500,0.000850,0.189850,0.807800
0.001400,0.000800,0.191650,0.806150
0.001250,0.000950,0.193900,0.803900
0.001450,0.000900,0.196050,0.801600
0.001600,0.000950,0.198100,0.799350
0.001750,0.000650,0.200600,0.797000
0.001450,0.000750,0.202600,0.795200
0.001200,0.000800,0.204800,0.793200
0.001200,0.000700,0.206700,0.791400
0.001250,0.000700,0.209100,0.788950
0.001300,0.000750,0.210950,0.787000
0.001300,0.000850,0.213350,0.784500
0.001400,0.000800,0.215150,0.782650
0.001550,0.000900,0.216450,0.781100
0.001450,0.001050,0.217850,0.779650
0.001450,0.001250,0.219850,0.777450
0.001350,0.001050,0.221650,0.775950
0.001200,0.001200,0.224200,0.773400
0.001400,0.001000,0.225800,0.771800
0.001550,0.001150,0.227750,0.769550
0.001650,0.001250,0.229700,0.767400
0.001700,0.001350,0.231900,0.765050
0.001800,0.001400,0.234050,0.762750
0.001750,0.001400,0.235750,0.761100
0.002050,0.001300,0.237650,0.759000
0.002250,0.001350,0.239200,0.757200
0.002400,0.001400,0.240450,0.755750
0.002550,0.001350,0.241850,0.754250
0.002550,0.001500,0.242850,0.753100
0.002550,0.001350,0.245350,0.750750
0.002750,0.001500,0.247200,0.748550
0.002850,0.001700,0.248800,0.746650
0.002700,0.001650,0.251000,0.744650
0.003050,0.001800,0.253100,0.742050
0.003150,0.001650,0.254850,0.740350
0.003100,0.002150,0.255900,0.738850
0.003650,0.001800,0.257550,0.737000
0.003900,0.001850,0.259300,0.734950
0.003450,0.002050,0.260600,0.733900
0.003750,0.002350,0.262150,0.731750
0.004200,0.002700,0.263550,0.729550
0.004400,0.002600,0.264750,0.728250
0.004850,0.002800,0.265750,0.726600
0.005700,0.002750,0.266500,0.725050
0.005800,0.002750,0.267750,0.723700
0.005550,0.003350,0.268350,0.722750
0.005650,0.003350,0.270450,0.720550
0.005500,0.003600,0.270800,0.720100
0.005650,0.004000,0.271600,0.718750
0.006400,0.003900,0.272350,0.717350
0.006600,0.003650,0.273250,0.716500
0.006850,0.004350,0.273450,0.715350
0.007200,0.004050,0.274400,0.714350
0.006850,0.005000,0.275100,0.713050
0.007600,0.004700,0.275800,0.711900
0.007950,0.005150,0.276000,0.710900
0.007900,0.005600,0.276200,0.710300
0.007900,0.005250,0.277050,0.709800
0.008050,0.005450,0.276950,0.709550
0.008500,0.005650,0.277500,0.708350
0.009500,0.005400,0.277500,0.707600
0.010000,0.005550,0.278450,0.706000
0.010200,0.006150,0.278950,0.704700
0.010250,0.006700,0.279450,0.703600
0.011100,0.007600,0.278300,0.703000
0.011450,0.008250,0.277700,0.702600
0.012850,0.007950,0.277500,0.701700
0.013600,0.008300,0.277200,0.700900
0.014200,0.009450,0.275700,0.700650
0.015150,0.010100,0.274400,0.700350
0.016500,0.009750,0.273300,0.700450
0.017050,0.010100,0.272500,0.700350
0.017550,0.010050,0.272500,0.699900
0.017700,0.011900,0.270550,0.699850
0.019800,0.011550,0.268400,0.700250
0.020100,0.012750,0.266100,0.701050
0.021150,0.013100,0.264350,0.701400
0.021850,0.013200,0.262450,0.702500
0.022800,0.013700,0.260000,0.703500
0.023550,0.014000,0.257850,0.704600
0.023850,0.014900,0.255900,0.705350
0.024300,0.016200,0.253150,0.706350
0.025750,0.016050,0.251850,0.706350
0.026400,0.016050,0.249900,0.707650
0.027050,0.015600,0.248350,0.709000
0.027900,0.017150,0.244350,0.710600
0.028750,0.016750,0.241700,0.712800
0.028400,0.016900,0.239850,0.714850
0.029600,0.016950,0.237850,0.715600
0.030550,0.018050,0.234400,0.717000
0.032400,0.017950,0.231500,0.718150
0.033350,0.018450,0.228250,0.719950
0.032800,0.020000,0.224500,0.722700
0.033800,0.020100,0.222000,0.724100
0.033550,0.020900,0.218300,0.727250
0.033550,0.020100,0.215550,0.730800
0.033700,0.019250,0.213950,0.733100
0.035950,0.019550,0.210150,0.734350
0.035400,0.018550,0.208500,0.737550
0.035750,0.019500,0.205400,0.739350
0.036200,0.019100,0.203000,0.741700
0.037450,0.018850,0.200200,0.743500
0.038200,0.018200,0.197900,0.745700
0.039100,0.018300,0.194700,0.747900
0.038000,0.019900,0.191550,0.750550
0.039900,0.018800,0.188750,0.752550
0.040150,0.018400,0.185850,0.755600
0.038900,0.019900,0.183150,0.758050
0.039600,0.019650,0.180750,0.760000
0.039750,0.019200,0.179450,0.761600
0.039400,0.019500,0.177050,0.764050
0.040100,0.019650,0.174600,0.765650
0.039650,0.019150,0.172550,0.768650
0.040800,0.017950,0.170750,0.770500
0.042100,0.017200,0.169000,0.771700
0.041000,0.018100,0.166100,0.774800
0.040200,0.017900,0.164700,0.777200
0.039450,0.018100,0.162650,0.779800
0.039100,0.017700,0.161300,0.781900
0.038850,0.017450,0.159300,0.784400
0.038400,0.017000,0.158300,0.786300
0.038150,0.017700,0.156700,0.787450
0.037950,0.017700,0.155700,0.788650
0.037800,0.017350,0.153850,0.791000
0.038850,0.015300,0.153800,0.792050
0.037850,0.014650,0.153450,0.794050
0.037150,0.014200,0.153900,0.794750
0.036100,0.015050,0.153500,0.795350
0.035050,0.015650,0.153550,0.795750
0.033450,0.015850,0.153100,0.797600
0.033050,0.015750,0.152400,0.798800
0.032750,0.014900,0.153500,0.798850
0.032800,0.014700,0.153350,0.799150
0.033650,0.013400,0.153300,0.799650
0.032350,0.013550,0.154800,0.799300
0.031700,0.013100,0.155550,0.799650
0.031750,0.012900,0.156000,0.799350
0.030700,0.013200,0.156150,0.799950
0.030200,0.013400,0.156750,0.799650
0.030000,0.012200,0.157800,0.800000
0.029300,0.012500,0.158750,0.799450
0.028700,0.012400,0.158800,0.800100
0.027300,0.012450,0.159900,0.800350
0.027550,0.012750,0.160850,0.798850
0.027150,0.012650,0.161800,0.798400
0.025600,0.013000,0.162850,0.798550
0.025250,0.013200,0.163550,0.798000
0.025250,0.012400,0.165550,0.796800
0.026100,0.012450,0.166300,0.795150
0.024500,0.012950,0.167350,0.795200
0.025250,0.012350,0.168850,0.793550
0.024550,0.012050,0.169700,0.793700
0.023950,0.012450,0.171150,0.792450
0.024200,0.012000,0.172850,0.790950
0.024800,0.011800,0.173500,0.789900
0.024600,0.012200,0.173700,0.789500
0.024200,0.011650,0.175500,0.788650
0.024450,0.010500,0.177000,0.788050
0.024350,0.010550,0.178150,0.786950
0.024050,0.010150,0.181050,0.784750
0.023800,0.010200,0.181700,0.784300
0.024150,0.010300,0.181750,0.783800
0.023150,0.010650,0.182700,0.783500
0.024700,0.010150,0.182150,0.783000
0.024100,0.010050,0.183150,0.782700
0.024250,0.011000,0.183550,0.781200
0.024750,0.010950,0.184100,0.780200
0.023900,0.011000,0.186000,0.779100
0.023750,0.011600,0.186700,0.777950
0.024450,0.010500,0.188450,0.776600
0.024150,0.011350,0.189700,0.774800
0.023750,0.011650,0.190900,0.773700
0.024250,0.012550,0.190850,0.772350
0.024850,0.011700,0.191250,0.772200
0.024350,0.011100,0.193050,0.771500
0.024200,0.011950,0.194100,0.769750
0.024350,0.012500,0.194350,0.768800
0.024400,0.012500,0.195250,0.767850
0.024250,0.013250,0.195950,0.766550
0.024750,0.012650,0.197850,0.764750
0.024550,0.013050,0.198700,0.763700
0.024800,0.013600,0.199350,0.762250
0.024600,0.014000,0.198750,0.762650
0.025950,0.013200,0.199150,0.761700
0.026150,0.013650,0.200050,0.760150
0.026050,0.014000,0.199750,0.760200
0.025850,0.013950,0.199300,0.760900
0.025950,0.014400,0.199550,0.760100
0.026300,0.014000,0.200450,0.759250
0.027000,0.014000,0.200000,0.759000
0.026450,0.014900,0.199900,0.758750
0.027350,0.015200,0.199500,0.757950
0.028850,0.015200,0.199900,0.756050
0.029600,0.015600,0.199000,0.755800
0.029300,0.016300,0.198900,0.755500
0.030700,0.016300,0.198550,0.754450
0.031350,0.016850,0.196800,0.755000
0.031800,0.016750,0.196100,0.755350
0.032250,0.017400,0.194650,0.755700
0.032450,0.016300,0.194100,0.757150
0.032850,0.016400,0.194000,0.756750
0.032850,0.016550,0.193250,0.757350
0.032550,0.016800,0.192950,0.757700
0.033450,0.017100,0.192450,0.757000
0.033050,0.017450,0.192050,0.757450
0.033250,0.016750,0.192700,0.757300
0.033950,0.016800,0.192600,0.756650
0.034350,0.017050,0.192750,0.755850
0.035000,0.018300,0.191350,0.755350
0.035750,0.019250,0.189000,0.756000
0.036350,0.019850,0.187050,0.756750
0.037300,0.019900,0.185150,0.757650
0.037750,0.020250,0.183950,0.758050
0.038550,0.019850,0.182850,0.758750
0.038850,0.019400,0.182600,0.759150
0.039250,0.018700,0.181550,0.760500
0.039600,0.018050,0.181700,0.760650
0.040650,0.017550,0.181550,0.760250
0.038750,0.019500,0.179900,0.761850
0.038750,0.020200,0.179650,0.761400
0.039650,0.020150,0.178000,0.762200
0.039100,0.019750,0.178300,0.762850
0.038450,0.019700,0.176800,0.765050
0.038650,0.018900,0.177650,0.764800
0.039250,0.018900,0.176550,0.765300
0.038400,0.018650,0.176750,0.766200
0.038050,0.019450,0.176300,0.766200
0.037300,0.019050,0.176600,0.767050
0.038300,0.018950,0.176150,0.766600
0.037600,0.019150,0.175250,0.768000
0.038300,0.019150,0.174900,0.767650
0.038200,0.019450,0.175100,0.767250
0.038150,0.018050,0.175050,0.768750
0.037550,0.017000,0.175100,0.770350
0.038200,0.016650,0.174900,0.770250
0.037800,0.017100,0.174300,0.770800
0.038200,0.016550,0.174700,0.770550
0.037350,0.017250,0.174150,0.771250
0.036900,0.016500,0.174300,0.772300
0.035900,0.017150,0.173700,0.773250
0.034900,0.016950,0.173950,0.774200
0.034500,0.017050,0.175050,0.773400
0.034100,0.016300,0.175550,0.774050
0.035100,0.016150,0.175600,0.773150
0.034350,0.016550,0.175600,0.773500
0.034500,0.017050,0.175700,0.772750
0.035300,0.015950,0.177050,0.771700
0.035200,0.015550,0.177350,0.771900
0.034550,0.015900,0.176300,0.773250
0.034800,0.016350,0.174900,0.773950
0.035400,0.016950,0.174150,0.773500
0.034600,0.017200,0.174750,0.773450
0.034900,0.016750,0.175400,0.772950
0.035300,0.016050,0.177300,0.771350
0.034800,0.015600,0.177550,0.772050
0.034700,0.015850,0.176700,0.772750
0.034650,0.015850,0.176150,0.773350
0.034200,0.016250,0.175050,0.774500
0.033550,0.016550,0.175350,0.774550
0.032650,0.017150,0.175850,0.774350
0.032200,0.016700,0.177400,0.773700
0.032000,0.016250,0.178700,0.773050
0.032800,0.016800,0.178050,0.772350
0.033900,0.016150,0.178700,0.771250
0.033050,0.016400,0.179200,0.771350
0.032500,0.015150,0.180100,0.772250
0.032650,0.015050,0.179800,0.772500
0.031350,0.015250,0.180300,0.773100
0.030650,0.015500,0.179750,0.774100
0.030200,0.016500,0.179700,0.773600
0.030950,0.016600,0.179000,0.773450
0.030550,0.017550,0.178850,0.773050
0.030650,0.017250,0.179450,0.772650
0.031050,0.016450,0.180550,0.771950
0.032200,0.016050,0.181400,0.770350
0.031600,0.016250,0.182350,0.769800
0.031900,0.015650,0.183500,0.768950
0.032400,0.015850,0.183550,0.768200
0.032400,0.015200,0.185000,0.767400
0.032300,0.015400,0.185200,0.767100
0.032550,0.015850,0.185200,0.766400
0.032700,0.016050,0.185050,0.766200
0.032950,0.016450,0.184500,0.766100
0.032250,0.016400,0.186000,0.765350
0.032550,0.016700,0.185650,0.765100
0.031300,0.016750,0.186650,0.765300
0.031300,0.016300,0.187500,0.764900
0.031600,0.016750,0.187700,0.763950
0.032700,0.015700,0.188700,0.762900
0.033600,0.016350,0.187900,0.762150
0.034050,0.016800,0.187100,0.762050
0.034050,0.016150,0.186400,0.763400
0.034600,0.015250,0.186400,0.763750
0.032950,0.015600,0.187650,0.763800
0.032350,0.016450,0.187800,0.763400
0.032450,0.016650,0.188300,0.762600
0.033450,0.015900,0.187900,0.762750
0.033550,0.016850,0.187450,0.762150
0.034300,0.017050,0.187950,0.760700
0.034350,0.016700,0.188800,0.760150
0.034400,0.018250,0.187500,0.759850
0.034700,0.018450,0.187250,0.759600
0.035850,0.017900,0.187350,0.758900
0.036050,0.018300,0.186500,0.759150
0.036100,0.018050,0.186100,0.759750
0.035800,0.017850,0.185300,0.761050
0.036900,0.017200,0.185950,0.759950
0.036800,0.017600,0.184000,0.761600
0.037300,0.018000,0.183600,0.761100
0.036750,0.016850,0.183950,0.762450
0.035850,0.017000,0.184200,0.762950
0.036000,0.016450,0.184550,0.763000
0.035600,0.016800,0.184000,0.763600
0.035050,0.016950,0.183500,0.764500
0.035550,0.017100,0.182050,0.765300
0.035850,0.017100,0.180700,0.766350
0.036050,0.017400,0.179900,0.766650
0.035600,0.017650,0.179300,0.767450
0.035850,0.017300,0.179000,0.767850
0.037050,0.017650,0.178000,0.767300
0.038000,0.016150,0.178850,0.767000
0.037600,0.017700,0.177650,0.767050
0.038000,0.017250,0.177500,0.767250
0.037100,0.017000,0.177550,0.768350
0.036950,0.017450,0.177100,0.768500
0.036550,0.017200,0.177150,0.769100
0.037150,0.017000,0.177100,0.768750
0.036700,0.017800,0.176000,0.769500
0.036250,0.017550,0.176350,0.769850
0.035650,0.017900,0.175000,0.771450
0.035150,0.017500,0.176050,0.771300
0.036600,0.017150,0.175400,0.770850
0.036050,0.017050,0.175950,0.770950
0.036350,0.016300,0.176550,0.770800
0.036250,0.015700,0.177450,0.770600
0.035950,0.015600,0.178250,0.770200
0.036000,0.016150,0.177900,0.769950
0.036800,0.014800,0.179350,0.769050
0.035900,0.015200,0.179300,0.769600
0.034550,0.016200,0.177950,0.771300
0.034500,0.016250,0.177350,0.771900
0.034000,0.016650,0.177450,0.771900
0.034850,0.016550,0.177400,0.771200
0.034600,0.015550,0.178700,0.771150
0.034150,0.016200,0.177650,0.772000
0.033500,0.016150,0.178200,0.772150
0.033200,0.016000,0.179050,0.771750
0.032550,0.015650,0.178400,0.773400
0.032300,0.015950,0.178950,0.772800
0.032150,0.015850,0.179450,0.772550
0.031300,0.015350,0.181050,0.772300
0.033000,0.014050,0.182350,0.770600
0.032000,0.014250,0.183950,0.769800
0.032300,0.014650,0.183000,0.770050
0.032450,0.014850,0.183500,0.769200
0.032400,0.015550,0.182600,0.769450
0.031850,0.016000,0.182400,0.769750
0.031250,0.016750,0.182200,0.769800
0.031550,0.016500,0.182350,0.769600
0.031950,0.016900,0.181050,0.770100
0.032850,0.016600,0.180700,0.769850
0.032150,0.016700,0.181000,0.770150
0.031950,0.016850,0.180800,0.770400
0.033200,0.015950,0.181150,0.769700
0.032350,0.015500,0.182300,0.769850
0.033000,0.014500,0.183350,0.769150
0.032550,0.016050,0.181600,0.769800
0.032350,0.016300,0.181050,0.770300
0.032850,0.016250,0.181500,0.769400
0.033050,0.016450,0.182300,0.768200
0.033550,0.015600,0.182100,0.768750
0.033550,0.015250,0.182700,0.768500
0.034200,0.015950,0.182600,0.767250
0.033850,0.015550,0.182250,0.768350
0.032550,0.016600,0.182600,0.768250
0.032600,0.016800,0.182000,0.768600
0.031500,0.017000,0.183100,0.768400
0.031700,0.016300,0.184150,0.767850
0.032650,0.016600,0.184200,0.766550
0.032300,0.016950,0.184100,0.766650
0.033300,0.017350,0.182800,0.766550
0.033800,0.016950,0.183500,0.765750
0.034450,0.017100,0.183350,0.765100
0.034750,0.017100,0.182750,0.765400
0.035900,0.017000,0.183450,0.763650
0.035900,0.016400,0.183150,0.764550
0.036250,0.017350,0.182200,0.764200
0.035800,0.018650,0.181750,0.763800
0.035100,0.019100,0.181300,0.764500
0.036050,0.017350,0.182000,0.764600
0.036300,0.017200,0.181350,0.765150
0.036450,0.017550,0.180450,0.765550
0.035850,0.017450,0.180750,0.765950
0.036550,0.017600,0.180300,0.765550
0.036950,0.017300,0.180600,0.765150
0.037050,0.017350,0.180500,0.765100
0.037100,0.017250,0.180550,0.765100
0.037450,0.017800,0.179400,0.765350
0.036800,0.017600,0.179600,0.766000
0.037000,0.017000,0.180200,0.765800
0.036350,0.017700,0.179050,0.766900
0.037300,0.018200,0.178300,0.766200
0.038450,0.018450,0.177350,0.765750
0.039000,0.017900,0.176700,0.766400
0.039000,0.017400,0.177200,0.766400
0.038250,0.017250,0.177350,0.767150
0.037450,0.016750,0.177750,0.768050
0.036150,0.017700,0.176950,0.769200
0.035300,0.019000,0.176800,0.768900
0.036200,0.018050,0.177050,0.768700
0.035500,0.018100,0.176700,0.769700
0.035000,0.018750,0.176500,0.769750
0.036050,0.018750,0.175800,0.769400
0.034650,0.019000,0.176200,0.770150
0.034700,0.017900,0.176850,0.770550
0.035300,0.017300,0.177950,0.769450
0.035150,0.017100,0.178300,0.769450
0.035700,0.017450,0.177700,0.769150
0.036650,0.017450,0.177850,0.768050
0.036500,0.016500,0.178200,0.768800
0.036600,0.016550,0.178750,0.768100
0.036600,0.016700,0.178100,0.768600
0.036000,0.016800,0.177200,0.770000
0.035200,0.017650,0.176600,0.770550
0.035000,0.017750,0.176300,0.770950
0.035400,0.017500,0.175400,0.771700
0.035300,0.016150,0.176700,0.771850
0.035050,0.016000,0.177200,0.771750
0.034400,0.016700,0.177000,0.771900
0.033750,0.017200,0.177500,0.771550
0.034150,0.017400,0.177100,0.771350
0.035450,0.016350,0.177200,0.771000
0.034700,0.017550,0.176350,0.771400
0.035350,0.016700,0.176500,0.771450
0.035800,0.016300,0.176400,0.771500
0.034600,0.016200,0.177000,0.772200
0.034350,0.016400,0.177550,0.771700
0.035200,0.016850,0.177800,0.770150
0.034850,0.016000,0.178450,0.770700
0.035050,0.016800,0.178400,0.769750
0.036350,0.015450,0.178800,0.769400
0.035750,0.015650,0.178450,0.770150
0.034700,0.016050,0.177800,0.771450
0.033750,0.016700,0.177350,0.772200
0.032200,0.016200,0.179450,0.772150
0.033050,0.015700,0.179700,0.771550
0.031750,0.014850,0.181550,0.771850
0.032100,0.015600,0.182100,0.770200
0.032200,0.016350,0.182550,0.768900
0.031550,0.016950,0.182950,0.768550
0.032600,0.016700,0.183750,0.766950
0.032050,0.016950,0.183600,0.767400
0.031950,0.017300,0.184150,0.766600
0.032900,0.016500,0.184450,0.766150
0.033150,0.015850,0.185100,0.765900
0.032950,0.016950,0.185000,0.765100
0.033350,0.017100,0.185100,0.764450
0.033650,0.016500,0.186350,0.763500
0.034750,0.015400,0.186900,0.762950
0.033250,0.016350,0.186300,0.764100
0.033650,0.016700,0.186550,0.763100
0.033600,0.018100,0.185700,0.762600
0.033800,0.018600,0.184850,0.762750
0.033900,0.018500,0.185200,0.762400
0.034500,0.017850,0.185350,0.762300
0.035450,0.016950,0.185550,0.762050
0.034600,0.017850,0.185100,0.762450
0.035600,0.018900,0.183900,0.761600
0.035750,0.018500,0.184700,0.761050
0.035250,0.018200,0.184550,0.762000
0.036300,0.018400,0.183950,0.761350
0.036100,0.018550,0.184700,0.760650
0.035400,0.018300,0.184900,0.761400
0.035050,0.018350,0.185450,0.761150
0.035700,0.018300,0.185650,0.760350
0.035350,0.018200,0.185350,0.761100
0.037350,0.017150,0.184150,0.761350
0.037050,0.016650,0.183350,0.762950
0.036500,0.017350,0.183250,0.762900
0.036100,0.017500,0.183450,0.762950
0.035700,0.017200,0.183350,0.763750
0.036250,0.016850,0.183250,0.763650
0.037250,0.017050,0.182800,0.762900
0.035400,0.017500,0.183500,0.763600
0.035000,0.017500,0.183850,0.763650
0.035450,0.017150,0.183850,0.763550
0.034900,0.017000,0.184100,0.764000
0.035200,0.016900,0.184950,0.762950
0.036150,0.017500,0.184750,0.761600
0.036050,0.017700,0.184450,0.761800
0.036300,0.018200,0.184100,0.761400
0.036800,0.018200,0.184150,0.760850
0.037550,0.018950,0.182200,0.761300
0.037750,0.017250,0.183450,0.761550
0.038250,0.018150,0.182150,0.761450
0.037400,0.020150,0.180850,0.761600
0.039050,0.019400,0.180100,0.761450
0.040150,0.019050,0.178950,0.761850
0.041450,0.018250,0.179000,0.761300
0.040650,0.018150,0.178450,0.762750
0.041950,0.017050,0.178350,0.762650
0.039900,0.018200,0.178150,0.763750
0.039600,0.017650,0.177250,0.765500
0.038900,0.018650,0.176700,0.765750
0.038300,0.019350,0.175600,0.766750
0.038900,0.017950,0.175800,0.767350
0.039650,0.017650,0.175200,0.767500
0.039400,0.018450,0.174200,0.767950
0.039950,0.017600,0.173500,0.768950
0.039800,0.017550,0.173000,0.769650
0.039500,0.017250,0.172850,0.770400
0.037800,0.018000,0.172450,0.771750
0.037750,0.017600,0.173500,0.771150
0.038050,0.017450,0.173900,0.770600
0.038850,0.016250,0.174400,0.770500
0.039250,0.016100,0.175000,0.769650
0.037950,0.016500,0.174600,0.770950
0.036150,0.017000,0.174800,0.772050
0.035950,0.016600,0.175000,0.772450
0.035850,0.016350,0.175400,0.772400
0.035050,0.016900,0.174800,0.773250
0.035200,0.017150,0.174900,0.772750
0.034350,0.017200,0.175850,0.772600
0.034350,0.016400,0.176400,0.772850
0.033000,0.018050,0.176250,0.772700
0.033900,0.017500,0.176300,0.772300
0.033850,0.017100,0.177150,0.771900
0.033400,0.016200,0.178250,0.772150
0.033800,0.015900,0.178450,0.771850
0.034350,0.015400,0.179050,0.771200
0.034450,0.015550,0.179150,0.770850
0.035200,0.015250,0.178750,0.770800
0.033950,0.016750,0.178750,0.770550
0.034850,0.016400,0.178550,0.770200
0.034500,0.016350,0.179050,0.770100
0.033000,0.016800,0.178850,0.771350
0.032600,0.016550,0.179750,0.771100
0.032200,0.015850,0.179150,0.772800
0.032200,0.014550,0.180250,0.773000
0.031300,0.016150,0.180300,0.772250
0.031000,0.016400,0.180200,0.772400
0.030400,0.017000,0.181250,0.771350
0.031650,0.016050,0.182350,0.769950
0.032650,0.015550,0.183500,0.768300
0.032650,0.015950,0.184050,0.767350
0.033100,0.016100,0.184500,0.766300
0.032850,0.015750,0.184300,0.767100
0.032550,0.015000,0.185900,0.766550
0.032900,0.014950,0.185700,0.766450
0.032700,0.016650,0.184400,0.766250
0.031950,0.016150,0.186100,0.765800
0.032550,0.015900,0.186750,0.764800
0.032900,0.016650,0.186300,0.764150
0.031950,0.017750,0.186500,0.763800
0.032350,0.016700,0.187250,0.763700
0.032450,0.017100,0.187650,0.762800
0.032250,0.017950,0.187550,0.762250
0.032900,0.017900,0.187800,0.761400
0.032600,0.017700,0.188700,0.761000
0.032900,0.017300,0.189650,0.760150
0.032150,0.017050,0.190200,0.760600
0.032300,0.016750,0.189600,0.761350
0.032550,0.016300,0.189950,0.761200
0.032450,0.016350,0.190600,0.760600
0.033500,0.016850,0.191000,0.758650
0.034300,0.017500,0.189650,0.758550
0.034550,0.017650,0.189700,0.758100
0.033950,0.017400,0.190650,0.758000
0.033850,0.017050,0.190650,0.758450
0.034250,0.016800,0.190200,0.758750
0.033550,0.017750,0.188850,0.759850
0.033900,0.017850,0.188250,0.760000
0.034650,0.018100,0.187350,0.759900
0.034900,0.017850,0.186050,0.761200
0.035500,0.018850,0.184200,0.761450
0.035750,0.018300,0.183900,0.762050
0.036700,0.017600,0.183700,0.762000
0.035600,0.018400,0.183400,0.762600
0.036850,0.018200,0.182900,0.762050
0.036200,0.018300,0.183150,0.762350
0.036200,0.018200,0.182700,0.762900
0.036000,0.017900,0.182700,0.763400
0.037450,0.018200,0.182750,0.761600
0.036500,0.018600,0.182650,0.762250
0.036500,0.018800,0.182100,0.762600
0.037000,0.018700,0.181800,0.762500
0.037400,0.018700,0.181850,0.762050
0.037900,0.018150,0.181250,0.762700
0.037800,0.017550,0.181650,0.763000
0.037300,0.017400,0.182050,0.763250
0.037050,0.017800,0.181800,0.763350
0.036500,0.017950,0.182250,0.763300
0.035850,0.017300,0.183200,0.763650
0.035600,0.017200,0.183900,0.763300
0.035200,0.017500,0.182800,0.764500
0.035850,0.016400,0.183750,0.764000
0.035450,0.016400,0.183800,0.764350
0.036400,0.016950,0.184250,0.762400
0.036500,0.017600,0.183900,0.762000
0.035500,0.018150,0.183900,0.762450
0.036450,0.017350,0.184500,0.761700
0.037150,0.016700,0.185050,0.761100
0.038150,0.017200,0.183900,0.760750
0.038100,0.017750,0.183150,0.761000
0.038150,0.016750,0.183350,0.761750
0.038850,0.017800,0.181300,0.762050
0.038700,0.017250,0.181050,0.763000
0.038750,0.017500,0.180650,0.763100
0.039250,0.018050,0.178500,0.764200
0.040400,0.018500,0.177600,0.763500
0.040500,0.018900,0.175900,0.764700
0.039150,0.018900,0.175300,0.766650
0.039350,0.019850,0.175100,0.765700
0.040500,0.018900,0.175100,0.765500
0.040750,0.018000,0.174900,0.766350
0.040700,0.018250,0.173350,0.767700
0.040300,0.019400,0.172200,0.768100
0.040750,0.020250,0.170500,0.768500
