I,E,S,R
0.001000,0.000950,0.998050,0.000000
0.001000,0.001400,0.997350,0.000250
0.001050,0.002200,0.996250,0.000500
0.001550,0.002350,0.995500,0.000600
0.001900,0.002700,0.994550,0.000850
0.002500,0.003900,0.992550,0.001050
0.003550,0.004750,0.990450,0.001250
0.004650,0.006600,0.987150,0.001600
0.005900,0.008300,0.983500,0.002300
0.007650,0.011200,0.978200,0.002950
0.010100,0.014500,0.971750,0.003650
0.012450,0.020050,0.962500,0.005000
0.015400,0.025950,0.951950,0.006700
0.020900,0.032350,0.937800,0.008950
0.028400,0.040400,0.919700,0.011500
0.034850,0.053650,0.896400,0.015100
0.044550,0.067750,0.867950,0.019750
0.057300,0.084100,0.832400,0.026200
0.076200,0.103450,0.787250,0.033100
0.097150,0.125350,0.734850,0.042650
0.118550,0.149000,0.677100,0.055350
0.145100,0.171700,0.612200,0.071000
0.171650,0.196000,0.540700,0.091650
0.204500,0.217050,0.464950,0.113500
0.239150,0.233050,0.389500,0.138300
0.273050,0.237600,0.319150,0.170200
0.305200,0.231250,0.257850,0.205700
0.328900,0.223600,0.201650,0.245850
0.348200,0.210450,0.152700,0.288650
0.360400,0.188600,0.116900,0.334100
0.365650,0.164450,0.088450,0.381450
0.360150,0.138850,0.069250,0.431750
0.352800,0.114050,0.053650,0.479500
0.337250,0.093700,0.043600,0.525450
0.318850,0.077500,0.035650,0.568000
0.301200,0.062900,0.029750,0.606150
0.279000,0.051400,0.024800,0.644800
0.258100,0.041200,0.021900,0.678800
0.234750,0.033150,0.020450,0.711650
0.213250,0.026050,0.019450,0.741250
0.191250,0.020900,0.018900,0.768950
0.172550,0.017600,0.019300,0.790550
0.152750,0.014900,0.019750,0.812600
0.136900,0.011600,0.021050,0.830450
0.121650,0.010350,0.022650,0.845350
0.107550,0.009200,0.023250,0.860000
0.096000,0.008200,0.024700,0.871100
0.085350,0.007250,0.025900,0.881500
0.075850,0.007100,0.027250,0.889800
0.067350,0.006700,0.029600,0.896350
0.059600,0.005500,0.031650,0.903250
0.052700,0.005400,0.033400,0.908500
0.048750,0.004950,0.034950,0.911350
0.042950,0.004100,0.038450,0.914500
0.037700,0.004150,0.041500,0.916650
0.033600,0.003900,0.043900,0.918600
0.029150,0.003650,0.046450,0.920750
0.026250,0.003800,0.048700,0.921250
0.023950,0.003600,0.050100,0.922350
0.021700,0.003800,0.052700,0.921800
0.019100,0.003600,0.055650,0.921650
0.017700,0.003550,0.058200,0.920550
0.016050,0.003150,0.061150,0.919650
0.014150,0.002750,0.064000,0.919100
0.012650,0.002800,0.066150,0.918400
0.011450,0.002550,0.069100,0.916900
0.010200,0.002150,0.071950,0.915700
0.009550,0.002700,0.074550,0.913200
0.009300,0.002550,0.077300,0.910850
0.008450,0.002400,0.080500,0.908650
0.007800,0.001950,0.083700,0.906550
0.006950,0.002000,0.086850,0.904200
0.006300,0.001850,0.088900,0.902950
0.006100,0.001700,0.091200,0.901000
0.005900,0.001300,0.094200,0.898600
0.005600,0.001350,0.096550,0.896500
0.005600,0.001550,0.098700,0.894150
0.004850,0.001650,0.101450,0.892050
0.004500,0.001700,0.104450,0.889350
0.004800,0.001300,0.106900,0.887000
0.004500,0.001200,0.109700,0.884600
0.004150,0.001250,0.112800,0.881800
0.003400,0.001250,0.115750,0.879600
0.003450,0.001150,0.118100,0.877300
0.003500,0.001000,0.120400,0.875100
0.003100,0.001050,0.122650,0.873200
0.003050,0.000950,0.125000,0.871000
0.002750,0.001100,0.127850,0.868300
0.002450,0.001200,0.130150,0.866200
0.002450,0.001150,0.133000,0.863400
0.002450,0.001150,0.135350,0.861050
0.002350,0.001150,0.137600,0.858900
0.002400,0.001000,0.140350,0.856250
0.002200,0.001150,0.142850,0.853800
0.002250,0.001000,0.145500,0.851250
0.002050,0.001200,0.147800,0.848950
0.002250,0.001050,0.150450,0.846250
0.002000,0.001100,0.152950,0.843950
0.002000,0.001200,0.155600,0.841200
0.001800,0.001050,0.158050,0.839100
0.001650,0.001150,0.160400,0.836800
0.001800,0.000950,0.162600,0.834650
0.001900,0.000750,0.164650,0.832700
0.001850,0.000850,0.166350,0.830950
0.001800,0.000800,0.169250,0.828150
0.001750,0.000750,0.171400,0.826100
0.001950,0.000750,0.173450,0.823850
0.001850,0.000850,0.175450,0.821850
0.001600,0.000800,0.177750,0.819850
0.001550,0.000800,0.179800,0.817850
0.001250,0.000950,0.182000,0.815800
0.001400,0.000950,0.183850,0.813800
0.001400,0.001050,0.186000,0.811550
0.001650,0.000900,0.188250,0.809200
0.001850,0.000750,0.190600,0.806800
0.002000,0.000600,0.192350,0.805050
0.002000,0.000550,0.194900,0.802550
0.002000,0.000400,0.197650,0.799950
0.002000,0.000350,0.199700,0.797950
0.001800,0.000400,0.202500,0.795300
0.001700,0.000600,0.204800,0.792900
0.001350,0.000750,0.207300,0.790600
0.001100,0.000950,0.209700,0.788250
0.001150,0.000750,0.212300,0.785800
0.001250,0.000600,0.215350,0.782800
0.001300,0.000600,0.217600,0.780500
0.001200,0.000650,0.219350,0.778800
0.001300,0.000500,0.221300,0.776900
0.001300,0.000650,0.223450,0.774600
0.001250,0.000950,0.225300,0.772500
0.001500,0.000800,0.226800,0.770900
0.001550,0.000700,0.229250,0.768500
0.001600,0.000750,0.231350,0.766300
0.001700,0.000900,0.232850,0.764550
0.001850,0.000700,0.235000,0.762450
0.001600,0.000700,0.237550,0.760150
0.001700,0.000700,0.239750,0.757850
0.001550,0.001000,0.241400,0.756050
0.001650,0.000700,0.243550,0.754100
0.001400,0.000800,0.245200,0.752600
0.001500,0.000800,0.246800,0.750900
0.001350,0.001050,0.248300,0.749300
0.001450,0.001100,0.250000,0.747450
0.001450,0.001050,0.252000,0.745500
0.001500,0.000900,0.253950,0.743650
0.001300,0.000800,0.256200,0.741700
0.001400,0.000900,0.258050,0.739650
0.001600,0.000950,0.259550,0.737900
0.001300,0.001150,0.261400,0.736150
0.001450,0.001000,0.263300,0.734250
0.001550,0.000950,0.264700,0.732800
0.001550,0.001200,0.266800,0.730450
0.001450,0.001300,0.268950,0.728300
0.001550,0.001200,0.271250,0.726000
0.001700,0.001250,0.273150,0.723900
0.001800,0.000900,0.275250,0.722050
0.001950,0.000950,0.276650,0.720450
0.002100,0.001150,0.278250,0.718500
0.002050,0.001100,0.280250,0.716600
0.002000,0.001300,0.282000,0.714700
0.002000,0.001500,0.283050,0.713450
0.002250,0.001650,0.284200,0.711900
0.002100,0.001900,0.286400,0.709600
0.002400,0.001950,0.287400,0.708250
0.002550,0.002350,0.288700,0.706400
0.003000,0.002050,0.290650,0.704300
0.003350,0.002050,0.292200,0.702400
0.003000,0.002250,0.293550,0.701200
0.003200,0.002600,0.294300,0.699900
0.003350,0.002400,0.295400,0.698850
0.003450,0.002500,0.296550,0.697500
0.004000,0.002300,0.298050,0.695650
0.003950,0.002850,0.299150,0.694050
0.004150,0.002500,0.299850,0.693500
0.004100,0.002650,0.301250,0.692000
0.004250,0.002950,0.302600,0.690200
0.004700,0.003250,0.303500,0.688550
0.005050,0.003700,0.304400,0.686850
0.005500,0.003400,0.305700,0.685400
0.005650,0.003500,0.306650,0.684200
0.005750,0.003800,0.307550,0.682900
0.006350,0.003800,0.308500,0.681350
0.006400,0.003800,0.308850,0.680950
0.006800,0.004250,0.309150,0.679800
0.006800,0.005200,0.309150,0.678850
0.007400,0.005050,0.309900,0.677650
0.008000,0.005000,0.310200,0.676800
0.008600,0.005300,0.310100,0.676000
0.008300,0.006150,0.310250,0.675300
0.008050,0.006450,0.310800,0.674700
0.008650,0.006500,0.310550,0.674300
0.008800,0.007400,0.309800,0.674000
0.009750,0.007300,0.309250,0.673700
0.010150,0.007300,0.310050,0.672500
0.011100,0.008350,0.308900,0.671650
0.011950,0.008350,0.308600,0.671100
0.012450,0.009200,0.307050,0.671300
0.013200,0.009850,0.305650,0.671300
0.014150,0.010400,0.305000,0.670450
0.015450,0.010750,0.303400,0.670400
0.016000,0.011600,0.301950,0.670450
0.017750,0.011650,0.300100,0.670500
0.018900,0.012800,0.297450,0.670850
0.020200,0.014350,0.293900,0.671550
0.020550,0.015600,0.291700,0.672150
0.022400,0.015750,0.289300,0.672550
0.024450,0.015350,0.287100,0.673100
0.025050,0.016250,0.283650,0.675050
0.026300,0.018250,0.279450,0.676000
0.028450,0.018050,0.277250,0.676250
0.030200,0.018200,0.273800,0.677800
0.031950,0.020400,0.268700,0.678950
0.033050,0.019700,0.265450,0.681800
0.034150,0.020650,0.260800,0.684400
0.036100,0.020950,0.256100,0.686850
0.037200,0.021000,0.252650,0.689150
0.037850,0.021700,0.248250,0.692200
0.040200,0.023250,0.242350,0.694200
0.041350,0.023050,0.238850,0.696750
0.042050,0.024800,0.232950,0.700200
0.044000,0.025200,0.227450,0.703350
0.045000,0.024550,0.223300,0.707150
0.044950,0.025650,0.217850,0.711550
0.046450,0.026700,0.212350,0.714500
0.047450,0.026900,0.208450,0.717200
0.048000,0.027650,0.203250,0.721100
0.049650,0.028150,0.197550,0.724650
0.050050,0.029050,0.192300,0.728600
0.050850,0.028500,0.188350,0.732300
0.052400,0.027450,0.184650,0.735500
0.052800,0.026650,0.181000,0.739550
0.052750,0.027300,0.175500,0.744450
0.053250,0.025500,0.172000,0.749250
0.052450,0.025650,0.168000,0.753900
0.051950,0.025450,0.165400,0.757200
0.052000,0.025200,0.162050,0.760750
0.051100,0.025400,0.159050,0.764450
0.051200,0.023850,0.156450,0.768500
0.050850,0.022450,0.154250,0.772450
0.050800,0.021450,0.151550,0.776200
0.050350,0.021550,0.149250,0.778850
0.049450,0.022350,0.145750,0.782450
0.048500,0.021000,0.143400,0.787100
0.048150,0.019750,0.142200,0.789900
0.046950,0.019950,0.139600,0.793500
0.046750,0.019050,0.137650,0.796550
0.046000,0.019150,0.136500,0.798350
0.045250,0.018400,0.135600,0.800750
0.043850,0.017950,0.135550,0.802650
0.043050,0.016700,0.134550,0.805700
0.042650,0.015450,0.134150,0.807750
0.041200,0.016400,0.132550,0.809850
0.039900,0.015500,0.133400,0.811200
0.039450,0.014750,0.133850,0.811950
0.037450,0.014900,0.132700,0.814950
0.035900,0.014800,0.133000,0.816300
0.034600,0.014150,0.133700,0.817550
0.032600,0.014400,0.135100,0.817900
0.032950,0.013150,0.136200,0.817700
0.033700,0.012300,0.136500,0.817500
0.033250,0.011950,0.136900,0.817900
0.032000,0.012650,0.136550,0.818800
0.030800,0.012250,0.137500,0.819450
0.030250,0.012250,0.138300,0.819200
0.029550,0.012600,0.140150,0.817700
0.028050,0.013700,0.140500,0.817750
0.028400,0.013300,0.141850,0.816450
0.028750,0.012900,0.142100,0.816250
0.027650,0.012400,0.143700,0.816250
0.026650,0.011950,0.145350,0.816050
0.026000,0.011800,0.146900,0.815300
0.025300,0.011800,0.148050,0.814850
0.024250,0.011750,0.150650,0.813350
0.023700,0.012150,0.151650,0.812500
0.023400,0.012300,0.153650,0.810650
0.023900,0.011050,0.154500,0.810550
0.024200,0.010250,0.156250,0.809300
0.024450,0.010100,0.157400,0.808050
0.024250,0.010150,0.158850,0.806750
0.023400,0.009750,0.161300,0.805550
0.023100,0.009700,0.162400,0.804800
0.022700,0.009100,0.165500,0.802700
0.022300,0.009900,0.166050,0.801750
0.022200,0.009550,0.167300,0.800950
0.021900,0.009500,0.168400,0.800200
0.021300,0.009900,0.169750,0.799050
0.022200,0.008650,0.172500,0.796650
0.021400,0.009000,0.175500,0.794100
0.020450,0.008800,0.177900,0.792850
0.019000,0.010000,0.178200,0.792800
0.018850,0.010600,0.179800,0.790750
0.020100,0.010000,0.181100,0.788800
0.020200,0.009650,0.182450,0.787700
0.020950,0.009550,0.182700,0.786800
0.020250,0.010450,0.183850,0.785450
0.019750,0.010500,0.185350,0.784400
0.020200,0.009950,0.186000,0.783850
0.019600,0.009800,0.188100,0.782500
0.018750,0.010250,0.189500,0.781500
0.018700,0.010650,0.191350,0.779300
0.018800,0.010450,0.193500,0.777250
0.018900,0.010450,0.194200,0.776450
0.019600,0.010650,0.195400,0.774350
0.020700,0.010600,0.196250,0.772450
0.020450,0.011450,0.197000,0.771100
0.020300,0.011850,0.197550,0.770300
0.020100,0.012400,0.197950,0.769550
0.020850,0.012400,0.199100,0.767650
0.021150,0.012200,0.200100,0.766550
0.021950,0.011900,0.202200,0.763950
0.021600,0.012150,0.203500,0.762750
0.022950,0.012950,0.203850,0.760250
0.023750,0.012700,0.204350,0.759200
0.024650,0.013250,0.204200,0.757900
0.023650,0.015050,0.203300,0.758000
0.025300,0.013850,0.205050,0.755800
0.025200,0.014150,0.205300,0.755350
0.025050,0.014900,0.204700,0.755350
0.025800,0.014050,0.205350,0.754800
0.026450,0.014200,0.204750,0.754600
0.027300,0.014100,0.204950,0.753650
0.027100,0.014650,0.204750,0.753500
0.026850,0.015050,0.204500,0.753600
0.027500,0.015500,0.204700,0.752300
0.028400,0.015900,0.203200,0.752500
0.028850,0.016200,0.203100,0.751850
0.029600,0.017150,0.202100,0.751150
0.029050,0.018100,0.201200,0.751650
0.030100,0.017150,0.200950,0.751800
0.031650,0.016150,0.201250,0.750950
0.032200,0.015650,0.201050,0.751100
0.032450,0.015050,0.201950,0.750550
0.032250,0.015050,0.202250,0.750450
0.032400,0.015800,0.200900,0.750900
0.033100,0.015650,0.200150,0.751100
0.033600,0.014650,0.199850,0.751900
0.032750,0.016750,0.198500,0.752000
0.032450,0.018050,0.198050,0.751450
0.034350,0.018200,0.196900,0.750550
0.034950,0.017900,0.196750,0.750400
0.035050,0.018550,0.196250,0.750150
0.035950,0.018400,0.195450,0.750200
0.036000,0.018600,0.195000,0.750400
0.036750,0.018500,0.194600,0.750150
0.037700,0.017850,0.194700,0.749750
0.038750,0.016550,0.194850,0.749850
0.037200,0.017300,0.193350,0.752150
0.037200,0.018000,0.192450,0.752350
0.036300,0.017600,0.192650,0.753450
0.036200,0.019300,0.191850,0.752650
0.035700,0.018850,0.191750,0.753700
0.035500,0.019150,0.190600,0.754750
0.035050,0.019150,0.190400,0.755400
0.034800,0.019550,0.190400,0.755250
0.037050,0.018550,0.189750,0.754650
0.036200,0.018800,0.189550,0.755450
0.035100,0.020450,0.187800,0.756650
0.036350,0.019550,0.187450,0.756650
0.035900,0.019700,0.186350,0.758050
0.037750,0.018900,0.185800,0.757550
0.037900,0.018600,0.185500,0.758000
0.038000,0.018850,0.185000,0.758150
0.038650,0.018000,0.185350,0.758000
0.037650,0.017350,0.186250,0.758750
0.038300,0.017450,0.185300,0.758950
0.037700,0.017600,0.185500,0.759200
0.038100,0.017250,0.184150,0.760500
0.038150,0.018350,0.183000,0.760500
0.037700,0.018850,0.182550,0.760900
0.038500,0.018850,0.182550,0.760100
0.038850,0.019400,0.181800,0.759950
0.039650,0.019500,0.180450,0.760400
0.040250,0.019400,0.179300,0.761050
0.040500,0.018850,0.179150,0.761500
0.040700,0.018000,0.178750,0.762550
0.039300,0.017950,0.179700,0.763050
0.038750,0.018550,0.177750,0.764950
0.039950,0.017350,0.178550,0.764150
0.038900,0.017800,0.178450,0.764850
0.039500,0.017950,0.177700,0.764850
0.038950,0.017700,0.178250,0.765100
0.039250,0.017150,0.178300,0.765300
0.039900,0.016850,0.178500,0.764750
0.038550,0.018600,0.177300,0.765550
0.037450,0.018050,0.177950,0.766550
0.037150,0.017650,0.179350,0.765850
0.036250,0.017300,0.180250,0.766200
0.036400,0.017500,0.181050,0.765050
0.037000,0.017100,0.181350,0.764550
0.036000,0.017050,0.181600,0.765350
0.035650,0.017350,0.181950,0.765050
0.035450,0.017500,0.181050,0.766000
0.034850,0.017450,0.181500,0.766200
0.034200,0.018100,0.181950,0.765750
0.034000,0.019550,0.181450,0.765000
0.035050,0.018000,0.181750,0.765200
0.034950,0.017850,0.182000,0.765200
0.034800,0.017900,0.181650,0.765650
0.035750,0.017950,0.182300,0.764000
0.035600,0.017950,0.182400,0.764050
0.036600,0.016900,0.182650,0.763850
0.036150,0.016550,0.183050,0.764250
0.037050,0.017250,0.183000,0.762700
0.036450,0.016650,0.183550,0.763350
0.036700,0.017200,0.182850,0.763250
0.036200,0.017800,0.181800,0.764200
0.035600,0.018000,0.181750,0.764650
0.036100,0.017350,0.181800,0.764750
0.036300,0.017700,0.182000,0.764000
0.035550,0.017750,0.181900,0.764800
0.035600,0.018000,0.182000,0.764400
0.036000,0.018050,0.182150,0.763800
0.036850,0.017450,0.182050,0.763650
0.036500,0.017200,0.182650,0.763650
0.035950,0.018150,0.182200,0.763700
0.036300,0.018050,0.182550,0.763100
0.036350,0.018300,0.181550,0.763800
0.035300,0.019100,0.180550,0.765050
0.036650,0.019000,0.179300,0.765050
0.038000,0.019150,0.178700,0.764150
0.037750,0.019400,0.177700,0.765150
0.038700,0.019100,0.176750,0.765450
0.039150,0.018900,0.176050,0.765900
0.039200,0.020000,0.175300,0.765500
0.039850,0.018750,0.175400,0.766000
0.037750,0.019850,0.174850,0.767550
0.038250,0.020050,0.173700,0.768000
0.038000,0.019800,0.174350,0.767850
0.038300,0.019900,0.173950,0.767850
0.039250,0.019350,0.173550,0.767850
0.038700,0.019100,0.173200,0.769000
0.039050,0.018250,0.174350,0.768350
0.038300,0.018050,0.174900,0.768750
0.038700,0.018500,0.173800,0.769000
0.039000,0.018850,0.173350,0.768800
0.038950,0.018450,0.174300,0.768300
0.039200,0.018550,0.174050,0.768200
0.038850,0.018200,0.173000,0.769950
0.039200,0.017850,0.172850,0.770100
0.039600,0.017800,0.172650,0.769950
0.038850,0.018000,0.172500,0.770650
0.038600,0.017100,0.172650,0.771650
0.037900,0.017450,0.174450,0.770200
0.037850,0.017450,0.174850,0.769850
0.037850,0.018700,0.173250,0.770200
0.037950,0.017950,0.173950,0.770150
0.037500,0.019150,0.172450,0.770900
0.036950,0.018300,0.172300,0.772450
0.037600,0.018250,0.172250,0.771900
0.036950,0.018400,0.171450,0.773200
0.036800,0.018450,0.171000,0.773750
0.036250,0.018250,0.171000,0.774500
0.037600,0.016250,0.171550,0.774600
0.036750,0.017500,0.170950,0.774800
0.038050,0.017100,0.170050,0.774800
0.037400,0.017150,0.169900,0.775550
0.036950,0.016250,0.169700,0.777100
0.036500,0.016800,0.169750,0.776950
0.036250,0.016900,0.170000,0.776850
0.036600,0.015350,0.171350,0.776700
0.034850,0.016450,0.172550,0.776150
0.034100,0.017150,0.172150,0.776600
0.033100,0.017050,0.172950,0.776900
0.034100,0.016700,0.173050,0.776150
0.033450,0.017200,0.173200,0.776150
0.032750,0.017400,0.173050,0.776800
0.033000,0.017750,0.174100,0.775150
0.032900,0.017350,0.173950,0.775800
0.033600,0.016900,0.173600,0.775900
0.034400,0.016750,0.173250,0.775600
0.033800,0.017000,0.172900,0.776300
0.032750,0.017450,0.172000,0.777800
0.033950,0.015600,0.173500,0.776950
0.034400,0.014050,0.174700,0.776850
0.033600,0.015100,0.174650,0.776650
0.032550,0.016650,0.174850,0.775950
0.033200,0.015300,0.175300,0.776200
0.034100,0.014800,0.176650,0.774450
0.034550,0.015950,0.175700,0.773800
0.034300,0.015700,0.175950,0.774050
0.033900,0.017450,0.173850,0.774800
0.034850,0.016500,0.173900,0.774750
0.034650,0.016500,0.174400,0.774450
0.033800,0.016950,0.173400,0.775850
0.034150,0.016350,0.174150,0.775350
0.033650,0.017000,0.174450,0.774900
0.034350,0.016700,0.173750,0.775200
0.033750,0.015750,0.175700,0.774800
0.033100,0.016050,0.175150,0.775700
0.032750,0.017550,0.173950,0.775750
0.033950,0.017100,0.173900,0.775050
0.034700,0.015900,0.174600,0.774800
0.033650,0.017150,0.174600,0.774600
0.035150,0.015750,0.175950,0.773150
0.035450,0.015150,0.176600,0.772800
0.035550,0.015450,0.176700,0.772300
0.035100,0.015450,0.178200,0.771250
0.033950,0.015150,0.179000,0.771900
0.033200,0.015850,0.178950,0.772000
0.034200,0.014600,0.179200,0.772000
0.034050,0.013850,0.179850,0.772250
0.034000,0.014200,0.180050,0.771750
0.033300,0.014800,0.180300,0.771600
0.032300,0.015200,0.180650,0.771850
0.031350,0.015300,0.181550,0.771800
0.031250,0.015050,0.183000,0.770700
0.030900,0.015200,0.183000,0.770900
0.030750,0.015450,0.183850,0.769950
0.030750,0.015600,0.183900,0.769750
0.030400,0.015900,0.184250,0.769450
0.031000,0.014950,0.185150,0.768900
0.031450,0.015500,0.185450,0.767600
0.031350,0.015850,0.185800,0.767000
0.032150,0.015950,0.185300,0.766600
0.033550,0.015200,0.185800,0.765450
0.034200,0.015700,0.185650,0.764450
0.033400,0.016050,0.185450,0.765100
0.033750,0.017200,0.184950,0.764100
0.033050,0.016450,0.185550,0.764950
0.033800,0.016100,0.185400,0.764700
0.033800,0.016450,0.184700,0.765050
0.033650,0.016600,0.185550,0.764200
0.033350,0.017250,0.184700,0.764700
0.033900,0.016500,0.184800,0.764800
0.033150,0.016750,0.184950,0.765150
0.033050,0.017350,0.185350,0.764250
0.033800,0.017250,0.186550,0.762400
0.032500,0.017950,0.186950,0.762600
0.033100,0.017300,0.186750,0.762850
0.033200,0.016950,0.187050,0.762800
0.033150,0.016350,0.188350,0.762150
0.033150,0.015250,0.189450,0.762150
0.033450,0.015350,0.188600,0.762600
0.033200,0.016350,0.188850,0.761600
0.032850,0.016050,0.189050,0.762050
0.032050,0.015600,0.190350,0.762000
0.032900,0.016400,0.189800,0.760900
0.032150,0.016200,0.189600,0.762050
0.031900,0.016700,0.189100,0.762300
0.033000,0.016250,0.188800,0.761950
0.032350,0.016300,0.189000,0.762350
0.033300,0.017050,0.189000,0.760650
0.033750,0.016500,0.189950,0.759800
0.035050,0.017050,0.188950,0.758950
0.034450,0.017550,0.187950,0.760050
0.035550,0.016900,0.187750,0.759800
0.036650,0.015850,0.186950,0.760550
0.036450,0.015900,0.187000,0.760650
0.036500,0.016450,0.186350,0.760700
0.035750,0.017400,0.185650,0.761200
0.035600,0.017100,0.185900,0.761400
0.035650,0.016750,0.185800,0.761800
0.035850,0.017550,0.184050,0.762550
0.035850,0.017800,0.184050,0.762300
0.036050,0.018050,0.183500,0.762400
0.036950,0.017900,0.182450,0.762700
0.036450,0.017600,0.182550,0.763400
0.035400,0.018100,0.182000,0.764500
0.036200,0.017800,0.180650,0.765350
0.036550,0.017300,0.181300,0.764850
0.037250,0.017400,0.181500,0.763850
0.037050,0.018700,0.179600,0.764650
0.036600,0.019600,0.178100,0.765700
0.037000,0.019900,0.176950,0.766150
0.038150,0.018600,0.176400,0.766850
0.037300,0.018400,0.176150,0.768150
0.036400,0.018250,0.176050,0.769300
0.036650,0.017800,0.176900,0.768650
0.035750,0.018050,0.177650,0.768550
0.035150,0.018750,0.176500,0.769600
0.035400,0.018650,0.176600,0.769350
0.036650,0.018100,0.175450,0.769800
0.036550,0.017650,0.175300,0.770500
0.037800,0.017450,0.176650,0.768100
0.036100,0.016500,0.178700,0.768700
0.034250,0.017150,0.178500,0.770100
0.034850,0.016850,0.178750,0.769550
0.035000,0.017050,0.180300,0.767650
0.034950,0.017900,0.180200,0.766950
0.034400,0.017350,0.180800,0.767450
0.034400,0.016900,0.181600,0.767100
0.034700,0.016650,0.181900,0.766750
0.034350,0.016750,0.181850,0.767050
0.032800,0.016900,0.182350,0.767950
0.034600,0.015800,0.184100,0.765500
0.035000,0.015400,0.183650,0.765950
0.035050,0.015900,0.183650,0.765400
0.034900,0.015550,0.184050,0.765500
0.032700,0.016900,0.182850,0.767550
0.032850,0.016550,0.183400,0.767200
0.032450,0.017350,0.182700,0.767500
0.033700,0.017300,0.182100,0.766900
0.033900,0.016400,0.183000,0.766700
0.033600,0.016300,0.183150,0.766950
0.033700,0.015850,0.183050,0.767400
0.033550,0.016300,0.182850,0.767300
0.032900,0.015700,0.183600,0.767800
0.032650,0.016250,0.184550,0.766550
0.033200,0.015950,0.184500,0.766350
0.032800,0.016900,0.183950,0.766350
0.033200,0.016600,0.183750,0.766450
0.033500,0.017000,0.184050,0.765450
0.033300,0.017350,0.184550,0.764800
0.032850,0.017100,0.184100,0.765950
0.033650,0.015150,0.186400,0.764800
0.033150,0.015600,0.187550,0.763700
0.033850,0.014350,0.187950,0.763850
0.032650,0.016000,0.187150,0.764200
0.033100,0.015950,0.187500,0.763450
0.033200,0.016100,0.187650,0.763050
0.032800,0.016200,0.188550,0.762450
0.032250,0.017200,0.188800,0.761750
0.033250,0.015950,0.190200,0.760600
0.032650,0.015350,0.192250,0.759750
0.032000,0.016050,0.192350,0.759600
0.031550,0.016000,0.193350,0.759100
0.031250,0.017350,0.193300,0.758100
0.031450,0.017450,0.193700,0.757400
0.032300,0.016650,0.194150,0.756900
0.031800,0.016650,0.194900,0.756650
0.032450,0.015900,0.195100,0.756550
0.033600,0.015900,0.194550,0.755950
0.032500,0.015950,0.194950,0.756600
0.032800,0.016250,0.195650,0.755300
0.032800,0.015950,0.196350,0.754900
0.033250,0.017050,0.195500,0.754200
0.034450,0.016600,0.196750,0.752200
0.035050,0.016650,0.196850,0.751450
0.034650,0.017150,0.196500,0.751700
0.034300,0.018050,0.195700,0.751950
0.034700,0.018900,0.195550,0.750850
0.036250,0.017150,0.195200,0.751400
0.036400,0.018500,0.195050,0.750050
0.036350,0.017700,0.195450,0.750500
0.035200,0.019200,0.194450,0.751150
0.035850,0.018300,0.195450,0.750400
0.036350,0.017800,0.194850,0.751000
0.037300,0.017950,0.194300,0.750450
0.037400,0.018650,0.193300,0.750650
0.037450,0.018500,0.192900,0.751150
0.037900,0.018200,0.192050,0.751850
0.038350,0.018800,0.191300,0.751550
0.038350,0.018100,0.191500,0.752050
0.038200,0.018950,0.190050,0.752800
0.038400,0.018950,0.190400,0.752250
0.038850,0.019800,0.189250,0.752100
0.039850,0.020600,0.188700,0.750850
0.039500,0.020200,0.187750,0.752550
0.040350,0.019650,0.186900,0.753100
0.040250,0.019500,0.186500,0.753750
0.039850,0.021400,0.184550,0.754200
0.040500,0.020250,0.183700,0.755550
0.040550,0.020500,0.182550,0.756400
0.039900,0.019800,0.183350,0.756950
0.039900,0.019600,0.182950,0.757550
0.040150,0.020050,0.183000,0.756800
0.040300,0.019850,0.182650,0.757200
0.041200,0.019450,0.182150,0.757200
0.041800,0.019100,0.182400,0.756700
0.040550,0.020050,0.180750,0.758650
0.039900,0.021350,0.179200,0.759550
0.040750,0.020050,0.178200,0.761000
0.039200,0.020950,0.177650,0.762200
0.040300,0.019950,0.176950,0.762800
0.040050,0.020300,0.175750,0.763900
0.040850,0.020000,0.173950,0.765200
0.039850,0.020250,0.173500,0.766400
0.040550,0.019700,0.172400,0.767350
0.039900,0.019300,0.172350,0.768450
0.039350,0.019350,0.172000,0.769300
0.039100,0.019000,0.171700,0.770200
0.038650,0.019050,0.172500,0.769800
0.039200,0.017150,0.173950,0.769700
0.038500,0.017000,0.174250,0.770250
0.038100,0.017800,0.173550,0.770550
0.037650,0.017400,0.174150,0.770800
0.037550,0.018000,0.173900,0.770550
0.037650,0.017350,0.173100,0.771900
0.037650,0.017100,0.172450,0.772800
0.037750,0.015550,0.173400,0.773300
0.036200,0.015250,0.174100,0.774450
0.035700,0.014850,0.174750,0.774700
0.035150,0.014750,0.176150,0.773950
0.033700,0.015300,0.175800,0.775200
0.033450,0.015350,0.176400,0.774800
0.034200,0.015850,0.176550,0.773400
0.034500,0.015150,0.176150,0.774200
0.033650,0.015450,0.176650,0.774250
0.034650,0.015700,0.176800,0.772850
0.035450,0.014600,0.177350,0.772600
0.035250,0.014400,0.179250,0.771100
0.034950,0.014650,0.180350,0.770050
0.034050,0.015650,0.179450,0.770850
0.033200,0.016550,0.180400,0.769850
0.033750,0.016250,0.180850,0.769150
0.032650,0.016300,0.181700,0.769350
0.033050,0.016000,0.182050,0.768900
0.032600,0.017100,0.181350,0.768950
0.033450,0.016000,0.183100,0.767450
0.033750,0.016400,0.183450,0.766400
0.033700,0.016800,0.183800,0.765700
0.033650,0.017550,0.184050,0.764750
0.033800,0.017800,0.184200,0.764200
0.034700,0.017450,0.183150,0.764700
0.035050,0.016650,0.184400,0.763900
0.034400,0.018000,0.183800,0.763800
0.034200,0.018450,0.183050,0.764300
0.034800,0.018900,0.183200,0.763100
0.035000,0.018550,0.184000,0.762450
0.036150,0.017850,0.184150,0.761850
0.036450,0.017000,0.185150,0.761400
0.036300,0.017050,0.185050,0.761600
0.035500,0.017050,0.185050,0.762400
0.035550,0.016850,0.184850,0.762750
0.035900,0.016250,0.186100,0.761750
0.034700,0.018050,0.185050,0.762200
0.035750,0.017500,0.185350,0.761400
0.036300,0.016800,0.185350,0.761550
0.036300,0.018350,0.184350,0.761000
0.035750,0.018000,0.185350,0.760900
0.035050,0.017500,0.185950,0.761500
0.035500,0.017000,0.186000,0.761500
0.036050,0.016450,0.185600,0.761900
0.035950,0.016300,0.185050,0.762700
0.036450,0.015500,0.185500,0.762550
0.035950,0.016250,0.184750,0.763050
0.035950,0.016350,0.184500,0.763200
0.036600,0.016700,0.183050,0.763650
0.036000,0.017650,0.182800,0.763550
0.035100,0.017650,0.182700,0.764550
