I,E,S,R
0.001000,0.001100,0.997900,0.000000
0.001200,0.001850,0.996800,0.000150
0.001700,0.002100,0.995900,0.000300
0.002000,0.003400,0.994000,0.000600
0.003100,0.004050,0.992200,0.000650
0.003800,0.006200,0.989050,0.000950
0.004850,0.007800,0.985800,0.001550
0.005950,0.010250,0.981400,0.002400
0.008300,0.011850,0.976750,0.003100
0.011150,0.014600,0.970150,0.004100
0.013600,0.019550,0.961400,0.005450
0.016650,0.025100,0.951000,0.007250
0.022550,0.032550,0.935950,0.008950
0.028550,0.042900,0.916250,0.012300
0.035450,0.056200,0.892250,0.016100
0.048150,0.068350,0.862900,0.020600
0.061250,0.084300,0.828200,0.026250
0.076450,0.104250,0.784000,0.035300
0.095850,0.126900,0.732250,0.045000
0.118900,0.150300,0.672950,0.057850
0.147000,0.176900,0.602650,0.073450
0.174100,0.199300,0.533000,0.093600
0.204800,0.221400,0.456800,0.117000
0.234750,0.234300,0.384900,0.146050
0.270550,0.239050,0.314450,0.175950
0.305550,0.231450,0.253150,0.209850
0.331500,0.224950,0.196300,0.247250
0.350050,0.208850,0.150450,0.290650
0.366450,0.182700,0.116450,0.334400
0.371350,0.160200,0.088450,0.380000
0.364600,0.140600,0.066500,0.428300
0.357150,0.118500,0.049900,0.474450
0.344150,0.096000,0.038850,0.521000
0.326950,0.076050,0.031950,0.565050
0.306100,0.062300,0.026300,0.605300
0.283550,0.049350,0.023400,0.643700
0.259650,0.039100,0.020950,0.680300
0.237050,0.031350,0.019650,0.711950
0.214350,0.024100,0.019100,0.742450
0.190400,0.019800,0.019350,0.770450
0.171600,0.015350,0.020450,0.792600
0.152850,0.013600,0.020350,0.813200
0.134000,0.011800,0.021500,0.832700
0.120400,0.011150,0.021350,0.847100
0.107650,0.008750,0.022300,0.861300
0.095750,0.008350,0.022750,0.873150
0.085450,0.007500,0.023800,0.883250
0.075800,0.006800,0.025850,0.891550
0.066800,0.006000,0.027550,0.899650
0.059250,0.005500,0.029850,0.905400
0.053350,0.004650,0.032550,0.909450
0.047000,0.004550,0.034450,0.914000
0.042950,0.004150,0.036700,0.916200
0.038500,0.004050,0.039050,0.918400
0.033500,0.004000,0.041350,0.921150
0.030350,0.003450,0.044200,0.922000
0.027400,0.003150,0.046250,0.923200
0.024650,0.003100,0.049450,0.922800
0.022400,0.003800,0.050550,0.923250
0.020250,0.003750,0.052600,0.923400
0.018550,0.003200,0.055400,0.922850
0.016350,0.002750,0.058250,0.922650
0.015600,0.002500,0.061000,0.920900
0.014050,0.002600,0.063350,0.920000
0.013450,0.002800,0.065350,0.918400
0.012200,0.002500,0.068500,0.916800
0.010500,0.002000,0.070750,0.916750
0.009850,0.001900,0.073450,0.914800
0.008700,0.001500,0.076500,0.913300
0.008150,0.001450,0.079100,0.911300
0.007400,0.001600,0.081450,0.909550
0.007250,0.001450,0.084350,0.906950
0.007000,0.001900,0.087350,0.903750
0.006200,0.001600,0.090150,0.902050
0.005500,0.001550,0.092700,0.900250
0.005100,0.001200,0.095550,0.898150
0.004750,0.001300,0.099450,0.894500
0.004200,0.001500,0.102350,0.891950
0.003800,0.001500,0.104600,0.890100
0.003750,0.001350,0.106900,0.888000
0.003400,0.001150,0.109850,0.885600
0.003300,0.001000,0.112550,0.883150
0.003050,0.000750,0.116000,0.880200
0.002650,0.000700,0.119450,0.877200
0.002350,0.000850,0.121600,0.875200
0.002450,0.000800,0.123450,0.873300
0.002550,0.000900,0.126050,0.870500
0.002050,0.000850,0.128800,0.868300
0.001900,0.000750,0.131450,0.865900
0.001800,0.000550,0.134000,0.863650
0.001750,0.000400,0.136900,0.860950
0.001500,0.000650,0.139650,0.858200
0.001550,0.000550,0.141950,0.855950
0.001550,0.000600,0.144600,0.853250
0.001450,0.000750,0.147350,0.850450
0.001600,0.000550,0.149050,0.848800
0.001700,0.000650,0.151900,0.845750
0.001300,0.000800,0.154200,0.843700
0.001450,0.000650,0.157300,0.840600
0.001600,0.000500,0.159950,0.837950
0.001750,0.000450,0.162550,0.835250
0.001850,0.000450,0.165100,0.832600
0.001600,0.000400,0.168050,0.829950
0.001450,0.000700,0.170000,0.827850
0.001300,0.000750,0.172150,0.825800
0.001200,0.000800,0.174800,0.823200
0.001100,0.000900,0.176650,0.821350
0.001000,0.000650,0.179400,0.818950
0.001200,0.000450,0.181400,0.816950
0.000950,0.000500,0.183800,0.814750
0.000750,0.000400,0.186050,0.812800
0.000850,0.000200,0.188900,0.810050
0.000900,0.000300,0.190800,0.808000
0.000850,0.000250,0.193500,0.805400
0.000750,0.000250,0.195450,0.803550
0.000750,0.000200,0.198000,0.801050
0.000750,0.000200,0.200300,0.798750
0.000800,0.000400,0.202100,0.796700
0.000600,0.000600,0.204750,0.794050
0.000600,0.000550,0.207150,0.791700
0.000600,0.000400,0.209750,0.789250
0.000800,0.000300,0.211450,0.787450
0.000600,0.000450,0.214100,0.784850
0.000800,0.000300,0.216250,0.782650
0.000750,0.000350,0.218600,0.780300
0.000650,0.000250,0.220950,0.778150
0.000650,0.000350,0.222850,0.776150
0.000600,0.000450,0.224550,0.774400
0.000400,0.000500,0.226400,0.772700
0.000550,0.000400,0.228500,0.770550
0.000600,0.000400,0.231550,0.767450
0.000650,0.000250,0.233650,0.765450
0.000650,0.000200,0.235400,0.763750
0.000650,0.000350,0.237000,0.762000
0.000700,0.000350,0.239250,0.759700
0.000600,0.000500,0.241350,0.757550
0.000650,0.000450,0.243300,0.755600
0.000700,0.000550,0.244700,0.754050
0.000750,0.000600,0.246650,0.752000
0.000800,0.000650,0.248450,0.750100
0.000850,0.000800,0.250450,0.747900
0.001000,0.000650,0.252800,0.745550
0.001050,0.000700,0.254800,0.743450
0.001050,0.000400,0.256650,0.741900
0.001050,0.000650,0.258450,0.739850
0.001200,0.000400,0.260400,0.738000
0.001250,0.000650,0.262500,0.735600
0.001250,0.000850,0.264150,0.733750
0.001400,0.000950,0.265650,0.732000
0.001300,0.001000,0.267800,0.729900
0.001500,0.001150,0.269200,0.728150
0.001550,0.000950,0.271300,0.726200
0.001700,0.000900,0.272850,0.724550
0.001500,0.001000,0.274650,0.722850
0.001300,0.000950,0.276450,0.721300
0.001200,0.000950,0.278500,0.719350
0.001450,0.000800,0.280250,0.717500
0.001400,0.000900,0.281900,0.715800
0.001450,0.001050,0.283650,0.713850
0.001600,0.001050,0.285100,0.712250
0.001750,0.000900,0.286800,0.710550
0.002000,0.001150,0.288000,0.708850
0.002000,0.001100,0.289750,0.707150
0.001900,0.001550,0.291150,0.705400
0.002250,0.001550,0.292450,0.703750
0.002250,0.002000,0.293450,0.702300
0.002800,0.001600,0.294650,0.700950
0.002800,0.002250,0.295550,0.699400
0.002800,0.002650,0.296450,0.698100
0.003500,0.002750,0.297800,0.695950
0.004000,0.002900,0.299000,0.694100
0.004050,0.003100,0.299850,0.693000
0.004450,0.003350,0.300800,0.691400
0.005000,0.003400,0.301650,0.689950
0.004950,0.003600,0.302950,0.688500
0.005950,0.003700,0.302900,0.687450
0.006300,0.003700,0.303900,0.686100
0.006500,0.004300,0.304400,0.684800
0.006700,0.004750,0.304600,0.683950
0.007050,0.005450,0.304750,0.682750
0.007400,0.005550,0.305050,0.682000
0.008150,0.005900,0.304850,0.681100
0.008450,0.006650,0.304750,0.680150
0.009350,0.007000,0.304750,0.678900
0.010250,0.006300,0.305450,0.678000
0.011050,0.006400,0.304600,0.677950
0.011000,0.007900,0.303450,0.677650
0.011300,0.008850,0.301850,0.678000
0.012850,0.008750,0.301050,0.677350
0.014000,0.009200,0.300050,0.676750
0.014600,0.010150,0.298750,0.676500
0.015150,0.010750,0.297950,0.676150
0.017000,0.010650,0.296450,0.675900
0.017700,0.011900,0.294500,0.675900
0.019550,0.012200,0.291900,0.676350
0.020650,0.013000,0.290200,0.676150
0.020750,0.014150,0.288600,0.676500
0.021600,0.015100,0.286200,0.677100
0.023000,0.016150,0.283450,0.677400
0.025500,0.015900,0.280750,0.677850
0.026850,0.016600,0.277800,0.678750
0.029550,0.017300,0.273350,0.679800
0.029850,0.019350,0.268700,0.682100
0.030650,0.020000,0.264550,0.684800
0.032100,0.019800,0.261350,0.686750
0.032950,0.019900,0.257700,0.689450
0.034350,0.021600,0.252150,0.691900
0.035800,0.021650,0.248250,0.694300
0.037750,0.022100,0.243900,0.696250
0.038200,0.023300,0.239800,0.698700
0.040300,0.022900,0.235600,0.701200
0.041400,0.023150,0.231350,0.704100
0.042450,0.023900,0.226050,0.707600
0.044200,0.024600,0.221300,0.709900
0.045350,0.025500,0.216300,0.712850
0.045350,0.026700,0.211050,0.716900
0.046300,0.027700,0.205750,0.720250
0.047500,0.027400,0.201800,0.723300
0.047500,0.026950,0.197050,0.728500
0.049100,0.025450,0.194050,0.731400
0.049500,0.025500,0.189250,0.735750
0.049950,0.025050,0.186000,0.739000
0.050150,0.024400,0.182800,0.742650
0.050250,0.024000,0.178600,0.747150
0.048650,0.025300,0.174100,0.751950
0.050300,0.024650,0.169900,0.755150
0.050250,0.023300,0.166800,0.759650
0.050400,0.022550,0.163900,0.763150
0.049650,0.022600,0.160800,0.766950
0.050150,0.021900,0.158800,0.769150
0.048800,0.022400,0.156200,0.772600
0.048350,0.023350,0.153250,0.775050
0.047250,0.022350,0.151500,0.778900
0.046700,0.022200,0.150000,0.781100
0.047200,0.021250,0.149000,0.782550
0.047000,0.020300,0.147650,0.785050
0.045900,0.018300,0.146650,0.789150
0.044950,0.018000,0.144900,0.792150
0.043400,0.018150,0.142900,0.795550
0.043100,0.017000,0.141850,0.798050
0.042800,0.017200,0.140700,0.799300
0.041750,0.016550,0.139350,0.802350
0.039600,0.017200,0.137650,0.805550
0.038350,0.016250,0.137250,0.808150
0.037450,0.015450,0.137000,0.810100
0.036050,0.015550,0.137050,0.811350
0.035250,0.014700,0.137550,0.812500
0.034550,0.013750,0.139250,0.812450
0.033400,0.014000,0.139800,0.812800
0.033300,0.013650,0.140000,0.813050
0.032150,0.013500,0.139800,0.814550
0.032150,0.013350,0.140450,0.814050
0.031750,0.013250,0.141850,0.813150
0.030900,0.012450,0.143300,0.813350
0.030650,0.011700,0.144450,0.813200
0.029500,0.011500,0.146350,0.812650
0.029050,0.011800,0.147050,0.812100
0.028150,0.011350,0.147450,0.813050
0.027150,0.010850,0.149900,0.812100
0.026800,0.010950,0.150850,0.811400
0.026250,0.010450,0.152000,0.811300
0.024450,0.011250,0.152550,0.811750
0.024650,0.010600,0.154450,0.810300
0.024250,0.010200,0.156950,0.808600
0.024750,0.009350,0.158550,0.807350
0.024500,0.010050,0.159150,0.806300
0.023250,0.010350,0.159950,0.806450
0.022400,0.010050,0.161900,0.805650
0.021150,0.010550,0.163500,0.804800
0.021650,0.010100,0.165050,0.803200
0.021300,0.009500,0.166900,0.802300
0.020750,0.009450,0.168450,0.801350
0.020150,0.009500,0.171000,0.799350
0.019550,0.008550,0.173100,0.798800
0.019600,0.009200,0.173600,0.797600
0.019400,0.008550,0.175400,0.796650
0.019800,0.008500,0.177150,0.794550
0.019750,0.008800,0.179050,0.792400
0.020100,0.008500,0.180700,0.790700
0.019850,0.008450,0.182800,0.788900
0.018950,0.009400,0.183800,0.787850
0.018150,0.009900,0.185250,0.786700
0.018150,0.010250,0.186300,0.785300
0.018350,0.010450,0.188000,0.783200
0.018700,0.009600,0.190250,0.781450
0.018250,0.010650,0.190350,0.780750
0.018850,0.008950,0.192000,0.780200
0.018950,0.008850,0.193550,0.778650
0.019050,0.008600,0.195150,0.777200
0.018900,0.009200,0.197100,0.774800
0.019200,0.010200,0.198400,0.772200
0.019300,0.009700,0.199550,0.771450
0.020100,0.009550,0.200750,0.769600
0.020150,0.010200,0.201600,0.768050
0.021000,0.010450,0.202500,0.766050
0.021800,0.010550,0.204450,0.763200
0.022750,0.010400,0.204950,0.761900
0.022050,0.010950,0.206150,0.760850
0.021450,0.010950,0.206850,0.760750
0.021750,0.011350,0.208400,0.758500
0.022400,0.011500,0.209100,0.757000
0.022850,0.011800,0.209850,0.755500
0.023450,0.011600,0.210150,0.754800
0.023150,0.012150,0.211200,0.753500
0.023350,0.012700,0.210900,0.753050
0.023650,0.012800,0.211050,0.752500
0.024200,0.011800,0.212000,0.752000
0.024350,0.011950,0.213050,0.750650
0.024050,0.012600,0.214600,0.748750
0.024200,0.013250,0.213650,0.748900
0.023850,0.014200,0.213700,0.748250
0.024950,0.013800,0.213800,0.747450
0.025800,0.013850,0.214250,0.746100
0.025700,0.014450,0.213750,0.746100
0.026650,0.013700,0.214700,0.744950
0.026300,0.013900,0.215000,0.744800
0.026850,0.013600,0.216100,0.743450
0.027000,0.013900,0.216350,0.742750
0.027400,0.014250,0.216350,0.742000
0.028500,0.013750,0.216550,0.741200
0.028500,0.013700,0.215950,0.741850
0.028700,0.014750,0.215700,0.740850
0.028550,0.016600,0.213500,0.741350
0.029800,0.015450,0.214750,0.740000
0.029900,0.016250,0.214150,0.739700
0.029300,0.016500,0.214350,0.739850
0.028900,0.016750,0.214550,0.739800
0.030200,0.016900,0.213900,0.739000
0.029950,0.018000,0.213050,0.739000
0.029550,0.018800,0.212050,0.739600
0.029600,0.018550,0.211350,0.740500
0.030150,0.018350,0.210450,0.741050
0.031150,0.016800,0.210350,0.741700
0.032200,0.016200,0.210400,0.741200
0.032450,0.016750,0.209000,0.741800
0.032350,0.017550,0.208850,0.741250
0.031800,0.018950,0.207600,0.741650
0.031600,0.020750,0.205900,0.741750
0.032650,0.020750,0.204250,0.742350
0.033250,0.020000,0.204350,0.742400
0.034400,0.019250,0.204000,0.742350
0.035050,0.019250,0.203750,0.741950
0.035950,0.018600,0.203150,0.742300
0.035250,0.019250,0.202100,0.743400
0.036600,0.018650,0.201700,0.743050
0.037900,0.018150,0.200650,0.743300
0.037700,0.020000,0.198700,0.743600
0.039000,0.020950,0.196100,0.743950
0.038750,0.020750,0.195450,0.745050
0.039700,0.020650,0.194800,0.744850
0.039950,0.021200,0.193950,0.744900
0.039400,0.020750,0.191650,0.748200
0.039250,0.019750,0.191700,0.749300
0.039700,0.019100,0.190700,0.750500
0.041550,0.020600,0.187900,0.749950
0.040800,0.021300,0.187150,0.750750
0.041250,0.021550,0.184900,0.752300
0.040800,0.021000,0.185000,0.753200
0.041300,0.020100,0.184250,0.754350
0.042600,0.018350,0.184550,0.754500
0.042600,0.018450,0.183900,0.755050
0.042000,0.020150,0.182800,0.755050
0.042150,0.020400,0.181850,0.755600
0.042150,0.020650,0.180800,0.756400
0.043300,0.019250,0.180950,0.756500
0.042050,0.019250,0.179650,0.759050
0.042450,0.019750,0.177250,0.760550
0.041550,0.020100,0.177100,0.761250
0.041550,0.019700,0.176550,0.762200
0.040550,0.019950,0.176000,0.763500
0.041250,0.019800,0.175800,0.763150
0.040750,0.019350,0.174650,0.765250
0.040850,0.018700,0.173800,0.766650
0.041100,0.019250,0.173250,0.766400
0.040100,0.019200,0.173150,0.767550
0.038850,0.018500,0.173250,0.769400
0.039750,0.017950,0.173400,0.768900
0.039850,0.017500,0.173450,0.769200
0.039850,0.016550,0.173600,0.770000
0.039500,0.016700,0.172750,0.771050
0.039000,0.016800,0.171950,0.772250
0.038850,0.017000,0.172750,0.771400
0.038100,0.016250,0.174050,0.771600
0.038650,0.016900,0.173150,0.771300
0.038450,0.017850,0.171850,0.771850
0.038800,0.018200,0.171100,0.771900
0.038700,0.017250,0.171950,0.772100
0.039000,0.017200,0.171300,0.772500
0.039150,0.016550,0.172700,0.771600
0.037900,0.017800,0.171850,0.772450
0.038100,0.018100,0.171300,0.772500
0.037350,0.018650,0.170800,0.773200
0.037400,0.018650,0.170150,0.773800
0.036650,0.019300,0.170300,0.773750
0.037800,0.018700,0.169400,0.774100
0.037700,0.018150,0.169250,0.774900
0.037350,0.017300,0.170400,0.774950
0.035800,0.016950,0.170850,0.776400
0.036000,0.017200,0.169600,0.777200
0.035500,0.017200,0.171550,0.775750
0.035600,0.018300,0.172000,0.774100
0.035150,0.018550,0.171750,0.774550
0.036000,0.016900,0.172150,0.774950
0.035900,0.016700,0.173500,0.773900
0.035700,0.017400,0.173600,0.773300
0.035700,0.017750,0.173300,0.773250
0.035900,0.017700,0.173450,0.772950
0.035450,0.017700,0.173100,0.773750
0.036450,0.016350,0.173700,0.773500
0.037150,0.016600,0.173100,0.773150
0.036650,0.016750,0.173100,0.773500
0.035200,0.017750,0.172650,0.774400
0.034400,0.017550,0.173100,0.774950
0.034150,0.018000,0.172350,0.775500
0.034900,0.016200,0.173400,0.775500
0.036200,0.015650,0.173700,0.774450
0.035700,0.016550,0.172900,0.774850
0.035650,0.016450,0.173100,0.774800
0.035800,0.015200,0.174250,0.774750
0.035500,0.015000,0.174750,0.774750
0.035200,0.015750,0.174550,0.774500
0.034450,0.015800,0.175000,0.774750
0.034000,0.015450,0.175900,0.774650
0.033350,0.016150,0.176300,0.774200
0.033750,0.015300,0.177800,0.773150
0.033750,0.015500,0.177650,0.773100
0.034000,0.015900,0.176650,0.773450
0.033200,0.015800,0.176850,0.774150
0.032300,0.016650,0.175950,0.775100
0.032450,0.016550,0.176300,0.774700
0.032400,0.016250,0.176750,0.774600
0.031700,0.016000,0.176750,0.775550
0.030400,0.016000,0.177950,0.775650
0.030150,0.016100,0.178350,0.775400
0.030800,0.015300,0.179000,0.774900
0.030050,0.015450,0.179500,0.775000
0.031000,0.015000,0.179650,0.774350
0.030900,0.014700,0.180350,0.774050
0.030950,0.014350,0.181150,0.773550
0.031600,0.014350,0.183250,0.770800
0.031750,0.014550,0.183350,0.770350
0.030450,0.015450,0.183750,0.770350
0.031600,0.014300,0.183800,0.770300
0.031100,0.015000,0.184350,0.769550
0.031600,0.015200,0.183950,0.769250
0.030900,0.014900,0.184950,0.769250
0.030450,0.015400,0.184950,0.769200
0.031450,0.015400,0.185800,0.767350
0.031500,0.015300,0.186350,0.766850
0.033300,0.015150,0.187250,0.764300
0.033050,0.016000,0.187300,0.763650
0.032450,0.015950,0.187100,0.764500
0.032350,0.016950,0.186450,0.764250
0.032700,0.016850,0.185200,0.765250
0.033750,0.016250,0.184950,0.765050
0.032850,0.017650,0.183450,0.766050
0.033150,0.016500,0.184450,0.765900
0.033800,0.015500,0.184550,0.766150
0.033100,0.016950,0.183900,0.766050
0.032700,0.017350,0.184000,0.765950
0.032850,0.016900,0.183500,0.766750
0.032350,0.016450,0.184650,0.766550
0.032650,0.017300,0.184000,0.766050
0.033600,0.016450,0.184550,0.765400
0.033500,0.016500,0.184650,0.765350
0.033750,0.015900,0.185150,0.765200
0.033250,0.016850,0.184650,0.765250
0.033500,0.016850,0.184400,0.765250
0.032900,0.016750,0.185200,0.765150
0.033800,0.015850,0.185800,0.764550
0.033450,0.016100,0.185400,0.765050
0.033900,0.015500,0.186350,0.764250
0.034900,0.015150,0.186350,0.763600
0.033850,0.016150,0.185900,0.764100
0.033300,0.017000,0.186050,0.763650
0.034350,0.016600,0.185100,0.763950
0.034550,0.016700,0.185300,0.763450
0.034100,0.017000,0.184650,0.764250
0.034550,0.017100,0.183550,0.764800
0.034500,0.017750,0.182900,0.764850
0.035650,0.017400,0.181900,0.765050
0.035050,0.018850,0.180850,0.765250
0.035150,0.018800,0.181250,0.764800
0.035750,0.018100,0.180650,0.765500
0.035150,0.017600,0.180600,0.766650
0.034050,0.018000,0.181150,0.766800
0.035150,0.017250,0.180350,0.767250
0.035250,0.017000,0.179500,0.768250
0.034950,0.017800,0.179350,0.767900
0.034050,0.017800,0.179050,0.769100
0.033850,0.017400,0.178900,0.769850
0.034150,0.017550,0.178300,0.770000
0.033800,0.017250,0.177350,0.771600
0.033350,0.017050,0.177400,0.772200
0.033100,0.016700,0.178000,0.772200
0.032650,0.016900,0.178050,0.772400
0.033000,0.017350,0.178300,0.771350
0.033450,0.016450,0.178550,0.771550
0.033000,0.016450,0.178400,0.772150
0.033150,0.017200,0.178150,0.771500
0.033350,0.016200,0.178550,0.771900
0.033050,0.016600,0.177950,0.772400
0.032550,0.016850,0.178200,0.772400
0.032800,0.016700,0.179500,0.771000
0.031750,0.017950,0.179150,0.771150
0.032250,0.017250,0.180150,0.770350
0.032400,0.016150,0.180900,0.770550
0.032350,0.017350,0.180450,0.769850
0.031800,0.018250,0.181050,0.768900
0.033100,0.017950,0.181350,0.767600
0.034600,0.017150,0.182650,0.765600
0.036350,0.016200,0.182450,0.765000
0.036050,0.016100,0.182300,0.765550
0.036200,0.016000,0.182100,0.765700
0.034400,0.017250,0.181050,0.767300
0.034100,0.017250,0.180700,0.767950
0.035100,0.017900,0.179750,0.767250
0.034700,0.018250,0.179350,0.767700
0.035850,0.017500,0.179200,0.767450
0.035850,0.018000,0.178200,0.767950
0.035400,0.017550,0.178300,0.768750
0.034400,0.018600,0.178400,0.768600
0.034650,0.018250,0.177650,0.769450
0.035200,0.017400,0.179000,0.768400
0.034600,0.017200,0.180200,0.768000
0.035200,0.017450,0.179700,0.767650
0.035850,0.016900,0.179050,0.768200
0.035700,0.016850,0.179200,0.768250
0.034850,0.017200,0.179550,0.768400
0.035900,0.017800,0.179200,0.767100
0.037150,0.016350,0.179100,0.767400
0.037500,0.015450,0.179550,0.767500
0.037600,0.016350,0.178850,0.767200
0.037100,0.018350,0.177100,0.767450
0.037150,0.018300,0.177350,0.767200
0.036650,0.018500,0.177250,0.767600
0.037900,0.017850,0.177400,0.766850
0.037650,0.018100,0.177100,0.767150
0.038250,0.018550,0.176950,0.766250
0.038800,0.018250,0.176950,0.766000
0.039800,0.018550,0.175550,0.766100
0.039150,0.019150,0.175250,0.766450
0.037950,0.019600,0.175050,0.767400
0.038450,0.018100,0.175400,0.768050
0.036950,0.018700,0.175550,0.768800
0.038500,0.018650,0.174450,0.768400
0.039950,0.018000,0.173650,0.768400
0.038900,0.018650,0.172850,0.769600
0.039150,0.019600,0.171700,0.769550
0.038700,0.018800,0.170850,0.771650
0.039200,0.017450,0.170650,0.772700
0.039350,0.017700,0.170350,0.772600
0.038000,0.017550,0.170550,0.773900
0.037550,0.018750,0.169200,0.774500
0.037150,0.019000,0.169050,0.774800
0.037450,0.018650,0.169500,0.774400
0.038000,0.018500,0.170400,0.773100
0.036600,0.018650,0.170650,0.774100
0.036450,0.017700,0.170450,0.775400
0.035750,0.017900,0.171000,0.775350
0.036600,0.016650,0.171700,0.775050
0.037150,0.016150,0.171600,0.775100
0.037450,0.014900,0.173050,0.774600
0.037650,0.014000,0.174650,0.773700
0.035450,0.014550,0.175600,0.774400
0.036350,0.014000,0.176300,0.773350
0.035900,0.014450,0.176300,0.773350
0.034000,0.016350,0.175400,0.774250
0.033150,0.015900,0.176150,0.774800
0.032300,0.016200,0.177650,0.773850
0.032200,0.014700,0.178350,0.774750
0.032600,0.013650,0.178950,0.774800
0.031750,0.014600,0.179900,0.773750
0.031250,0.015350,0.180700,0.772700
0.030600,0.015650,0.181300,0.772450
0.030600,0.014600,0.182750,0.772050
0.031550,0.013900,0.184350,0.770200
0.032050,0.015050,0.184000,0.768900
0.032450,0.015200,0.185050,0.767300
0.030850,0.015900,0.185550,0.767700
0.031550,0.015500,0.185850,0.767100
0.032000,0.015950,0.186050,0.766000
0.031750,0.016050,0.186400,0.765800
0.032500,0.014800,0.187250,0.765450
0.032500,0.014550,0.188900,0.764050
0.032450,0.014650,0.190150,0.762750
0.032150,0.016000,0.189650,0.762200
0.032450,0.015950,0.189750,0.761850
0.032550,0.015850,0.191150,0.760450
0.032150,0.015650,0.191550,0.760650
0.032950,0.014650,0.192600,0.759800
0.032750,0.014850,0.193050,0.759350
0.032650,0.015200,0.192500,0.759650
0.032550,0.015550,0.192150,0.759750
0.032100,0.017000,0.191750,0.759150
0.032000,0.017600,0.191700,0.758700
0.034400,0.016600,0.191200,0.757800
0.035200,0.016600,0.190600,0.757600
0.036450,0.016600,0.189450,0.757500
0.036400,0.017250,0.188650,0.757700
0.035800,0.017950,0.188500,0.757750
0.034600,0.018800,0.187450,0.759150
0.035750,0.019050,0.186950,0.758250
0.036800,0.019050,0.186950,0.757200
0.036200,0.018950,0.186450,0.758400
0.035350,0.019500,0.186350,0.758800
0.036250,0.018450,0.187500,0.757800
0.036850,0.018100,0.187100,0.757950
0.037200,0.018450,0.185750,0.758600
0.036100,0.018550,0.185550,0.759800
0.037050,0.018350,0.184600,0.760000
0.037350,0.018100,0.184000,0.760550
0.036550,0.018650,0.184150,0.760650
0.037150,0.018700,0.185100,0.759050
0.037550,0.018150,0.183850,0.760450
0.037300,0.018250,0.183450,0.761000
0.036650,0.017850,0.183900,0.761600
0.036700,0.017300,0.183950,0.762050
0.035650,0.018750,0.183700,0.761900
0.035850,0.017600,0.185150,0.761400
0.035500,0.017150,0.186050,0.761300
0.036350,0.017450,0.185050,0.761150
0.036000,0.017100,0.185200,0.761700
0.036600,0.016350,0.185250,0.761800
0.035950,0.016150,0.186200,0.761700
0.035550,0.016950,0.186500,0.761000
0.035000,0.017650,0.184550,0.762800
0.035250,0.017800,0.184900,0.762050
0.035150,0.017250,0.184850,0.762750
0.034800,0.017300,0.184750,0.763150
0.034350,0.017650,0.185000,0.763000
0.034450,0.018150,0.184350,0.763050
0.035050,0.017750,0.184850,0.762350
0.034750,0.017850,0.185500,0.761900
0.035950,0.017700,0.185900,0.760450
0.037700,0.017150,0.185650,0.759500
0.038300,0.016200,0.186100,0.759400
0.039200,0.016500,0.185600,0.758700
0.038850,0.016100,0.185300,0.759750
0.037100,0.017350,0.185600,0.759950
0.037350,0.016350,0.185950,0.760350
0.036550,0.016050,0.185850,0.761550
0.036550,0.016600,0.185850,0.761000
0.036200,0.016600,0.185750,0.761450
0.035900,0.016100,0.186450,0.761550
0.035750,0.016600,0.186750,0.760900
0.035950,0.016600,0.186450,0.761000
0.035800,0.017200,0.185500,0.761500
0.036500,0.016450,0.185550,0.761500
0.036100,0.017350,0.185700,0.760850
0.035400,0.018100,0.185950,0.760550
0.036500,0.017450,0.185700,0.760350
0.035800,0.018450,0.185250,0.760500
0.036500,0.018150,0.184950,0.760400
0.038300,0.017050,0.183700,0.760950
0.038600,0.018150,0.182050,0.761200
0.037950,0.019250,0.181600,0.761200
0.038400,0.018800,0.181150,0.761650
0.038200,0.019250,0.180550,0.762000
0.038650,0.020500,0.179250,0.761600
0.038750,0.021250,0.178550,0.761450
0.038950,0.021350,0.177550,0.762150
0.039700,0.020700,0.176550,0.763050
0.039450,0.020300,0.176150,0.764100
0.040350,0.020100,0.176550,0.763000
0.040500,0.018650,0.176550,0.764300
0.041000,0.018900,0.176250,0.763850
0.038900,0.019550,0.175450,0.766100
0.039350,0.018400,0.175900,0.766350
0.040000,0.017600,0.177000,0.765400
0.039600,0.017750,0.176850,0.765800
0.039250,0.018650,0.175350,0.766750
0.038700,0.018200,0.175600,0.767500
0.037950,0.018500,0.175100,0.768450
0.039350,0.018900,0.173700,0.768050
0.039550,0.018500,0.172600,0.769350
0.038050,0.018250,0.172300,0.771400
0.037400,0.017850,0.173350,0.771400
0.037300,0.018350,0.172700,0.771650
0.036950,0.018500,0.172000,0.772550
0.037100,0.017900,0.173750,0.771250
0.036800,0.018350,0.173300,0.771550
0.035950,0.016800,0.175150,0.772100
0.036050,0.016600,0.175800,0.771550
0.035500,0.016450,0.176450,0.771600
0.034100,0.017500,0.176500,0.771900
0.034800,0.016250,0.177900,0.771050
0.035700,0.015900,0.177950,0.770450
0.035700,0.016250,0.178400,0.769650
0.035650,0.016150,0.179150,0.769050
0.035450,0.015300,0.180850,0.768400
0.034300,0.017300,0.180400,0.768000
0.033950,0.017350,0.180600,0.768100
0.034400,0.017000,0.181050,0.767550
0.033500,0.017300,0.181700,0.767500
0.033650,0.016850,0.182100,0.767400
0.033850,0.017250,0.182800,0.766100
0.035300,0.016700,0.183200,0.764800
0.035200,0.017400,0.182000,0.765400
0.036400,0.016750,0.182850,0.764000
0.035400,0.017450,0.182800,0.764350
0.035150,0.018200,0.181800,0.764850
0.035200,0.018250,0.181350,0.765200
0.035750,0.017450,0.182700,0.764100
0.036150,0.016900,0.182000,0.764950
0.036100,0.017300,0.182700,0.763900
0.035500,0.017350,0.183000,0.764150
0.036300,0.016950,0.182150,0.764600
0.036100,0.016800,0.182450,0.764650
0.035500,0.017100,0.183450,0.763950
0.035900,0.017500,0.183600,0.763000
0.035950,0.017700,0.182950,0.763400
0.036350,0.017200,0.184000,0.762450
0.035900,0.017750,0.183300,0.763050
0.036750,0.017300,0.183100,0.762850
0.036300,0.017000,0.182550,0.764150
0.035850,0.017950,0.182000,0.764200
0.036350,0.018300,0.182350,0.763000
0.036950,0.019000,0.181000,0.763050
0.038050,0.018500,0.181550,0.761900
0.037100,0.020150,0.179650,0.763100
0.036800,0.020500,0.179200,0.763500
0.037750,0.019850,0.179300,0.763100
0.037100,0.019100,0.179650,0.764150
0.037200,0.017300,0.180450,0.765050
0.037300,0.017750,0.180700,0.764250
0.036450,0.017650,0.181000,0.764900
0.036050,0.018300,0.180300,0.765350
0.035950,0.018200,0.179500,0.766350
0.035350,0.017500,0.180550,0.766600
